EPICS Home

Experimental Physics and Industrial Control System


 
2002  2003  2004  2005  2006  2007  2008  2009  2010  2011  2012  2013  2014  2015  2016  2017  <20182019  2020  Index 2002  2003  2004  2005  2006  2007  2008  2009  2010  2011  2012  2013  2014  2015  2016  2017  <20182019  2020 
<== Date ==> <== Thread ==>

Subject: Build failed in Jenkins: epics-7.0 » linux64 #66
From: APS Jenkins <aps-jenkins@anl.gov>
To: core-talk@aps.anl.gov
Date: Tue, 25 Sep 2018 14:34:24 -0500 (CDT)
See <https://jenkins.aps.anl.gov/job/epics-7.0/OS=linux64/66/display/redirect?page=changes>

Changes:

[Andrew Johnson] Restore the ability to write to mbbi/mbbo *VL fields

------------------------------------------
[...truncated 1.84 MB...]
../../test/src/testPlugin.cpp:167:12: error: void value not ignored as it ought to be
     result = pvCopy->updateCopySetBitSet(pvStructureCopy,bitSet);
            ^
../../test/src/testPlugin.cpp:182:12: error: void value not ignored as it ought to be
     result = pvCopy->updateCopySetBitSet(pvStructureCopy,bitSet);
            ^
../../test/src/testPlugin.cpp: In function ‘void ignoreTest()’:
../../test/src/testPlugin.cpp:212:12: error: void value not ignored as it ought to be
     result = pvCopy->updateCopySetBitSet(pvStructureCopy,bitSet);
            ^
../../test/src/testPlugin.cpp:225:12: error: void value not ignored as it ought to be
     result = pvCopy->updateCopySetBitSet(pvStructureCopy,bitSet);
            ^
../../test/src/testPlugin.cpp:238:12: error: void value not ignored as it ought to be
     result = pvCopy->updateCopySetBitSet(pvStructureCopy,bitSet);
            ^
../../test/src/testPlugin.cpp:251:12: error: void value not ignored as it ought to be
     result = pvCopy->updateCopySetBitSet(pvStructureCopy,bitSet);
            ^
/Jenkins/jenkins/jobs/epics-7.0/workspace/OS/linux64/configure/RULES_BUILD:239: recipe for target 'testPlugin.o' failed
make[4]: *** [testPlugin.o] Error 1
make[4]: Leaving directory '/Jenkins/jenkins/jobs/epics-7.0/workspace/OS/linux64/modules/pvDatabase/test/O.linux-x86_64'
/Jenkins/jenkins/jobs/epics-7.0/workspace/OS/linux64/configure/RULES_ARCHS:58: recipe for target 'install.linux-x86_64' failed
make[3]: *** [install.linux-x86_64] Error 2
/Jenkins/jenkins/jobs/epics-7.0/workspace/OS/linux64/configure/RULES_DIRS:84: recipe for target 'test.install.linux-x86_64' failed
make[2]: *** [test.install.linux-x86_64] Error 2
../configure/RULES_DIRS:84: recipe for target 'pvDatabase.install.linux-x86_64' failed
make[1]: *** [pvDatabase.install.linux-x86_64] Error 2
make[1]: *** Waiting for unfinished jobs....
make[4]: Entering directory '/Jenkins/jenkins/jobs/epics-7.0/workspace/OS/linux64/modules/pva2pva/pdbApp/O.linux-x86_64'
/usr/bin/g++  -D_GNU_SOURCE -D_DEFAULT_SOURCE         -DUSE_TYPED_RSET -I../../common -I../../p2pApp -DFINAL_LOCATION="\"/Jenkins/jenkins/jobs/epics-7.0/workspace/OS/linux64\""   -D_X86_64_  -DUNIX  -Dlinux     -O3 -g   -Wall      -mtune=generic     -m64 -fPIC -I. -I../O.Common -I. -I. -I.. -I/Jenkins/jenkins/jobs/epics-7.0/workspace/OS/linux64/include/compiler/gcc -I/Jenkins/jenkins/jobs/epics-7.0/workspace/OS/linux64/include/os/Linux -I/Jenkins/jenkins/jobs/epics-7.0/workspace/OS/linux64/include -I/Jenkins/jenkins/jobs/epics-7.0/workspace/OS/linux64/include/compiler/gcc -I/Jenkins/jenkins/jobs/epics-7.0/workspace/OS/linux64/include/os/Linux -I/Jenkins/jenkins/jobs/epics-7.0/workspace/OS/linux64/include        -c ../pvalink_lset.cpp
make[4]: Leaving directory '/Jenkins/jenkins/jobs/epics-7.0/workspace/OS/linux64/modules/pva2pva/pdbApp/O.linux-x86_64'
make[4]: Entering directory '/Jenkins/jenkins/jobs/epics-7.0/workspace/OS/linux64/modules/pvaClient/src/O.linux-x86_64'
/usr/bin/g++  -D_GNU_SOURCE -D_DEFAULT_SOURCE           -D_X86_64_  -DUNIX  -Dlinux     -O3 -g   -Wall      -mtune=generic     -m64 -fPIC -I. -I../O.Common -I. -I. -I.. -I/Jenkins/jenkins/jobs/epics-7.0/workspace/OS/linux64/include/compiler/gcc -I/Jenkins/jenkins/jobs/epics-7.0/workspace/OS/linux64/include/os/Linux -I/Jenkins/jenkins/jobs/epics-7.0/workspace/OS/linux64/include -I/Jenkins/jenkins/jobs/epics-7.0/workspace/OS/linux64/include/compiler/gcc -I/Jenkins/jenkins/jobs/epics-7.0/workspace/OS/linux64/include/os/Linux -I/Jenkins/jenkins/jobs/epics-7.0/workspace/OS/linux64/include        -c ../pvaClientMultiPutDouble.cpp
make[4]: Leaving directory '/Jenkins/jenkins/jobs/epics-7.0/workspace/OS/linux64/modules/pvaClient/src/O.linux-x86_64'
make[4]: Entering directory '/Jenkins/jenkins/jobs/epics-7.0/workspace/OS/linux64/modules/pvaClient/src/O.linux-x86_64'
/usr/bin/g++  -D_GNU_SOURCE -D_DEFAULT_SOURCE           -D_X86_64_  -DUNIX  -Dlinux     -O3 -g   -Wall      -mtune=generic     -m64 -fPIC -I. -I../O.Common -I. -I. -I.. -I/Jenkins/jenkins/jobs/epics-7.0/workspace/OS/linux64/include/compiler/gcc -I/Jenkins/jenkins/jobs/epics-7.0/workspace/OS/linux64/include/os/Linux -I/Jenkins/jenkins/jobs/epics-7.0/workspace/OS/linux64/include -I/Jenkins/jenkins/jobs/epics-7.0/workspace/OS/linux64/include/compiler/gcc -I/Jenkins/jenkins/jobs/epics-7.0/workspace/OS/linux64/include/os/Linux -I/Jenkins/jenkins/jobs/epics-7.0/workspace/OS/linux64/include        -c ../pvaClientMultiMonitorDouble.cpp
make[4]: Leaving directory '/Jenkins/jenkins/jobs/epics-7.0/workspace/OS/linux64/modules/pvaClient/src/O.linux-x86_64'
make[4]: Entering directory '/Jenkins/jenkins/jobs/epics-7.0/workspace/OS/linux64/modules/pva2pva/pdbApp/O.linux-x86_64'
/usr/bin/g++  -D_GNU_SOURCE -D_DEFAULT_SOURCE         -DUSE_TYPED_RSET -I../../common -I../../p2pApp -DFINAL_LOCATION="\"/Jenkins/jenkins/jobs/epics-7.0/workspace/OS/linux64\""   -D_X86_64_  -DUNIX  -Dlinux     -O3 -g   -Wall      -mtune=generic     -m64 -fPIC -I. -I../O.Common -I. -I. -I.. -I/Jenkins/jenkins/jobs/epics-7.0/workspace/OS/linux64/include/compiler/gcc -I/Jenkins/jenkins/jobs/epics-7.0/workspace/OS/linux64/include/os/Linux -I/Jenkins/jenkins/jobs/epics-7.0/workspace/OS/linux64/include -I/Jenkins/jenkins/jobs/epics-7.0/workspace/OS/linux64/include/compiler/gcc -I/Jenkins/jenkins/jobs/epics-7.0/workspace/OS/linux64/include/os/Linux -I/Jenkins/jenkins/jobs/epics-7.0/workspace/OS/linux64/include        -c ../pvalink_jlif.cpp
make[4]: Leaving directory '/Jenkins/jenkins/jobs/epics-7.0/workspace/OS/linux64/modules/pva2pva/pdbApp/O.linux-x86_64'
make[4]: Entering directory '/Jenkins/jenkins/jobs/epics-7.0/workspace/OS/linux64/modules/pvaClient/src/O.linux-x86_64'
/usr/bin/g++  -D_GNU_SOURCE -D_DEFAULT_SOURCE           -D_X86_64_  -DUNIX  -Dlinux     -O3 -g   -Wall      -mtune=generic     -m64 -fPIC -I. -I../O.Common -I. -I. -I.. -I/Jenkins/jenkins/jobs/epics-7.0/workspace/OS/linux64/include/compiler/gcc -I/Jenkins/jenkins/jobs/epics-7.0/workspace/OS/linux64/include/os/Linux -I/Jenkins/jenkins/jobs/epics-7.0/workspace/OS/linux64/include -I/Jenkins/jenkins/jobs/epics-7.0/workspace/OS/linux64/include/compiler/gcc -I/Jenkins/jenkins/jobs/epics-7.0/workspace/OS/linux64/include/os/Linux -I/Jenkins/jenkins/jobs/epics-7.0/workspace/OS/linux64/include        -c ../pvaClientNTMultiPut.cpp
make[4]: Leaving directory '/Jenkins/jenkins/jobs/epics-7.0/workspace/OS/linux64/modules/pvaClient/src/O.linux-x86_64'
make[4]: Entering directory '/Jenkins/jenkins/jobs/epics-7.0/workspace/OS/linux64/modules/pvaClient/src/O.linux-x86_64'
/usr/bin/g++  -D_GNU_SOURCE -D_DEFAULT_SOURCE           -D_X86_64_  -DUNIX  -Dlinux     -O3 -g   -Wall      -mtune=generic     -m64 -fPIC -I. -I../O.Common -I. -I. -I.. -I/Jenkins/jenkins/jobs/epics-7.0/workspace/OS/linux64/include/compiler/gcc -I/Jenkins/jenkins/jobs/epics-7.0/workspace/OS/linux64/include/os/Linux -I/Jenkins/jenkins/jobs/epics-7.0/workspace/OS/linux64/include -I/Jenkins/jenkins/jobs/epics-7.0/workspace/OS/linux64/include/compiler/gcc -I/Jenkins/jenkins/jobs/epics-7.0/workspace/OS/linux64/include/os/Linux -I/Jenkins/jenkins/jobs/epics-7.0/workspace/OS/linux64/include        -c ../pvaClientNTMultiGet.cpp
make[4]: Leaving directory '/Jenkins/jenkins/jobs/epics-7.0/workspace/OS/linux64/modules/pvaClient/src/O.linux-x86_64'
make[4]: Entering directory '/Jenkins/jenkins/jobs/epics-7.0/workspace/OS/linux64/modules/pva2pva/pdbApp/O.linux-x86_64'
/usr/bin/g++  -D_GNU_SOURCE -D_DEFAULT_SOURCE         -DUSE_TYPED_RSET -I../../common -I../../p2pApp -DFINAL_LOCATION="\"/Jenkins/jenkins/jobs/epics-7.0/workspace/OS/linux64\""   -D_X86_64_  -DUNIX  -Dlinux     -O3 -g   -Wall      -mtune=generic     -m64 -fPIC -I. -I../O.Common -I. -I. -I.. -I/Jenkins/jenkins/jobs/epics-7.0/workspace/OS/linux64/include/compiler/gcc -I/Jenkins/jenkins/jobs/epics-7.0/workspace/OS/linux64/include/os/Linux -I/Jenkins/jenkins/jobs/epics-7.0/workspace/OS/linux64/include -I/Jenkins/jenkins/jobs/epics-7.0/workspace/OS/linux64/include/compiler/gcc -I/Jenkins/jenkins/jobs/epics-7.0/workspace/OS/linux64/include/os/Linux -I/Jenkins/jenkins/jobs/epics-7.0/workspace/OS/linux64/include        -c ../pvalink_link.cpp
make[4]: Leaving directory '/Jenkins/jenkins/jobs/epics-7.0/workspace/OS/linux64/modules/pva2pva/pdbApp/O.linux-x86_64'
make[4]: Entering directory '/Jenkins/jenkins/jobs/epics-7.0/workspace/OS/linux64/modules/pvaClient/src/O.linux-x86_64'
/usr/bin/g++  -D_GNU_SOURCE -D_DEFAULT_SOURCE           -D_X86_64_  -DUNIX  -Dlinux     -O3 -g   -Wall      -mtune=generic     -m64 -fPIC -I. -I../O.Common -I. -I. -I.. -I/Jenkins/jenkins/jobs/epics-7.0/workspace/OS/linux64/include/compiler/gcc -I/Jenkins/jenkins/jobs/epics-7.0/workspace/OS/linux64/include/os/Linux -I/Jenkins/jenkins/jobs/epics-7.0/workspace/OS/linux64/include -I/Jenkins/jenkins/jobs/epics-7.0/workspace/OS/linux64/include/compiler/gcc -I/Jenkins/jenkins/jobs/epics-7.0/workspace/OS/linux64/include/os/Linux -I/Jenkins/jenkins/jobs/epics-7.0/workspace/OS/linux64/include        -c ../pvaClientNTMultiMonitor.cpp
make[4]: Leaving directory '/Jenkins/jenkins/jobs/epics-7.0/workspace/OS/linux64/modules/pvaClient/src/O.linux-x86_64'
make[4]: Entering directory '/Jenkins/jenkins/jobs/epics-7.0/workspace/OS/linux64/modules/pvaClient/src/O.linux-x86_64'
/usr/bin/g++  -D_GNU_SOURCE -D_DEFAULT_SOURCE           -D_X86_64_  -DUNIX  -Dlinux     -O3 -g   -Wall      -mtune=generic     -m64 -fPIC -I. -I../O.Common -I. -I. -I.. -I/Jenkins/jenkins/jobs/epics-7.0/workspace/OS/linux64/include/compiler/gcc -I/Jenkins/jenkins/jobs/epics-7.0/workspace/OS/linux64/include/os/Linux -I/Jenkins/jenkins/jobs/epics-7.0/workspace/OS/linux64/include -I/Jenkins/jenkins/jobs/epics-7.0/workspace/OS/linux64/include/compiler/gcc -I/Jenkins/jenkins/jobs/epics-7.0/workspace/OS/linux64/include/os/Linux -I/Jenkins/jenkins/jobs/epics-7.0/workspace/OS/linux64/include        -c ../pvaClientNTMultiData.cpp
make[4]: Leaving directory '/Jenkins/jenkins/jobs/epics-7.0/workspace/OS/linux64/modules/pvaClient/src/O.linux-x86_64'
make[4]: Entering directory '/Jenkins/jenkins/jobs/epics-7.0/workspace/OS/linux64/modules/pva2pva/pdbApp/O.linux-x86_64'
/usr/bin/g++  -D_GNU_SOURCE -D_DEFAULT_SOURCE         -DUSE_TYPED_RSET -I../../common -I../../p2pApp -DFINAL_LOCATION="\"/Jenkins/jenkins/jobs/epics-7.0/workspace/OS/linux64\""   -D_X86_64_  -DUNIX  -Dlinux     -O3 -g   -Wall      -mtune=generic     -m64  -I. -I../O.Common -I. -I. -I.. -I/Jenkins/jenkins/jobs/epics-7.0/workspace/OS/linux64/include/compiler/gcc -I/Jenkins/jenkins/jobs/epics-7.0/workspace/OS/linux64/include/os/Linux -I/Jenkins/jenkins/jobs/epics-7.0/workspace/OS/linux64/include -I/Jenkins/jenkins/jobs/epics-7.0/workspace/OS/linux64/include/compiler/gcc -I/Jenkins/jenkins/jobs/epics-7.0/workspace/OS/linux64/include/os/Linux -I/Jenkins/jenkins/jobs/epics-7.0/workspace/OS/linux64/include        -c ../softMain.cpp
make[4]: Leaving directory '/Jenkins/jenkins/jobs/epics-7.0/workspace/OS/linux64/modules/pva2pva/pdbApp/O.linux-x86_64'
make[4]: Entering directory '/Jenkins/jenkins/jobs/epics-7.0/workspace/OS/linux64/modules/pva2pva/pdbApp/O.linux-x86_64'
/usr/bin/g++  -D_GNU_SOURCE -D_DEFAULT_SOURCE         -DUSE_TYPED_RSET -I../../common -I../../p2pApp -DFINAL_LOCATION="\"/Jenkins/jenkins/jobs/epics-7.0/workspace/OS/linux64\""   -D_X86_64_  -DUNIX  -Dlinux     -O3 -g   -Wall      -mtune=generic     -m64  -I. -I../O.Common -I. -I. -I.. -I/Jenkins/jenkins/jobs/epics-7.0/workspace/OS/linux64/include/compiler/gcc -I/Jenkins/jenkins/jobs/epics-7.0/workspace/OS/linux64/include/os/Linux -I/Jenkins/jenkins/jobs/epics-7.0/workspace/OS/linux64/include -I/Jenkins/jenkins/jobs/epics-7.0/workspace/OS/linux64/include/compiler/gcc -I/Jenkins/jenkins/jobs/epics-7.0/workspace/OS/linux64/include/os/Linux -I/Jenkins/jenkins/jobs/epics-7.0/workspace/OS/linux64/include        -c softIocPVA_registerRecordDeviceDriver.cpp
make[4]: Leaving directory '/Jenkins/jenkins/jobs/epics-7.0/workspace/OS/linux64/modules/pva2pva/pdbApp/O.linux-x86_64'
make[4]: Entering directory '/Jenkins/jenkins/jobs/epics-7.0/workspace/OS/linux64/modules/pvaClient/src/O.linux-x86_64'
/usr/bin/g++  -D_GNU_SOURCE -D_DEFAULT_SOURCE           -D_X86_64_  -DUNIX  -Dlinux     -O3 -g   -Wall      -mtune=generic     -m64 -fPIC -I. -I../O.Common -I. -I. -I.. -I/Jenkins/jenkins/jobs/epics-7.0/workspace/OS/linux64/include/compiler/gcc -I/Jenkins/jenkins/jobs/epics-7.0/workspace/OS/linux64/include/os/Linux -I/Jenkins/jenkins/jobs/epics-7.0/workspace/OS/linux64/include -I/Jenkins/jenkins/jobs/epics-7.0/workspace/OS/linux64/include/compiler/gcc -I/Jenkins/jenkins/jobs/epics-7.0/workspace/OS/linux64/include/os/Linux -I/Jenkins/jenkins/jobs/epics-7.0/workspace/OS/linux64/include        -c ../pvaClientRPC.cpp
make[4]: Leaving directory '/Jenkins/jenkins/jobs/epics-7.0/workspace/OS/linux64/modules/pvaClient/src/O.linux-x86_64'
make[4]: Entering directory '/Jenkins/jenkins/jobs/epics-7.0/workspace/OS/linux64/modules/pva2pva/pdbApp/O.linux-x86_64'
/usr/bin/g++  -D_GNU_SOURCE -D_DEFAULT_SOURCE         -DUSE_TYPED_RSET -I../../common -I../../p2pApp -DFINAL_LOCATION="\"/Jenkins/jenkins/jobs/epics-7.0/workspace/OS/linux64\""   -D_X86_64_  -DUNIX  -Dlinux     -O3 -g   -Wall      -mtune=generic     -m64 -fPIC -I. -I../O.Common -I. -I. -I.. -I/Jenkins/jenkins/jobs/epics-7.0/workspace/OS/linux64/include/compiler/gcc -I/Jenkins/jenkins/jobs/epics-7.0/workspace/OS/linux64/include/os/Linux -I/Jenkins/jenkins/jobs/epics-7.0/workspace/OS/linux64/include -I/Jenkins/jenkins/jobs/epics-7.0/workspace/OS/linux64/include/compiler/gcc -I/Jenkins/jenkins/jobs/epics-7.0/workspace/OS/linux64/include/os/Linux -I/Jenkins/jenkins/jobs/epics-7.0/workspace/OS/linux64/include        -c ../pvalink_channel.cpp
make[4]: Leaving directory '/Jenkins/jenkins/jobs/epics-7.0/workspace/OS/linux64/modules/pva2pva/pdbApp/O.linux-x86_64'
make[4]: Entering directory '/Jenkins/jenkins/jobs/epics-7.0/workspace/OS/linux64/modules/pvaClient/src/O.linux-x86_64'
/usr/bin/g++ -o libpvaClient.so.4.7.1 -shared -fPIC -Wl,-hlibpvaClient.so.4.7.1 -L/Jenkins/jenkins/jobs/epics-7.0/workspace/OS/linux64/lib/linux-x86_64 -Wl,-rpath,/Jenkins/jenkins/jobs/epics-7.0/workspace/OS/linux64/lib/linux-x86_64           -rdynamic -m64         pvaClient.o pvaClientPutData.o pvaClientGetData.o pvaClientMonitorData.o pvaClientChannel.o pvaClientProcess.o pvaClientGet.o pvaClientPut.o pvaClientMonitor.o pvaClientPutGet.o pvaClientMultiChannel.o pvaClientMultiGetDouble.o pvaClientMultiPutDouble.o pvaClientMultiMonitorDouble.o pvaClientNTMultiPut.o pvaClientNTMultiData.o pvaClientNTMultiGet.o pvaClientNTMultiMonitor.o pvaClientRPC.o   -lnt -lpvAccessIOC -lpvAccessCA -lpvAccess -lpvData -ldbRecStd -ldbCore -lca -lCom   -lpthread   -lreadline -lm -lrt -ldl -lgcc
make[4]: Leaving directory '/Jenkins/jenkins/jobs/epics-7.0/workspace/OS/linux64/modules/pvaClient/src/O.linux-x86_64'
make[4]: Entering directory '/Jenkins/jenkins/jobs/epics-7.0/workspace/OS/linux64/modules/pvaClient/src/O.linux-x86_64'
/usr/bin/ar -rc    libpvaClient.a     pvaClient.o pvaClientPutData.o pvaClientGetData.o pvaClientMonitorData.o pvaClientChannel.o pvaClientProcess.o pvaClientGet.o pvaClientPut.o pvaClientMonitor.o pvaClientPutGet.o pvaClientMultiChannel.o pvaClientMultiGetDouble.o pvaClientMultiPutDouble.o pvaClientMultiMonitorDouble.o pvaClientNTMultiPut.o pvaClientNTMultiData.o pvaClientNTMultiGet.o pvaClientNTMultiMonitor.o pvaClientRPC.o
/usr/bin/ranlib libpvaClient.a
make[4]: Leaving directory '/Jenkins/jenkins/jobs/epics-7.0/workspace/OS/linux64/modules/pvaClient/src/O.linux-x86_64'
make[4]: Entering directory '/Jenkins/jenkins/jobs/epics-7.0/workspace/OS/linux64/modules/pvaClient/src/O.linux-x86_64'
ln -s libpvaClient.so.4.7.1 /Jenkins/jenkins/jobs/epics-7.0/workspace/OS/linux64/lib/linux-x86_64/libpvaClient.so
make[4]: Leaving directory '/Jenkins/jenkins/jobs/epics-7.0/workspace/OS/linux64/modules/pvaClient/src/O.linux-x86_64'
make[4]: Entering directory '/Jenkins/jenkins/jobs/epics-7.0/workspace/OS/linux64/modules/pva2pva/pdbApp/O.linux-x86_64'
/usr/bin/g++ -o libqsrv.so.1.1 -shared -fPIC -Wl,-hlibqsrv.so.1.1 -L/Jenkins/jenkins/jobs/epics-7.0/workspace/OS/linux64/lib/linux-x86_64 -Wl,-rpath,/Jenkins/jenkins/jobs/epics-7.0/workspace/OS/linux64/lib/linux-x86_64           -rdynamic -m64        pvif.o qsrv.o pdb.o pdbsingle.o demo.o imagedemo.o pdbgroup.o configparse.o dbf_copy.o tpool.o pvalink.o pvalink_lset.o pvalink_jlif.o pvalink_link.o pvalink_channel.o    -lpvAccess -lpvData -ldbRecStd -ldbCore -lca -lCom   -lpthread   -lreadline -lm -lrt -ldl -lgcc
make[4]: Leaving directory '/Jenkins/jenkins/jobs/epics-7.0/workspace/OS/linux64/modules/pva2pva/pdbApp/O.linux-x86_64'
make[4]: Entering directory '/Jenkins/jenkins/jobs/epics-7.0/workspace/OS/linux64/modules/pva2pva/pdbApp/O.linux-x86_64'
ln -s libqsrv.so.1.1 /Jenkins/jenkins/jobs/epics-7.0/workspace/OS/linux64/lib/linux-x86_64/libqsrv.so
make[4]: Leaving directory '/Jenkins/jenkins/jobs/epics-7.0/workspace/OS/linux64/modules/pva2pva/pdbApp/O.linux-x86_64'
make[4]: Entering directory '/Jenkins/jenkins/jobs/epics-7.0/workspace/OS/linux64/modules/pva2pva/pdbApp/O.linux-x86_64'
/usr/bin/ar -rc    libqsrv.a    pvif.o qsrv.o pdb.o pdbsingle.o demo.o imagedemo.o pdbgroup.o configparse.o dbf_copy.o tpool.o pvalink.o pvalink_lset.o pvalink_jlif.o pvalink_link.o pvalink_channel.o 
/usr/bin/ranlib libqsrv.a
make[4]: Leaving directory '/Jenkins/jenkins/jobs/epics-7.0/workspace/OS/linux64/modules/pva2pva/pdbApp/O.linux-x86_64'
make[4]: Entering directory '/Jenkins/jenkins/jobs/epics-7.0/workspace/OS/linux64/modules/pva2pva/pdbApp/O.linux-x86_64'
/usr/bin/g++ -o softIocPVA  -L/Jenkins/jenkins/jobs/epics-7.0/workspace/OS/linux64/lib/linux-x86_64 -Wl,-rpath,/Jenkins/jenkins/jobs/epics-7.0/workspace/OS/linux64/lib/linux-x86_64           -rdynamic -m64        softMain.o softIocPVA_registerRecordDeviceDriver.o    -lqsrv -lpvAccessIOC -lpvAccessCA -lpvAccess -lpvData -ldbRecStd -ldbCore -lca -lCom   
make[4]: Leaving directory '/Jenkins/jenkins/jobs/epics-7.0/workspace/OS/linux64/modules/pva2pva/pdbApp/O.linux-x86_64'
/Jenkins/jenkins/bin/make -C ./testApp install.linux-x86_64 
make[3]: Entering directory '/Jenkins/jenkins/jobs/epics-7.0/workspace/OS/linux64/modules/pva2pva/testApp'
perl -CSD /Jenkins/jenkins/jobs/epics-7.0/workspace/OS/linux64/bin/linux-x86_64/makeMakefile.pl O.vxWorks-ppc604_long ../..
make[3]: Leaving directory '/Jenkins/jenkins/jobs/epics-7.0/workspace/OS/linux64/modules/pva2pva/testApp'
make[3]: Entering directory '/Jenkins/jenkins/jobs/epics-7.0/workspace/OS/linux64/modules/pva2pva/testApp'
perl -CSD /Jenkins/jenkins/jobs/epics-7.0/workspace/OS/linux64/bin/linux-x86_64/makeMakefile.pl O.vxWorks-ppc32 ../..
make[3]: Leaving directory '/Jenkins/jenkins/jobs/epics-7.0/workspace/OS/linux64/modules/pva2pva/testApp'
make[3]: Entering directory '/Jenkins/jenkins/jobs/epics-7.0/workspace/OS/linux64/modules/pva2pva/testApp'
perl -CSD /Jenkins/jenkins/jobs/epics-7.0/workspace/OS/linux64/bin/linux-x86_64/makeMakefile.pl O.vxWorks-ppc32sf ../..
make[3]: Leaving directory '/Jenkins/jenkins/jobs/epics-7.0/workspace/OS/linux64/modules/pva2pva/testApp'
make[3]: Entering directory '/Jenkins/jenkins/jobs/epics-7.0/workspace/OS/linux64/modules/pva2pva/testApp'
mkdir -p O.Common
make[3]: Leaving directory '/Jenkins/jenkins/jobs/epics-7.0/workspace/OS/linux64/modules/pva2pva/testApp'
make[3]: Entering directory '/Jenkins/jenkins/jobs/epics-7.0/workspace/OS/linux64/modules/pva2pva/testApp'
perl -CSD /Jenkins/jenkins/jobs/epics-7.0/workspace/OS/linux64/bin/linux-x86_64/makeMakefile.pl O.RTEMS-uC5282 ../..
make[3]: Leaving directory '/Jenkins/jenkins/jobs/epics-7.0/workspace/OS/linux64/modules/pva2pva/testApp'
make[3]: Entering directory '/Jenkins/jenkins/jobs/epics-7.0/workspace/OS/linux64/modules/pva2pva/testApp'
perl -CSD /Jenkins/jenkins/jobs/epics-7.0/workspace/OS/linux64/bin/linux-x86_64/makeMakefile.pl O.linux-x86_64 ../..
make[3]: Leaving directory '/Jenkins/jenkins/jobs/epics-7.0/workspace/OS/linux64/modules/pva2pva/testApp'
/Jenkins/jenkins/bin/make -C O.linux-x86_64 -f ../Makefile TOP=../.. \
    T_A=linux-x86_64 install
make[4]: Entering directory '/Jenkins/jenkins/jobs/epics-7.0/workspace/OS/linux64/modules/pva2pva/testApp/O.linux-x86_64'
/usr/bin/g++  -D_GNU_SOURCE -D_DEFAULT_SOURCE         -DUSE_TYPED_RSET -I../../pdbApp -I../../p2pApp -I../../common   -D_X86_64_  -DUNIX  -Dlinux     -O3 -g   -Wall      -mtune=generic     -m64  -I. -I../O.Common -I. -I. -I.. -I/Jenkins/jenkins/jobs/epics-7.0/workspace/OS/linux64/include/compiler/gcc -I/Jenkins/jenkins/jobs/epics-7.0/workspace/OS/linux64/include/os/Linux -I/Jenkins/jenkins/jobs/epics-7.0/workspace/OS/linux64/include -I/Jenkins/jenkins/jobs/epics-7.0/workspace/OS/linux64/include/compiler/gcc -I/Jenkins/jenkins/jobs/epics-7.0/workspace/OS/linux64/include/os/Linux -I/Jenkins/jenkins/jobs/epics-7.0/workspace/OS/linux64/include        -MM -MF check_consist.d  ../check_consist.cpp
make[4]: Leaving directory '/Jenkins/jenkins/jobs/epics-7.0/workspace/OS/linux64/modules/pva2pva/testApp/O.linux-x86_64'
make[4]: Entering directory '/Jenkins/jenkins/jobs/epics-7.0/workspace/OS/linux64/modules/pva2pva/testApp/O.linux-x86_64'
/usr/bin/g++  -D_GNU_SOURCE -D_DEFAULT_SOURCE         -DUSE_TYPED_RSET -I../../pdbApp -I../../p2pApp -I../../common   -D_X86_64_  -DUNIX  -Dlinux     -O3 -g   -Wall      -mtune=generic     -m64  -I. -I../O.Common -I. -I. -I.. -I/Jenkins/jenkins/jobs/epics-7.0/workspace/OS/linux64/include/compiler/gcc -I/Jenkins/jenkins/jobs/epics-7.0/workspace/OS/linux64/include/os/Linux -I/Jenkins/jenkins/jobs/epics-7.0/workspace/OS/linux64/include -I/Jenkins/jenkins/jobs/epics-7.0/workspace/OS/linux64/include/compiler/gcc -I/Jenkins/jenkins/jobs/epics-7.0/workspace/OS/linux64/include/os/Linux -I/Jenkins/jenkins/jobs/epics-7.0/workspace/OS/linux64/include        -MM -MF testdbf_copy.d  ../testdbf_copy.cpp
make[4]: Leaving directory '/Jenkins/jenkins/jobs/epics-7.0/workspace/OS/linux64/modules/pva2pva/testApp/O.linux-x86_64'
make[4]: Entering directory '/Jenkins/jenkins/jobs/epics-7.0/workspace/OS/linux64/modules/pva2pva/testApp/O.linux-x86_64'
/usr/bin/g++  -D_GNU_SOURCE -D_DEFAULT_SOURCE         -DUSE_TYPED_RSET -I../../pdbApp -I../../p2pApp -I../../common   -D_X86_64_  -DUNIX  -Dlinux     -O3 -g   -Wall      -mtune=generic     -m64  -I. -I../O.Common -I. -I. -I.. -I/Jenkins/jenkins/jobs/epics-7.0/workspace/OS/linux64/include/compiler/gcc -I/Jenkins/jenkins/jobs/epics-7.0/workspace/OS/linux64/include/os/Linux -I/Jenkins/jenkins/jobs/epics-7.0/workspace/OS/linux64/include -I/Jenkins/jenkins/jobs/epics-7.0/workspace/OS/linux64/include/compiler/gcc -I/Jenkins/jenkins/jobs/epics-7.0/workspace/OS/linux64/include/os/Linux -I/Jenkins/jenkins/jobs/epics-7.0/workspace/OS/linux64/include        -MM -MF testgroupconfig.d  ../testgroupconfig.cpp
make[4]: Leaving directory '/Jenkins/jenkins/jobs/epics-7.0/workspace/OS/linux64/modules/pva2pva/testApp/O.linux-x86_64'
make[4]: Entering directory '/Jenkins/jenkins/jobs/epics-7.0/workspace/OS/linux64/modules/pva2pva/testApp/O.linux-x86_64'
/usr/bin/g++  -D_GNU_SOURCE -D_DEFAULT_SOURCE         -DUSE_TYPED_RSET -I../../pdbApp -I../../p2pApp -I../../common   -D_X86_64_  -DUNIX  -Dlinux     -O3 -g   -Wall      -mtune=generic     -m64  -I. -I../O.Common -I. -I. -I.. -I/Jenkins/jenkins/jobs/epics-7.0/workspace/OS/linux64/include/compiler/gcc -I/Jenkins/jenkins/jobs/epics-7.0/workspace/OS/linux64/include/os/Linux -I/Jenkins/jenkins/jobs/epics-7.0/workspace/OS/linux64/include -I/Jenkins/jenkins/jobs/epics-7.0/workspace/OS/linux64/include/compiler/gcc -I/Jenkins/jenkins/jobs/epics-7.0/workspace/OS/linux64/include/os/Linux -I/Jenkins/jenkins/jobs/epics-7.0/workspace/OS/linux64/include        -MM -MF testpvalink.d  ../testpvalink.cpp
make[4]: Leaving directory '/Jenkins/jenkins/jobs/epics-7.0/workspace/OS/linux64/modules/pva2pva/testApp/O.linux-x86_64'
make[4]: Entering directory '/Jenkins/jenkins/jobs/epics-7.0/workspace/OS/linux64/modules/pva2pva/testApp/O.linux-x86_64'
/usr/bin/g++  -D_GNU_SOURCE -D_DEFAULT_SOURCE         -DUSE_TYPED_RSET -I../../pdbApp -I../../p2pApp -I../../common   -D_X86_64_  -DUNIX  -Dlinux     -O3 -g   -Wall      -mtune=generic     -m64  -I. -I../O.Common -I. -I. -I.. -I/Jenkins/jenkins/jobs/epics-7.0/workspace/OS/linux64/include/compiler/gcc -I/Jenkins/jenkins/jobs/epics-7.0/workspace/OS/linux64/include/os/Linux -I/Jenkins/jenkins/jobs/epics-7.0/workspace/OS/linux64/include -I/Jenkins/jenkins/jobs/epics-7.0/workspace/OS/linux64/include/compiler/gcc -I/Jenkins/jenkins/jobs/epics-7.0/workspace/OS/linux64/include/os/Linux -I/Jenkins/jenkins/jobs/epics-7.0/workspace/OS/linux64/include        -MM -MF testpdb.d  ../testpdb.cpp
make[4]: Leaving directory '/Jenkins/jenkins/jobs/epics-7.0/workspace/OS/linux64/modules/pva2pva/testApp/O.linux-x86_64'
make[4]: Entering directory '/Jenkins/jenkins/jobs/epics-7.0/workspace/OS/linux64/modules/pva2pva/testApp/O.linux-x86_64'
/usr/bin/g++  -D_GNU_SOURCE -D_DEFAULT_SOURCE         -DUSE_TYPED_RSET -I../../pdbApp -I../../p2pApp -I../../common   -D_X86_64_  -DUNIX  -Dlinux     -O3 -g   -Wall      -mtune=generic     -m64  -I. -I../O.Common -I. -I. -I.. -I/Jenkins/jenkins/jobs/epics-7.0/workspace/OS/linux64/include/compiler/gcc -I/Jenkins/jenkins/jobs/epics-7.0/workspace/OS/linux64/include/os/Linux -I/Jenkins/jenkins/jobs/epics-7.0/workspace/OS/linux64/include -I/Jenkins/jenkins/jobs/epics-7.0/workspace/OS/linux64/include/compiler/gcc -I/Jenkins/jenkins/jobs/epics-7.0/workspace/OS/linux64/include/os/Linux -I/Jenkins/jenkins/jobs/epics-7.0/workspace/OS/linux64/include        -MM -MF testpvif.d  ../testpvif.cpp
make[4]: Leaving directory '/Jenkins/jenkins/jobs/epics-7.0/workspace/OS/linux64/modules/pva2pva/testApp/O.linux-x86_64'
make[4]: Entering directory '/Jenkins/jenkins/jobs/epics-7.0/workspace/OS/linux64/modules/pva2pva/testApp/O.linux-x86_64'
/usr/bin/g++  -D_GNU_SOURCE -D_DEFAULT_SOURCE         -DUSE_TYPED_RSET -I../../pdbApp -I../../p2pApp -I../../common   -D_X86_64_  -DUNIX  -Dlinux     -O3 -g   -Wall      -mtune=generic     -m64  -I. -I../O.Common -I. -I. -I.. -I/Jenkins/jenkins/jobs/epics-7.0/workspace/OS/linux64/include/compiler/gcc -I/Jenkins/jenkins/jobs/epics-7.0/workspace/OS/linux64/include/os/Linux -I/Jenkins/jenkins/jobs/epics-7.0/workspace/OS/linux64/include -I/Jenkins/jenkins/jobs/epics-7.0/workspace/OS/linux64/include/compiler/gcc -I/Jenkins/jenkins/jobs/epics-7.0/workspace/OS/linux64/include/os/Linux -I/Jenkins/jenkins/jobs/epics-7.0/workspace/OS/linux64/include        -MM -MF testtest.d  ../testtest.cpp
make[4]: Leaving directory '/Jenkins/jenkins/jobs/epics-7.0/workspace/OS/linux64/modules/pva2pva/testApp/O.linux-x86_64'
make[4]: Entering directory '/Jenkins/jenkins/jobs/epics-7.0/workspace/OS/linux64/modules/pva2pva/testApp/O.linux-x86_64'
/usr/bin/g++  -D_GNU_SOURCE -D_DEFAULT_SOURCE         -DUSE_TYPED_RSET -I../../pdbApp -I../../p2pApp -I../../common   -D_X86_64_  -DUNIX  -Dlinux     -O3 -g   -Wall      -mtune=generic     -m64  -I. -I../O.Common -I. -I. -I.. -I/Jenkins/jenkins/jobs/epics-7.0/workspace/OS/linux64/include/compiler/gcc -I/Jenkins/jenkins/jobs/epics-7.0/workspace/OS/linux64/include/os/Linux -I/Jenkins/jenkins/jobs/epics-7.0/workspace/OS/linux64/include -I/Jenkins/jenkins/jobs/epics-7.0/workspace/OS/linux64/include/compiler/gcc -I/Jenkins/jenkins/jobs/epics-7.0/workspace/OS/linux64/include/os/Linux -I/Jenkins/jenkins/jobs/epics-7.0/workspace/OS/linux64/include        -MM -MF testweak.d  ../testweak.cpp
make[4]: Leaving directory '/Jenkins/jenkins/jobs/epics-7.0/workspace/OS/linux64/modules/pva2pva/testApp/O.linux-x86_64'
make[4]: Entering directory '/Jenkins/jenkins/jobs/epics-7.0/workspace/OS/linux64/modules/pva2pva/testApp/O.linux-x86_64'
perl -CSD /Jenkins/jenkins/jobs/epics-7.0/workspace/OS/linux64/bin/linux-x86_64/dbdExpand.pl   -I. -I.. -I../O.Common -I/Jenkins/jenkins/jobs/epics-7.0/workspace/OS/linux64/dbd -I/Jenkins/jenkins/jobs/epics-7.0/workspace/OS/linux64/dbd -o pvaLinkTestIoc.dbd base.dbd qsrv.dbd
make[4]: Leaving directory '/Jenkins/jenkins/jobs/epics-7.0/workspace/OS/linux64/modules/pva2pva/testApp/O.linux-x86_64'
make[4]: Entering directory '/Jenkins/jenkins/jobs/epics-7.0/workspace/OS/linux64/modules/pva2pva/testApp/O.linux-x86_64'
/usr/bin/g++  -D_GNU_SOURCE -D_DEFAULT_SOURCE         -DUSE_TYPED_RSET -I../../pdbApp -I../../p2pApp -I../../common   -D_X86_64_  -DUNIX  -Dlinux     -O3 -g   -Wall      -mtune=generic     -m64  -I. -I../O.Common -I. -I. -I.. -I/Jenkins/jenkins/jobs/epics-7.0/workspace/OS/linux64/include/compiler/gcc -I/Jenkins/jenkins/jobs/epics-7.0/workspace/OS/linux64/include/os/Linux -I/Jenkins/jenkins/jobs/epics-7.0/workspace/OS/linux64/include -I/Jenkins/jenkins/jobs/epics-7.0/workspace/OS/linux64/include/compiler/gcc -I/Jenkins/jenkins/jobs/epics-7.0/workspace/OS/linux64/include/os/Linux -I/Jenkins/jenkins/jobs/epics-7.0/workspace/OS/linux64/include        -MM -MF utilitiesx.d  ../utilitiesx.cpp
make[4]: Leaving directory '/Jenkins/jenkins/jobs/epics-7.0/workspace/OS/linux64/modules/pva2pva/testApp/O.linux-x86_64'
make[4]: Entering directory '/Jenkins/jenkins/jobs/epics-7.0/workspace/OS/linux64/modules/pva2pva/testApp/O.linux-x86_64'
perl -CSD /Jenkins/jenkins/jobs/epics-7.0/workspace/OS/linux64/bin/linux-x86_64/dbdExpand.pl   -I. -I.. -I../O.Common -I/Jenkins/jenkins/jobs/epics-7.0/workspace/OS/linux64/dbd -I/Jenkins/jenkins/jobs/epics-7.0/workspace/OS/linux64/dbd -o p2pTestIoc.dbd base.dbd
make[4]: Leaving directory '/Jenkins/jenkins/jobs/epics-7.0/workspace/OS/linux64/modules/pva2pva/testApp/O.linux-x86_64'
make[4]: Entering directory '/Jenkins/jenkins/jobs/epics-7.0/workspace/OS/linux64/modules/pva2pva/testApp/O.linux-x86_64'
perl -CSD /Jenkins/jenkins/jobs/epics-7.0/workspace/OS/linux64/bin/linux-x86_64/registerRecordDeviceDriver.pl   -I. -I.. -I../O.Common -I/Jenkins/jenkins/jobs/epics-7.0/workspace/OS/linux64/dbd -I/Jenkins/jenkins/jobs/epics-7.0/workspace/OS/linux64/dbd    -o pvaLinkTestIoc_registerRecordDeviceDriver.cpp ../O.Common/pvaLinkTestIoc.dbd pvaLinkTestIoc_registerRecordDeviceDriver /Jenkins/jenkins/jobs/epics-7.0/workspace/OS/linux64
make[4]: Leaving directory '/Jenkins/jenkins/jobs/epics-7.0/workspace/OS/linux64/modules/pva2pva/testApp/O.linux-x86_64'
make[4]: Entering directory '/Jenkins/jenkins/jobs/epics-7.0/workspace/OS/linux64/modules/pva2pva/testApp/O.linux-x86_64'
/usr/bin/g++  -D_GNU_SOURCE -D_DEFAULT_SOURCE         -DUSE_TYPED_RSET -I../../pdbApp -I../../p2pApp -I../../common   -D_X86_64_  -DUNIX  -Dlinux     -O3 -g   -Wall      -mtune=generic     -m64  -I. -I../O.Common -I. -I. -I.. -I/Jenkins/jenkins/jobs/epics-7.0/workspace/OS/linux64/include/compiler/gcc -I/Jenkins/jenkins/jobs/epics-7.0/workspace/OS/linux64/include/os/Linux -I/Jenkins/jenkins/jobs/epics-7.0/workspace/OS/linux64/include -I/Jenkins/jenkins/jobs/epics-7.0/workspace/OS/linux64/include/compiler/gcc -I/Jenkins/jenkins/jobs/epics-7.0/workspace/OS/linux64/include/os/Linux -I/Jenkins/jenkins/jobs/epics-7.0/workspace/OS/linux64/include        -MM -MF pvaLinkTestIoc_registerRecordDeviceDriver.d  pvaLinkTestIoc_registerRecordDeviceDriver.cpp
make[4]: Leaving directory '/Jenkins/jenkins/jobs/epics-7.0/workspace/OS/linux64/modules/pva2pva/testApp/O.linux-x86_64'
make[4]: Entering directory '/Jenkins/jenkins/jobs/epics-7.0/workspace/OS/linux64/modules/pva2pva/testApp/O.linux-x86_64'
perl -CSD /Jenkins/jenkins/jobs/epics-7.0/workspace/OS/linux64/bin/linux-x86_64/registerRecordDeviceDriver.pl   -I. -I.. -I../O.Common -I/Jenkins/jenkins/jobs/epics-7.0/workspace/OS/linux64/dbd -I/Jenkins/jenkins/jobs/epics-7.0/workspace/OS/linux64/dbd    -o p2pTestIoc_registerRecordDeviceDriver.cpp ../O.Common/p2pTestIoc.dbd p2pTestIoc_registerRecordDeviceDriver /Jenkins/jenkins/jobs/epics-7.0/workspace/OS/linux64
make[4]: Leaving directory '/Jenkins/jenkins/jobs/epics-7.0/workspace/OS/linux64/modules/pva2pva/testApp/O.linux-x86_64'
make[4]: Entering directory '/Jenkins/jenkins/jobs/epics-7.0/workspace/OS/linux64/modules/pva2pva/testApp/O.linux-x86_64'
/usr/bin/g++  -D_GNU_SOURCE -D_DEFAULT_SOURCE         -DUSE_TYPED_RSET -I../../pdbApp -I../../p2pApp -I../../common   -D_X86_64_  -DUNIX  -Dlinux     -O3 -g   -Wall      -mtune=generic     -m64  -I. -I../O.Common -I. -I. -I.. -I/Jenkins/jenkins/jobs/epics-7.0/workspace/OS/linux64/include/compiler/gcc -I/Jenkins/jenkins/jobs/epics-7.0/workspace/OS/linux64/include/os/Linux -I/Jenkins/jenkins/jobs/epics-7.0/workspace/OS/linux64/include -I/Jenkins/jenkins/jobs/epics-7.0/workspace/OS/linux64/include/compiler/gcc -I/Jenkins/jenkins/jobs/epics-7.0/workspace/OS/linux64/include/os/Linux -I/Jenkins/jenkins/jobs/epics-7.0/workspace/OS/linux64/include        -MM -MF p2pTestIoc_registerRecordDeviceDriver.d  p2pTestIoc_registerRecordDeviceDriver.cpp
make[4]: Leaving directory '/Jenkins/jenkins/jobs/epics-7.0/workspace/OS/linux64/modules/pva2pva/testApp/O.linux-x86_64'
make[4]: Entering directory '/Jenkins/jenkins/jobs/epics-7.0/workspace/OS/linux64/modules/pva2pva/testApp/O.linux-x86_64'
/usr/bin/g++  -D_GNU_SOURCE -D_DEFAULT_SOURCE         -DUSE_TYPED_RSET -I../../pdbApp -I../../p2pApp -I../../common   -D_X86_64_  -DUNIX  -Dlinux     -O3 -g   -Wall      -mtune=generic     -m64  -I. -I../O.Common -I. -I. -I.. -I/Jenkins/jenkins/jobs/epics-7.0/workspace/OS/linux64/include/compiler/gcc -I/Jenkins/jenkins/jobs/epics-7.0/workspace/OS/linux64/include/os/Linux -I/Jenkins/jenkins/jobs/epics-7.0/workspace/OS/linux64/include -I/Jenkins/jenkins/jobs/epics-7.0/workspace/OS/linux64/include/compiler/gcc -I/Jenkins/jenkins/jobs/epics-7.0/workspace/OS/linux64/include/os/Linux -I/Jenkins/jenkins/jobs/epics-7.0/workspace/OS/linux64/include        -c ../testtest.cpp
make[4]: Leaving directory '/Jenkins/jenkins/jobs/epics-7.0/workspace/OS/linux64/modules/pva2pva/testApp/O.linux-x86_64'
make[4]: Entering directory '/Jenkins/jenkins/jobs/epics-7.0/workspace/OS/linux64/modules/pva2pva/testApp/O.linux-x86_64'
/usr/bin/g++  -D_GNU_SOURCE -D_DEFAULT_SOURCE         -DUSE_TYPED_RSET -I../../pdbApp -I../../p2pApp -I../../common   -D_X86_64_  -DUNIX  -Dlinux     -O3 -g   -Wall      -mtune=generic     -m64  -I. -I../O.Common -I. -I. -I.. -I/Jenkins/jenkins/jobs/epics-7.0/workspace/OS/linux64/include/compiler/gcc -I/Jenkins/jenkins/jobs/epics-7.0/workspace/OS/linux64/include/os/Linux -I/Jenkins/jenkins/jobs/epics-7.0/workspace/OS/linux64/include -I/Jenkins/jenkins/jobs/epics-7.0/workspace/OS/linux64/include/compiler/gcc -I/Jenkins/jenkins/jobs/epics-7.0/workspace/OS/linux64/include/os/Linux -I/Jenkins/jenkins/jobs/epics-7.0/workspace/OS/linux64/include        -c ../check_consist.cpp
make[4]: Leaving directory '/Jenkins/jenkins/jobs/epics-7.0/workspace/OS/linux64/modules/pva2pva/testApp/O.linux-x86_64'
make[4]: Entering directory '/Jenkins/jenkins/jobs/epics-7.0/workspace/OS/linux64/modules/pva2pva/testApp/O.linux-x86_64'
/usr/bin/g++  -D_GNU_SOURCE -D_DEFAULT_SOURCE         -DUSE_TYPED_RSET -I../../pdbApp -I../../p2pApp -I../../common   -D_X86_64_  -DUNIX  -Dlinux     -O3 -g   -Wall      -mtune=generic     -m64  -I. -I../O.Common -I. -I. -I.. -I/Jenkins/jenkins/jobs/epics-7.0/workspace/OS/linux64/include/compiler/gcc -I/Jenkins/jenkins/jobs/epics-7.0/workspace/OS/linux64/include/os/Linux -I/Jenkins/jenkins/jobs/epics-7.0/workspace/OS/linux64/include -I/Jenkins/jenkins/jobs/epics-7.0/workspace/OS/linux64/include/compiler/gcc -I/Jenkins/jenkins/jobs/epics-7.0/workspace/OS/linux64/include/os/Linux -I/Jenkins/jenkins/jobs/epics-7.0/workspace/OS/linux64/include        -c p2pTestIoc_registerRecordDeviceDriver.cpp
make[4]: Leaving directory '/Jenkins/jenkins/jobs/epics-7.0/workspace/OS/linux64/modules/pva2pva/testApp/O.linux-x86_64'
make[4]: Entering directory '/Jenkins/jenkins/jobs/epics-7.0/workspace/OS/linux64/modules/pva2pva/testApp/O.linux-x86_64'
/usr/bin/g++  -D_GNU_SOURCE -D_DEFAULT_SOURCE         -DUSE_TYPED_RSET -I../../pdbApp -I../../p2pApp -I../../common   -D_X86_64_  -DUNIX  -Dlinux     -O3 -g   -Wall      -mtune=generic     -m64  -I. -I../O.Common -I. -I. -I.. -I/Jenkins/jenkins/jobs/epics-7.0/workspace/OS/linux64/include/compiler/gcc -I/Jenkins/jenkins/jobs/epics-7.0/workspace/OS/linux64/include/os/Linux -I/Jenkins/jenkins/jobs/epics-7.0/workspace/OS/linux64/include -I/Jenkins/jenkins/jobs/epics-7.0/workspace/OS/linux64/include/compiler/gcc -I/Jenkins/jenkins/jobs/epics-7.0/workspace/OS/linux64/include/os/Linux -I/Jenkins/jenkins/jobs/epics-7.0/workspace/OS/linux64/include        -c ../testweak.cpp
make[4]: Leaving directory '/Jenkins/jenkins/jobs/epics-7.0/workspace/OS/linux64/modules/pva2pva/testApp/O.linux-x86_64'
make[4]: Entering directory '/Jenkins/jenkins/jobs/epics-7.0/workspace/OS/linux64/modules/pva2pva/testApp/O.linux-x86_64'
/usr/bin/g++  -D_GNU_SOURCE -D_DEFAULT_SOURCE         -DUSE_TYPED_RSET -I../../pdbApp -I../../p2pApp -I../../common   -D_X86_64_  -DUNIX  -Dlinux     -O3 -g   -Wall      -mtune=generic     -m64  -I. -I../O.Common -I. -I. -I.. -I/Jenkins/jenkins/jobs/epics-7.0/workspace/OS/linux64/include/compiler/gcc -I/Jenkins/jenkins/jobs/epics-7.0/workspace/OS/linux64/include/os/Linux -I/Jenkins/jenkins/jobs/epics-7.0/workspace/OS/linux64/include -I/Jenkins/jenkins/jobs/epics-7.0/workspace/OS/linux64/include/compiler/gcc -I/Jenkins/jenkins/jobs/epics-7.0/workspace/OS/linux64/include/os/Linux -I/Jenkins/jenkins/jobs/epics-7.0/workspace/OS/linux64/include        -c ../utilitiesx.cpp
make[4]: Leaving directory '/Jenkins/jenkins/jobs/epics-7.0/workspace/OS/linux64/modules/pva2pva/testApp/O.linux-x86_64'
make[4]: Entering directory '/Jenkins/jenkins/jobs/epics-7.0/workspace/OS/linux64/modules/pva2pva/testApp/O.linux-x86_64'
/usr/bin/g++  -D_GNU_SOURCE -D_DEFAULT_SOURCE         -DUSE_TYPED_RSET -I../../pdbApp -I../../p2pApp -I../../common   -D_X86_64_  -DUNIX  -Dlinux     -O3 -g   -Wall      -mtune=generic     -m64  -I. -I../O.Common -I. -I. -I.. -I/Jenkins/jenkins/jobs/epics-7.0/workspace/OS/linux64/include/compiler/gcc -I/Jenkins/jenkins/jobs/epics-7.0/workspace/OS/linux64/include/os/Linux -I/Jenkins/jenkins/jobs/epics-7.0/workspace/OS/linux64/include -I/Jenkins/jenkins/jobs/epics-7.0/workspace/OS/linux64/include/compiler/gcc -I/Jenkins/jenkins/jobs/epics-7.0/workspace/OS/linux64/include/os/Linux -I/Jenkins/jenkins/jobs/epics-7.0/workspace/OS/linux64/include        -c ../testpvalink.cpp
make[4]: Leaving directory '/Jenkins/jenkins/jobs/epics-7.0/workspace/OS/linux64/modules/pva2pva/testApp/O.linux-x86_64'
make[4]: Entering directory '/Jenkins/jenkins/jobs/epics-7.0/workspace/OS/linux64/modules/pva2pva/testApp/O.linux-x86_64'
/usr/bin/g++  -D_GNU_SOURCE -D_DEFAULT_SOURCE         -DUSE_TYPED_RSET -I../../pdbApp -I../../p2pApp -I../../common   -D_X86_64_  -DUNIX  -Dlinux     -O3 -g   -Wall      -mtune=generic     -m64  -I. -I../O.Common -I. -I. -I.. -I/Jenkins/jenkins/jobs/epics-7.0/workspace/OS/linux64/include/compiler/gcc -I/Jenkins/jenkins/jobs/epics-7.0/workspace/OS/linux64/include/os/Linux -I/Jenkins/jenkins/jobs/epics-7.0/workspace/OS/linux64/include -I/Jenkins/jenkins/jobs/epics-7.0/workspace/OS/linux64/include/compiler/gcc -I/Jenkins/jenkins/jobs/epics-7.0/workspace/OS/linux64/include/os/Linux -I/Jenkins/jenkins/jobs/epics-7.0/workspace/OS/linux64/include        -c pvaLinkTestIoc_registerRecordDeviceDriver.cpp
make[4]: Leaving directory '/Jenkins/jenkins/jobs/epics-7.0/workspace/OS/linux64/modules/pva2pva/testApp/O.linux-x86_64'
make[4]: Entering directory '/Jenkins/jenkins/jobs/epics-7.0/workspace/OS/linux64/modules/pva2pva/testApp/O.linux-x86_64'
/usr/bin/g++  -D_GNU_SOURCE -D_DEFAULT_SOURCE         -DUSE_TYPED_RSET -I../../pdbApp -I../../p2pApp -I../../common   -D_X86_64_  -DUNIX  -Dlinux     -O3 -g   -Wall      -mtune=generic     -m64  -I. -I../O.Common -I. -I. -I.. -I/Jenkins/jenkins/jobs/epics-7.0/workspace/OS/linux64/include/compiler/gcc -I/Jenkins/jenkins/jobs/epics-7.0/workspace/OS/linux64/include/os/Linux -I/Jenkins/jenkins/jobs/epics-7.0/workspace/OS/linux64/include -I/Jenkins/jenkins/jobs/epics-7.0/workspace/OS/linux64/include/compiler/gcc -I/Jenkins/jenkins/jobs/epics-7.0/workspace/OS/linux64/include/os/Linux -I/Jenkins/jenkins/jobs/epics-7.0/workspace/OS/linux64/include        -c ../testpdb.cpp
make[4]: Leaving directory '/Jenkins/jenkins/jobs/epics-7.0/workspace/OS/linux64/modules/pva2pva/testApp/O.linux-x86_64'
make[4]: Entering directory '/Jenkins/jenkins/jobs/epics-7.0/workspace/OS/linux64/modules/pva2pva/testApp/O.linux-x86_64'
/usr/bin/g++ -o check_consist  -L/Jenkins/jenkins/jobs/epics-7.0/workspace/OS/linux64/lib/linux-x86_64 -Wl,-rpath,/Jenkins/jenkins/jobs/epics-7.0/workspace/OS/linux64/lib/linux-x86_64           -rdynamic -m64        check_consist.o utilitiesx.o   -lpvAccess -lpvData -ldbRecStd -ldbCore -lca -lCom   
make[4]: Leaving directory '/Jenkins/jenkins/jobs/epics-7.0/workspace/OS/linux64/modules/pva2pva/testApp/O.linux-x86_64'
make[4]: Entering directory '/Jenkins/jenkins/jobs/epics-7.0/workspace/OS/linux64/modules/pva2pva/testApp/O.linux-x86_64'
/usr/bin/g++  -D_GNU_SOURCE -D_DEFAULT_SOURCE         -DUSE_TYPED_RSET -I../../pdbApp -I../../p2pApp -I../../common   -D_X86_64_  -DUNIX  -Dlinux     -O3 -g   -Wall      -mtune=generic     -m64  -I. -I../O.Common -I. -I. -I.. -I/Jenkins/jenkins/jobs/epics-7.0/workspace/OS/linux64/include/compiler/gcc -I/Jenkins/jenkins/jobs/epics-7.0/workspace/OS/linux64/include/os/Linux -I/Jenkins/jenkins/jobs/epics-7.0/workspace/OS/linux64/include -I/Jenkins/jenkins/jobs/epics-7.0/workspace/OS/linux64/include/compiler/gcc -I/Jenkins/jenkins/jobs/epics-7.0/workspace/OS/linux64/include/os/Linux -I/Jenkins/jenkins/jobs/epics-7.0/workspace/OS/linux64/include        -c ../testpvif.cpp
make[4]: Leaving directory '/Jenkins/jenkins/jobs/epics-7.0/workspace/OS/linux64/modules/pva2pva/testApp/O.linux-x86_64'
make[4]: Entering directory '/Jenkins/jenkins/jobs/epics-7.0/workspace/OS/linux64/modules/pva2pva/testApp/O.linux-x86_64'
/usr/bin/g++ -o testweak  -L/Jenkins/jenkins/jobs/epics-7.0/workspace/OS/linux64/lib/linux-x86_64 -Wl,-rpath,/Jenkins/jenkins/jobs/epics-7.0/workspace/OS/linux64/lib/linux-x86_64           -rdynamic -m64        testweak.o utilitiesx.o   -lCom -lpvAccess -lpvData -ldbRecStd -ldbCore -lca -lCom   
make[4]: Leaving directory '/Jenkins/jenkins/jobs/epics-7.0/workspace/OS/linux64/modules/pva2pva/testApp/O.linux-x86_64'
make[4]: Entering directory '/Jenkins/jenkins/jobs/epics-7.0/workspace/OS/linux64/modules/pva2pva/testApp/O.linux-x86_64'
/usr/bin/g++ -o testtest  -L/Jenkins/jenkins/jobs/epics-7.0/workspace/OS/linux64/lib/linux-x86_64 -Wl,-rpath,/Jenkins/jenkins/jobs/epics-7.0/workspace/OS/linux64/lib/linux-x86_64           -rdynamic -m64        testtest.o utilitiesx.o   -lpvAccess -lpvData -ldbRecStd -ldbCore -lca -lCom   
make[4]: Leaving directory '/Jenkins/jenkins/jobs/epics-7.0/workspace/OS/linux64/modules/pva2pva/testApp/O.linux-x86_64'
make[4]: Entering directory '/Jenkins/jenkins/jobs/epics-7.0/workspace/OS/linux64/modules/pva2pva/testApp/O.linux-x86_64'
/usr/bin/g++ -o testpvif  -L/Jenkins/jenkins/jobs/epics-7.0/workspace/OS/linux64/lib/linux-x86_64 -Wl,-rpath,/Jenkins/jenkins/jobs/epics-7.0/workspace/OS/linux64/lib/linux-x86_64           -rdynamic -m64        testpvif.o p2pTestIoc_registerRecordDeviceDriver.o utilitiesx.o   -lqsrv -lpvAccess -lpvData -ldbRecStd -ldbCore -lca -lCom   
make[4]: Leaving directory '/Jenkins/jenkins/jobs/epics-7.0/workspace/OS/linux64/modules/pva2pva/testApp/O.linux-x86_64'
make[4]: Entering directory '/Jenkins/jenkins/jobs/epics-7.0/workspace/OS/linux64/modules/pva2pva/testApp/O.linux-x86_64'
/usr/bin/g++ -o testpdb  -L/Jenkins/jenkins/jobs/epics-7.0/workspace/OS/linux64/lib/linux-x86_64 -Wl,-rpath,/Jenkins/jenkins/jobs/epics-7.0/workspace/OS/linux64/lib/linux-x86_64           -rdynamic -m64        testpdb.o p2pTestIoc_registerRecordDeviceDriver.o utilitiesx.o   -lqsrv -lpvAccess -lpvData -ldbRecStd -ldbCore -lca -lCom   
make[4]: Leaving directory '/Jenkins/jenkins/jobs/epics-7.0/workspace/OS/linux64/modules/pva2pva/testApp/O.linux-x86_64'
make[4]: Entering directory '/Jenkins/jenkins/jobs/epics-7.0/workspace/OS/linux64/modules/pva2pva/testApp/O.linux-x86_64'
perl -CSD /Jenkins/jenkins/jobs/epics-7.0/workspace/OS/linux64/bin/linux-x86_64/makeTestfile.pl testweak.t testweak
make[4]: Leaving directory '/Jenkins/jenkins/jobs/epics-7.0/workspace/OS/linux64/modules/pva2pva/testApp/O.linux-x86_64'
make[4]: Entering directory '/Jenkins/jenkins/jobs/epics-7.0/workspace/OS/linux64/modules/pva2pva/testApp/O.linux-x86_64'
perl -CSD /Jenkins/jenkins/jobs/epics-7.0/workspace/OS/linux64/bin/linux-x86_64/makeTestfile.pl testtest.t testtest
make[4]: Leaving directory '/Jenkins/jenkins/jobs/epics-7.0/workspace/OS/linux64/modules/pva2pva/testApp/O.linux-x86_64'
make[4]: Entering directory '/Jenkins/jenkins/jobs/epics-7.0/workspace/OS/linux64/modules/pva2pva/testApp/O.linux-x86_64'
perl -CSD /Jenkins/jenkins/jobs/epics-7.0/workspace/OS/linux64/bin/linux-x86_64/makeTestfile.pl testpvif.t testpvif
make[4]: Leaving directory '/Jenkins/jenkins/jobs/epics-7.0/workspace/OS/linux64/modules/pva2pva/testApp/O.linux-x86_64'
make[4]: Entering directory '/Jenkins/jenkins/jobs/epics-7.0/workspace/OS/linux64/modules/pva2pva/testApp/O.linux-x86_64'
perl -CSD /Jenkins/jenkins/jobs/epics-7.0/workspace/OS/linux64/bin/linux-x86_64/makeTestfile.pl testpdb.t testpdb
make[4]: Leaving directory '/Jenkins/jenkins/jobs/epics-7.0/workspace/OS/linux64/modules/pva2pva/testApp/O.linux-x86_64'
make[4]: Entering directory '/Jenkins/jenkins/jobs/epics-7.0/workspace/OS/linux64/modules/pva2pva/testApp/O.linux-x86_64'
/usr/bin/g++ -o testpvalink  -L/Jenkins/jenkins/jobs/epics-7.0/workspace/OS/linux64/lib/linux-x86_64 -Wl,-rpath,/Jenkins/jenkins/jobs/epics-7.0/workspace/OS/linux64/lib/linux-x86_64           -rdynamic -m64        testpvalink.o pvaLinkTestIoc_registerRecordDeviceDriver.o utilitiesx.o   -lqsrv -lpvAccess -lpvData -ldbRecStd -ldbCore -lca -lCom   
make[4]: Leaving directory '/Jenkins/jenkins/jobs/epics-7.0/workspace/OS/linux64/modules/pva2pva/testApp/O.linux-x86_64'
make[4]: Entering directory '/Jenkins/jenkins/jobs/epics-7.0/workspace/OS/linux64/modules/pva2pva/testApp/O.linux-x86_64'
perl -CSD /Jenkins/jenkins/jobs/epics-7.0/workspace/OS/linux64/bin/linux-x86_64/makeTestfile.pl testpvalink.t testpvalink
make[4]: Leaving directory '/Jenkins/jenkins/jobs/epics-7.0/workspace/OS/linux64/modules/pva2pva/testApp/O.linux-x86_64'
make[4]: Entering directory '/Jenkins/jenkins/jobs/epics-7.0/workspace/OS/linux64/modules/pva2pva/testApp/O.linux-x86_64'
/usr/bin/g++  -D_GNU_SOURCE -D_DEFAULT_SOURCE         -DUSE_TYPED_RSET -I../../pdbApp -I../../p2pApp -I../../common   -D_X86_64_  -DUNIX  -Dlinux     -O3 -g   -Wall      -mtune=generic     -m64  -I. -I../O.Common -I. -I. -I.. -I/Jenkins/jenkins/jobs/epics-7.0/workspace/OS/linux64/include/compiler/gcc -I/Jenkins/jenkins/jobs/epics-7.0/workspace/OS/linux64/include/os/Linux -I/Jenkins/jenkins/jobs/epics-7.0/workspace/OS/linux64/include -I/Jenkins/jenkins/jobs/epics-7.0/workspace/OS/linux64/include/compiler/gcc -I/Jenkins/jenkins/jobs/epics-7.0/workspace/OS/linux64/include/os/Linux -I/Jenkins/jenkins/jobs/epics-7.0/workspace/OS/linux64/include        -c ../testgroupconfig.cpp
make[4]: Leaving directory '/Jenkins/jenkins/jobs/epics-7.0/workspace/OS/linux64/modules/pva2pva/testApp/O.linux-x86_64'
make[4]: Entering directory '/Jenkins/jenkins/jobs/epics-7.0/workspace/OS/linux64/modules/pva2pva/testApp/O.linux-x86_64'
/usr/bin/g++ -o testgroupconfig  -L/Jenkins/jenkins/jobs/epics-7.0/workspace/OS/linux64/lib/linux-x86_64 -Wl,-rpath,/Jenkins/jenkins/jobs/epics-7.0/workspace/OS/linux64/lib/linux-x86_64           -rdynamic -m64        testgroupconfig.o utilitiesx.o   -lqsrv -lpvAccess -lpvData -ldbRecStd -ldbCore -lca -lCom -lpvAccess -lpvData -ldbRecStd -ldbCore -lca -lCom   
make[4]: Leaving directory '/Jenkins/jenkins/jobs/epics-7.0/workspace/OS/linux64/modules/pva2pva/testApp/O.linux-x86_64'
make[4]: Entering directory '/Jenkins/jenkins/jobs/epics-7.0/workspace/OS/linux64/modules/pva2pva/testApp/O.linux-x86_64'
perl -CSD /Jenkins/jenkins/jobs/epics-7.0/workspace/OS/linux64/bin/linux-x86_64/makeTestfile.pl testgroupconfig.t testgroupconfig
make[4]: Leaving directory '/Jenkins/jenkins/jobs/epics-7.0/workspace/OS/linux64/modules/pva2pva/testApp/O.linux-x86_64'
make[4]: Entering directory '/Jenkins/jenkins/jobs/epics-7.0/workspace/OS/linux64/modules/pva2pva/testApp/O.linux-x86_64'
/usr/bin/g++  -D_GNU_SOURCE -D_DEFAULT_SOURCE         -DUSE_TYPED_RSET -I../../pdbApp -I../../p2pApp -I../../common   -D_X86_64_  -DUNIX  -Dlinux     -O3 -g   -Wall      -mtune=generic     -m64  -I. -I../O.Common -I. -I. -I.. -I/Jenkins/jenkins/jobs/epics-7.0/workspace/OS/linux64/include/compiler/gcc -I/Jenkins/jenkins/jobs/epics-7.0/workspace/OS/linux64/include/os/Linux -I/Jenkins/jenkins/jobs/epics-7.0/workspace/OS/linux64/include -I/Jenkins/jenkins/jobs/epics-7.0/workspace/OS/linux64/include/compiler/gcc -I/Jenkins/jenkins/jobs/epics-7.0/workspace/OS/linux64/include/os/Linux -I/Jenkins/jenkins/jobs/epics-7.0/workspace/OS/linux64/include        -c ../testdbf_copy.cpp
make[4]: Leaving directory '/Jenkins/jenkins/jobs/epics-7.0/workspace/OS/linux64/modules/pva2pva/testApp/O.linux-x86_64'
make[4]: Entering directory '/Jenkins/jenkins/jobs/epics-7.0/workspace/OS/linux64/modules/pva2pva/testApp/O.linux-x86_64'
/usr/bin/g++ -o testdbf_copy  -L/Jenkins/jenkins/jobs/epics-7.0/workspace/OS/linux64/lib/linux-x86_64 -Wl,-rpath,/Jenkins/jenkins/jobs/epics-7.0/workspace/OS/linux64/lib/linux-x86_64           -rdynamic -m64        testdbf_copy.o utilitiesx.o   -lqsrv -lpvAccess -lpvData -ldbRecStd -ldbCore -lca -lCom -lpvAccess -lpvData -ldbRecStd -ldbCore -lca -lCom   
make[4]: Leaving directory '/Jenkins/jenkins/jobs/epics-7.0/workspace/OS/linux64/modules/pva2pva/testApp/O.linux-x86_64'
make[4]: Entering directory '/Jenkins/jenkins/jobs/epics-7.0/workspace/OS/linux64/modules/pva2pva/testApp/O.linux-x86_64'
perl -CSD /Jenkins/jenkins/jobs/epics-7.0/workspace/OS/linux64/bin/linux-x86_64/makeTestfile.pl testdbf_copy.t testdbf_copy
make[4]: Leaving directory '/Jenkins/jenkins/jobs/epics-7.0/workspace/OS/linux64/modules/pva2pva/testApp/O.linux-x86_64'
/Jenkins/jenkins/bin/make -C ./iocBoot install.linux-x86_64 
/Jenkins/jenkins/bin/make -C ./iocimagedemo install.linux-x86_64 
/Jenkins/jenkins/bin/make -C ./iocpvalink install.linux-x86_64 
/Jenkins/jenkins/bin/make -C ./iocwfdemo install.linux-x86_64 
make[4]: Nothing to be done for 'install.linux-x86_64'.
make[4]: Nothing to be done for 'install.linux-x86_64'.
make[4]: Nothing to be done for 'install.linux-x86_64'.
configure/RULES_DIRS:84: recipe for target 'modules.install.linux-x86_64' failed
make: *** [modules.install.linux-x86_64] Error 2
Build step 'Execute shell' marked build as failure
[WARNINGS] Skipping publisher since build result is FAILURE
TAP Reports Processing: START
Looking for TAP results report in workspace using pattern: **/O.*/*.tap
Did not find any matching files.

Replies:
Jenkins build is back to normal : epics-7.0 » linux64 #67 APS Jenkins

Navigate by Date:
Prev: Build failed in Jenkins: epics-7.0-windows » DLL, win64 #56 APS Jenkins
Next: Build failed in Jenkins: epics-7.0 » mac #66 APS Jenkins
Index: 2002  2003  2004  2005  2006  2007  2008  2009  2010  2011  2012  2013  2014  2015  2016  2017  <20182019  2020 
Navigate by Thread:
Prev: Jenkins build is back to normal : epics-7.0-windows » DLL,win64 #63 APS Jenkins via Core-talk
Next: Jenkins build is back to normal : epics-7.0 » linux64 #67 APS Jenkins
Index: 2002  2003  2004  2005  2006  2007  2008  2009  2010  2011  2012  2013  2014  2015  2016  2017  <20182019  2020