EPICS Home

Experimental Physics and Industrial Control System


 
2002  2003  2004  2005  2006  2007  2008  2009  2010  2011  2012  2013  <20142015  2016  2017  2018  2019  2020  2021  2022  Index 2002  2003  2004  2005  2006  2007  2008  2009  2010  2011  2012  2013  <20142015  2016  2017  2018  2019  2020  2021  2022 
<== Date ==> <== Thread ==>

Subject: Build failed in Jenkins: epics-base-3.14-vx55 #14
From: APS Jenkins <[email protected]>
To: [email protected]
Date: Wed, 9 Apr 2014 17:07:04 -0500 (CDT)
See <https://jenkins.aps.anl.gov/job/epics-base-3.14-vx55/14/>

------------------------------------------
[...truncated 867 lines...]

/usr/local/vw/tornado22-ppc/host/x86-linux/bin/ccppc -c            -DCPU=PPC604  -DvxWorks=vxWorks -include /usr/local/vw/tornado22-ppc/target/h/vxWorks.h    -O2   -Wall     -mcpu=604 -mstrict-align -mno-implicit-fp -mlongcall    -fno-builtin  -MMD -I. -I../O.Common -I. -I.. -I../../../../include/os/vxWorks -I../../../../include       -I/usr/local/vw/tornado22-ppc/target/h ../devTestAsyn.c 
/usr/local/vw/tornado22-ppc/host/x86-linux/bin/arppc -rc   libtestDevIoc.a         devHistogramTestAsyn.o devTestAsyn.o
/usr/local/vw/tornado22-ppc/host/x86-linux/bin/ranlibppc libtestDevIoc.a
Installing library ../../../../lib/vxWorks-ppc604_long/libtestDevIoc.a
make[4]: Leaving directory `<https://jenkins.aps.anl.gov/job/epics-base-3.14-vx55/ws/src/dev/testDev/O.vxWorks-ppc604_long'>
make[3]: Leaving directory `<https://jenkins.aps.anl.gov/job/epics-base-3.14-vx55/ws/src/dev/testDev'>
make[2]: Leaving directory `<https://jenkins.aps.anl.gov/job/epics-base-3.14-vx55/ws/src/dev'>
make -C ./vxWorks vxWorks-ppc604_long 
make[2]: Entering directory `<https://jenkins.aps.anl.gov/job/epics-base-3.14-vx55/ws/src/vxWorks'>
perl ../../bin/linux-x86_64/makeMakefile.pl O.vxWorks-ppc604_long ../../..
make -C O.linux-x86_64 -f ../Makefile TOP=../../.. T_A=linux-x86_64
make[3]: Entering directory `<https://jenkins.aps.anl.gov/job/epics-base-3.14-vx55/ws/src/vxWorks/O.linux-x86_64'>
make[3]: Nothing to be done for `all'.
make[3]: Leaving directory `<https://jenkins.aps.anl.gov/job/epics-base-3.14-vx55/ws/src/vxWorks/O.linux-x86_64'>
make -C O.vxWorks-ppc604_long -f ../Makefile TOP=../../.. T_A=vxWorks-ppc604_long
make[3]: Entering directory `<https://jenkins.aps.anl.gov/job/epics-base-3.14-vx55/ws/src/vxWorks/O.vxWorks-ppc604_long'>
make[3]: Nothing to be done for `all'.
make[3]: Leaving directory `<https://jenkins.aps.anl.gov/job/epics-base-3.14-vx55/ws/src/vxWorks/O.vxWorks-ppc604_long'>
make[2]: Leaving directory `<https://jenkins.aps.anl.gov/job/epics-base-3.14-vx55/ws/src/vxWorks'>
make -C ./RTEMS vxWorks-ppc604_long 
make[2]: Entering directory `<https://jenkins.aps.anl.gov/job/epics-base-3.14-vx55/ws/src/RTEMS'>
make -C ./base vxWorks-ppc604_long 
make[3]: Entering directory `<https://jenkins.aps.anl.gov/job/epics-base-3.14-vx55/ws/src/RTEMS/base'>
perl ../../../bin/linux-x86_64/makeMakefile.pl O.vxWorks-ppc604_long ../../../..
make -C O.linux-x86_64 -f ../Makefile TOP=../../../.. T_A=linux-x86_64
make[4]: Entering directory `<https://jenkins.aps.anl.gov/job/epics-base-3.14-vx55/ws/src/RTEMS/base/O.linux-x86_64'>
make[4]: Nothing to be done for `all'.
make[4]: Leaving directory `<https://jenkins.aps.anl.gov/job/epics-base-3.14-vx55/ws/src/RTEMS/base/O.linux-x86_64'>
make -C O.vxWorks-ppc604_long -f ../Makefile TOP=../../../.. T_A=vxWorks-ppc604_long
make[4]: Entering directory `<https://jenkins.aps.anl.gov/job/epics-base-3.14-vx55/ws/src/RTEMS/base/O.vxWorks-ppc604_long'>
make[4]: Nothing to be done for `all'.
make[4]: Leaving directory `<https://jenkins.aps.anl.gov/job/epics-base-3.14-vx55/ws/src/RTEMS/base/O.vxWorks-ppc604_long'>
make[3]: Leaving directory `<https://jenkins.aps.anl.gov/job/epics-base-3.14-vx55/ws/src/RTEMS/base'>
make[2]: Leaving directory `<https://jenkins.aps.anl.gov/job/epics-base-3.14-vx55/ws/src/RTEMS'>
make -C libCom/test vxWorks-ppc604_long 
make[2]: Entering directory `<https://jenkins.aps.anl.gov/job/epics-base-3.14-vx55/ws/src/libCom/test'>
perl ../../../bin/linux-x86_64/makeMakefile.pl O.vxWorks-ppc604_long ../../../..
make -C O.linux-x86_64 -f ../Makefile TOP=../../../.. T_A=linux-x86_64
make[3]: Entering directory `<https://jenkins.aps.anl.gov/job/epics-base-3.14-vx55/ws/src/libCom/test/O.linux-x86_64'>
make[3]: Nothing to be done for `all'.
make[3]: Leaving directory `<https://jenkins.aps.anl.gov/job/epics-base-3.14-vx55/ws/src/libCom/test/O.linux-x86_64'>
make -C O.vxWorks-ppc604_long -f ../Makefile TOP=../../../.. T_A=vxWorks-ppc604_long
make[3]: Entering directory `<https://jenkins.aps.anl.gov/job/epics-base-3.14-vx55/ws/src/libCom/test/O.vxWorks-ppc604_long'>

/usr/local/vw/tornado22-ppc/host/x86-linux/bin/ccppc -c            -DCPU=PPC604  -DvxWorks=vxWorks -include /usr/local/vw/tornado22-ppc/target/h/vxWorks.h    -O2   -Wall     -mcpu=604 -mstrict-align -mno-implicit-fp -mlongcall -fno-implicit-templates   -fno-builtin  -MMD -I. -I../O.Common -I. -I.. -I../../../../include/os/vxWorks -I../../../../include       -I/usr/local/vw/tornado22-ppc/target/h ../epicsCalcTest.cpp 

/usr/local/vw/tornado22-ppc/host/x86-linux/bin/ccppc -c            -DCPU=PPC604  -DvxWorks=vxWorks -include /usr/local/vw/tornado22-ppc/target/h/vxWorks.h    -O2   -Wall     -mcpu=604 -mstrict-align -mno-implicit-fp -mlongcall -fno-implicit-templates   -fno-builtin  -MMD -I. -I../O.Common -I. -I.. -I../../../../include/os/vxWorks -I../../../../include       -I/usr/local/vw/tornado22-ppc/target/h ../epicsAlgorithmTest.cpp 

/usr/local/vw/tornado22-ppc/host/x86-linux/bin/ccppc -c            -DCPU=PPC604  -DvxWorks=vxWorks -include /usr/local/vw/tornado22-ppc/target/h/vxWorks.h    -O2   -Wall     -mcpu=604 -mstrict-align -mno-implicit-fp -mlongcall    -fno-builtin  -MMD -I. -I../O.Common -I. -I.. -I../../../../include/os/vxWorks -I../../../../include       -I/usr/local/vw/tornado22-ppc/target/h ../epicsMathTest.c 

/usr/local/vw/tornado22-ppc/host/x86-linux/bin/ccppc -c            -DCPU=PPC604  -DvxWorks=vxWorks -include /usr/local/vw/tornado22-ppc/target/h/vxWorks.h    -O2   -Wall     -mcpu=604 -mstrict-align -mno-implicit-fp -mlongcall    -fno-builtin  -MMD -I. -I../O.Common -I. -I.. -I../../../../include/os/vxWorks -I../../../../include       -I/usr/local/vw/tornado22-ppc/target/h ../epicsEllTest.c 

/usr/local/vw/tornado22-ppc/host/x86-linux/bin/ccppc -c            -DCPU=PPC604  -DvxWorks=vxWorks -include /usr/local/vw/tornado22-ppc/target/h/vxWorks.h    -O2   -Wall     -mcpu=604 -mstrict-align -mno-implicit-fp -mlongcall    -fno-builtin  -MMD -I. -I../O.Common -I. -I.. -I../../../../include/os/vxWorks -I../../../../include       -I/usr/local/vw/tornado22-ppc/target/h ../epicsEnvTest.c 

/usr/local/vw/tornado22-ppc/host/x86-linux/bin/ccppc -c            -DCPU=PPC604  -DvxWorks=vxWorks -include /usr/local/vw/tornado22-ppc/target/h/vxWorks.h    -O2   -Wall     -mcpu=604 -mstrict-align -mno-implicit-fp -mlongcall    -fno-builtin  -MMD -I. -I../O.Common -I. -I.. -I../../../../include/os/vxWorks -I../../../../include       -I/usr/local/vw/tornado22-ppc/target/h ../epicsErrlogTest.c 

/usr/local/vw/tornado22-ppc/host/x86-linux/bin/ccppc -c            -DCPU=PPC604  -DvxWorks=vxWorks -include /usr/local/vw/tornado22-ppc/target/h/vxWorks.h    -O2   -Wall     -mcpu=604 -mstrict-align -mno-implicit-fp -mlongcall    -fno-builtin  -MMD -I. -I../O.Common -I. -I.. -I../../../../include/os/vxWorks -I../../../../include       -I/usr/local/vw/tornado22-ppc/target/h ../epicsStdioTest.c 

/usr/local/vw/tornado22-ppc/host/x86-linux/bin/ccppc -c            -DCPU=PPC604  -DvxWorks=vxWorks -include /usr/local/vw/tornado22-ppc/target/h/vxWorks.h    -O2   -Wall     -mcpu=604 -mstrict-align -mno-implicit-fp -mlongcall    -fno-builtin  -MMD -I. -I../O.Common -I. -I.. -I../../../../include/os/vxWorks -I../../../../include       -I/usr/local/vw/tornado22-ppc/target/h ../epicsSockResolveTest.c 

/usr/local/vw/tornado22-ppc/host/x86-linux/bin/ccppc -c            -DCPU=PPC604  -DvxWorks=vxWorks -include /usr/local/vw/tornado22-ppc/target/h/vxWorks.h    -O2   -Wall     -mcpu=604 -mstrict-align -mno-implicit-fp -mlongcall    -fno-builtin  -MMD -I. -I../O.Common -I. -I.. -I../../../../include/os/vxWorks -I../../../../include       -I/usr/local/vw/tornado22-ppc/target/h ../epicsStringTest.c 

/usr/local/vw/tornado22-ppc/host/x86-linux/bin/ccppc -c            -DCPU=PPC604  -DvxWorks=vxWorks -include /usr/local/vw/tornado22-ppc/target/h/vxWorks.h    -O2   -Wall     -mcpu=604 -mstrict-align -mno-implicit-fp -mlongcall -fno-implicit-templates   -fno-builtin  -MMD -I. -I../O.Common -I. -I.. -I../../../../include/os/vxWorks -I../../../../include       -I/usr/local/vw/tornado22-ppc/target/h ../epicsTimeTest.cpp 

/usr/local/vw/tornado22-ppc/host/x86-linux/bin/ccppc -c            -DCPU=PPC604  -DvxWorks=vxWorks -include /usr/local/vw/tornado22-ppc/target/h/vxWorks.h    -O2   -Wall     -mcpu=604 -mstrict-align -mno-implicit-fp -mlongcall -fno-implicit-templates   -fno-builtin  -MMD -I. -I../O.Common -I. -I.. -I../../../../include/os/vxWorks -I../../../../include       -I/usr/local/vw/tornado22-ppc/target/h ../epicsThreadTest.cpp 

/usr/local/vw/tornado22-ppc/host/x86-linux/bin/ccppc -c            -DCPU=PPC604  -DvxWorks=vxWorks -include /usr/local/vw/tornado22-ppc/target/h/vxWorks.h    -O2   -Wall     -mcpu=604 -mstrict-align -mno-implicit-fp -mlongcall    -fno-builtin  -MMD -I. -I../O.Common -I. -I.. -I../../../../include/os/vxWorks -I../../../../include       -I/usr/local/vw/tornado22-ppc/target/h ../epicsThreadOnceTest.c 

/usr/local/vw/tornado22-ppc/host/x86-linux/bin/ccppc -c            -DCPU=PPC604  -DvxWorks=vxWorks -include /usr/local/vw/tornado22-ppc/target/h/vxWorks.h    -O2   -Wall     -mcpu=604 -mstrict-align -mno-implicit-fp -mlongcall -fno-implicit-templates   -fno-builtin  -MMD -I. -I../O.Common -I. -I.. -I../../../../include/os/vxWorks -I../../../../include       -I/usr/local/vw/tornado22-ppc/target/h ../epicsThreadPriorityTest.cpp 

/usr/local/vw/tornado22-ppc/host/x86-linux/bin/ccppc -c            -DCPU=PPC604  -DvxWorks=vxWorks -include /usr/local/vw/tornado22-ppc/target/h/vxWorks.h    -O2   -Wall     -mcpu=604 -mstrict-align -mno-implicit-fp -mlongcall -fno-implicit-templates   -fno-builtin  -MMD -I. -I../O.Common -I. -I.. -I../../../../include/os/vxWorks -I../../../../include       -I/usr/local/vw/tornado22-ppc/target/h ../epicsThreadPrivateTest.cpp 

/usr/local/vw/tornado22-ppc/host/x86-linux/bin/ccppc -c            -DCPU=PPC604  -DvxWorks=vxWorks -include /usr/local/vw/tornado22-ppc/target/h/vxWorks.h    -O2   -Wall     -mcpu=604 -mstrict-align -mno-implicit-fp -mlongcall    -fno-builtin  -MMD -I. -I../O.Common -I. -I.. -I../../../../include/os/vxWorks -I../../../../include       -I/usr/local/vw/tornado22-ppc/target/h ../epicsExitTest.c 

/usr/local/vw/tornado22-ppc/host/x86-linux/bin/ccppc -c            -DCPU=PPC604  -DvxWorks=vxWorks -include /usr/local/vw/tornado22-ppc/target/h/vxWorks.h    -O2   -Wall     -mcpu=604 -mstrict-align -mno-implicit-fp -mlongcall -fno-implicit-templates   -fno-builtin  -MMD -I. -I../O.Common -I. -I.. -I../../../../include/os/vxWorks -I../../../../include       -I/usr/local/vw/tornado22-ppc/target/h ../epicsTimerTest.cpp 

/usr/local/vw/tornado22-ppc/host/x86-linux/bin/ccppc -c            -DCPU=PPC604  -DvxWorks=vxWorks -include /usr/local/vw/tornado22-ppc/target/h/vxWorks.h    -O2   -Wall     -mcpu=604 -mstrict-align -mno-implicit-fp -mlongcall    -fno-builtin  -MMD -I. -I../O.Common -I. -I.. -I../../../../include/os/vxWorks -I../../../../include       -I/usr/local/vw/tornado22-ppc/target/h ../ringPointerTest.c 

/usr/local/vw/tornado22-ppc/host/x86-linux/bin/ccppc -c            -DCPU=PPC604  -DvxWorks=vxWorks -include /usr/local/vw/tornado22-ppc/target/h/vxWorks.h    -O2   -Wall     -mcpu=604 -mstrict-align -mno-implicit-fp -mlongcall    -fno-builtin  -MMD -I. -I../O.Common -I. -I.. -I../../../../include/os/vxWorks -I../../../../include       -I/usr/local/vw/tornado22-ppc/target/h ../ringBytesTest.c 

/usr/local/vw/tornado22-ppc/host/x86-linux/bin/ccppc -c            -DCPU=PPC604  -DvxWorks=vxWorks -include /usr/local/vw/tornado22-ppc/target/h/vxWorks.h    -O2   -Wall     -mcpu=604 -mstrict-align -mno-implicit-fp -mlongcall -fno-implicit-templates   -fno-builtin  -MMD -I. -I../O.Common -I. -I.. -I../../../../include/os/vxWorks -I../../../../include       -I/usr/local/vw/tornado22-ppc/target/h ../epicsEventTest.cpp 

/usr/local/vw/tornado22-ppc/host/x86-linux/bin/ccppc -c            -DCPU=PPC604  -DvxWorks=vxWorks -include /usr/local/vw/tornado22-ppc/target/h/vxWorks.h    -O2   -Wall     -mcpu=604 -mstrict-align -mno-implicit-fp -mlongcall -fno-implicit-templates   -fno-builtin  -MMD -I. -I../O.Common -I. -I.. -I../../../../include/os/vxWorks -I../../../../include       -I/usr/local/vw/tornado22-ppc/target/h ../epicsMutexTest.cpp 

/usr/local/vw/tornado22-ppc/host/x86-linux/bin/ccppc -c            -DCPU=PPC604  -DvxWorks=vxWorks -include /usr/local/vw/tornado22-ppc/target/h/vxWorks.h    -O2   -Wall     -mcpu=604 -mstrict-align -mno-implicit-fp -mlongcall -fno-implicit-templates   -fno-builtin  -MMD -I. -I../O.Common -I. -I.. -I../../../../include/os/vxWorks -I../../../../include       -I/usr/local/vw/tornado22-ppc/target/h ../epicsExceptionTest.cpp 

/usr/local/vw/tornado22-ppc/host/x86-linux/bin/ccppc -c            -DCPU=PPC604  -DvxWorks=vxWorks -include /usr/local/vw/tornado22-ppc/target/h/vxWorks.h    -O2   -Wall     -mcpu=604 -mstrict-align -mno-implicit-fp -mlongcall    -fno-builtin  -MMD -I. -I../O.Common -I. -I.. -I../../../../include/os/vxWorks -I../../../../include       -I/usr/local/vw/tornado22-ppc/target/h ../macEnvExpandTest.c 

/usr/local/vw/tornado22-ppc/host/x86-linux/bin/ccppc -c            -DCPU=PPC604  -DvxWorks=vxWorks -include /usr/local/vw/tornado22-ppc/target/h/vxWorks.h    -O2   -Wall     -mcpu=604 -mstrict-align -mno-implicit-fp -mlongcall    -fno-builtin  -MMD -I. -I../O.Common -I. -I.. -I../../../../include/os/vxWorks -I../../../../include       -I/usr/local/vw/tornado22-ppc/target/h ../macLibTest.c 

/usr/local/vw/tornado22-ppc/host/x86-linux/bin/ccppc -c            -DCPU=PPC604  -DvxWorks=vxWorks -include /usr/local/vw/tornado22-ppc/target/h/vxWorks.h    -O2   -Wall     -mcpu=604 -mstrict-align -mno-implicit-fp -mlongcall    -fno-builtin  -MMD -I. -I../O.Common -I. -I.. -I../../../../include/os/vxWorks -I../../../../include       -I/usr/local/vw/tornado22-ppc/target/h ../taskwdTest.c 

/usr/local/vw/tornado22-ppc/host/x86-linux/bin/ccppc -c            -DCPU=PPC604  -DvxWorks=vxWorks -include /usr/local/vw/tornado22-ppc/target/h/vxWorks.h    -O2   -Wall     -mcpu=604 -mstrict-align -mno-implicit-fp -mlongcall -fno-implicit-templates   -fno-builtin  -MMD -I. -I../O.Common -I. -I.. -I../../../../include/os/vxWorks -I../../../../include       -I/usr/local/vw/tornado22-ppc/target/h ../blockingSockTest.cpp 

/usr/local/vw/tornado22-ppc/host/x86-linux/bin/ccppc -c            -DCPU=PPC604  -DvxWorks=vxWorks -include /usr/local/vw/tornado22-ppc/target/h/vxWorks.h    -O2   -Wall     -mcpu=604 -mstrict-align -mno-implicit-fp -mlongcall -fno-implicit-templates   -fno-builtin  -MMD -I. -I../O.Common -I. -I.. -I../../../../include/os/vxWorks -I../../../../include       -I/usr/local/vw/tornado22-ppc/target/h ../epicsMessageQueueTest.cpp 

/usr/local/vw/tornado22-ppc/host/x86-linux/bin/ccppc -c            -DCPU=PPC604  -DvxWorks=vxWorks -include /usr/local/vw/tornado22-ppc/target/h/vxWorks.h    -O2   -Wall     -mcpu=604 -mstrict-align -mno-implicit-fp -mlongcall    -fno-builtin  -MMD -I. -I../O.Common -I. -I.. -I../../../../include/os/vxWorks -I../../../../include       -I/usr/local/vw/tornado22-ppc/target/h ../epicsRunLibComTests.c 

/usr/local/vw/tornado22-ppc/host/x86-linux/bin/ccppc -c            -DCPU=PPC604  -DvxWorks=vxWorks -include /usr/local/vw/tornado22-ppc/target/h/vxWorks.h    -O2   -Wall     -mcpu=604 -mstrict-align -mno-implicit-fp -mlongcall -fno-implicit-templates   -fno-builtin  -MMD -I. -I../O.Common -I. -I.. -I../../../../include/os/vxWorks -I../../../../include       -I/usr/local/vw/tornado22-ppc/target/h ../epicsThreadPerform.cpp 

/usr/local/vw/tornado22-ppc/host/x86-linux/bin/ccppc -c            -DCPU=PPC604  -DvxWorks=vxWorks -include /usr/local/vw/tornado22-ppc/target/h/vxWorks.h    -O2   -Wall     -mcpu=604 -mstrict-align -mno-implicit-fp -mlongcall    -fno-builtin  -MMD -I. -I../O.Common -I. -I.. -I../../../../include/os/vxWorks -I../../../../include       -I/usr/local/vw/tornado22-ppc/target/h ../epicsMaxThreads.c 

/usr/local/vw/tornado22-ppc/host/x86-linux/bin/ccppc -c            -DCPU=PPC604  -DvxWorks=vxWorks -include /usr/local/vw/tornado22-ppc/target/h/vxWorks.h    -O2   -Wall     -mcpu=604 -mstrict-align -mno-implicit-fp -mlongcall    -fno-builtin  -MMD -I. -I../O.Common -I. -I.. -I../../../../include/os/vxWorks -I../../../../include       -I/usr/local/vw/tornado22-ppc/target/h ../buckTest.c 

/usr/local/vw/tornado22-ppc/host/x86-linux/bin/ccppc -c            -DCPU=PPC604  -DvxWorks=vxWorks -include /usr/local/vw/tornado22-ppc/target/h/vxWorks.h    -O2   -Wall     -mcpu=604 -mstrict-align -mno-implicit-fp -mlongcall -fno-implicit-templates   -fno-builtin  -MMD -I. -I../O.Common -I. -I.. -I../../../../include/os/vxWorks -I../../../../include       -I/usr/local/vw/tornado22-ppc/target/h ../cvtFastPerform.cpp 
/usr/local/vw/tornado22-ppc/host/x86-linux/bin/ldppc -r -o vxTestHarness  -L../../../../lib/vxWorks-ppc604_long/          -L/usr/local/vw/tornado22-ppc/host/x86-linux/powerpc-wrs-vxworks/lib           ../../../../bin/vxWorks-ppc604_long/vxComLibrary.o epicsCalcTest.o epicsAlgorithmTest.o epicsMathTest.o epicsEllTest.o epicsEnvTest.o epicsErrlogTest.o epicsStdioTest.o epicsSockResolveTest.o epicsStringTest.o epicsTimeTest.o epicsThreadTest.o epicsThreadOnceTest.o epicsThreadPriorityTest.o epicsThreadPrivateTest.o epicsExitTest.o epicsTimerTest.o ringPointerTest.o ringBytesTest.o epicsEventTest.o epicsMutexTest.o epicsExceptionTest.o macEnvExpandTest.o macLibTest.o taskwdTest.o blockingSockTest.o epicsMessageQueueTest.o epicsRunLibComTests.o epicsThreadPerform.o epicsMaxThreads.o buckTest.o cvtFastPerform.o    -lCom
/usr/local/vw/tornado22-ppc/host/x86-linux/bin/nmppc vxTestHarness  > vxTestHarness.nm
perl ../../../../bin/linux-x86_64/munch.pl -o vxTestHarness_ctdt.c vxTestHarness.nm
/usr/local/vw/tornado22-ppc/host/x86-linux/bin/ccppc -c            -DCPU=PPC604  -DvxWorks=vxWorks -include /usr/local/vw/tornado22-ppc/target/h/vxWorks.h  -O2 -Wall -mcpu=604 -mstrict-align -mno-implicit-fp -mlongcall -fno-builtin -MMD -fdollars-in-identifiers -I. -I../O.Common -I. -I.. -I../../../../include/os/vxWorks -I../../../../include       -I/usr/local/vw/tornado22-ppc/target/h  vxTestHarness_ctdt.c
/usr/local/vw/tornado22-ppc/host/x86-linux/bin/ldppc -r  -o vxTestHarness.munch vxTestHarness_ctdt.o vxTestHarness
Installing created file ../../../../bin/vxWorks-ppc604_long/vxTestHarness.munch
make[3]: Leaving directory `<https://jenkins.aps.anl.gov/job/epics-base-3.14-vx55/ws/src/libCom/test/O.vxWorks-ppc604_long'>
make[2]: Leaving directory `<https://jenkins.aps.anl.gov/job/epics-base-3.14-vx55/ws/src/libCom/test'>
make -C db/test vxWorks-ppc604_long 
make[2]: Entering directory `<https://jenkins.aps.anl.gov/job/epics-base-3.14-vx55/ws/src/db/test'>
perl ../../../bin/linux-x86_64/makeMakefile.pl O.vxWorks-ppc604_long ../../../..
make -C O.linux-x86_64 -f ../Makefile TOP=../../../.. T_A=linux-x86_64
make[3]: Entering directory `<https://jenkins.aps.anl.gov/job/epics-base-3.14-vx55/ws/src/db/test/O.linux-x86_64'>
make[3]: Nothing to be done for `all'.
make[3]: Leaving directory `<https://jenkins.aps.anl.gov/job/epics-base-3.14-vx55/ws/src/db/test/O.linux-x86_64'>
make -C O.vxWorks-ppc604_long -f ../Makefile TOP=../../../.. T_A=vxWorks-ppc604_long
make[3]: Entering directory `<https://jenkins.aps.anl.gov/job/epics-base-3.14-vx55/ws/src/db/test/O.vxWorks-ppc604_long'>

/usr/local/vw/tornado22-ppc/host/x86-linux/bin/ccppc -c            -DCPU=PPC604  -DvxWorks=vxWorks -include /usr/local/vw/tornado22-ppc/target/h/vxWorks.h    -O2   -Wall     -mcpu=604 -mstrict-align -mno-implicit-fp -mlongcall    -fno-builtin  -MMD -I. -I../O.Common -I. -I.. -I../../../../include/os/vxWorks -I../../../../include       -I/usr/local/vw/tornado22-ppc/target/h ../callbackTest.c 
/usr/local/vw/tornado22-ppc/host/x86-linux/bin/ldppc -r -o callbackTest  -L../../../../lib/vxWorks-ppc604_long/          -L/usr/local/vw/tornado22-ppc/host/x86-linux/powerpc-wrs-vxworks/lib           callbackTest.o    -ldbIoc -ldbStaticIoc -lca -lCom
/usr/local/vw/tornado22-ppc/host/x86-linux/bin/nmppc callbackTest  > callbackTest.nm
perl ../../../../bin/linux-x86_64/munch.pl -o callbackTest_ctdt.c callbackTest.nm
/usr/local/vw/tornado22-ppc/host/x86-linux/bin/ccppc -c            -DCPU=PPC604  -DvxWorks=vxWorks -include /usr/local/vw/tornado22-ppc/target/h/vxWorks.h  -O2 -Wall -mcpu=604 -mstrict-align -mno-implicit-fp -mlongcall -fno-builtin -MMD -fdollars-in-identifiers -I. -I../O.Common -I. -I.. -I../../../../include/os/vxWorks -I../../../../include       -I/usr/local/vw/tornado22-ppc/target/h  callbackTest_ctdt.c
/usr/local/vw/tornado22-ppc/host/x86-linux/bin/ldppc -r  -o callbackTest.munch callbackTest_ctdt.o callbackTest
Installing created file ../../../../bin/vxWorks-ppc604_long/callbackTest.munch
make[3]: Leaving directory `<https://jenkins.aps.anl.gov/job/epics-base-3.14-vx55/ws/src/db/test/O.vxWorks-ppc604_long'>
make[2]: Leaving directory `<https://jenkins.aps.anl.gov/job/epics-base-3.14-vx55/ws/src/db/test'>
make -C ./softIoc vxWorks-ppc604_long 
make[2]: Entering directory `<https://jenkins.aps.anl.gov/job/epics-base-3.14-vx55/ws/src/softIoc'>
perl ../../bin/linux-x86_64/makeMakefile.pl O.vxWorks-ppc604_long ../../..
make -C O.linux-x86_64 -f ../Makefile TOP=../../.. T_A=linux-x86_64
make[3]: Entering directory `<https://jenkins.aps.anl.gov/job/epics-base-3.14-vx55/ws/src/softIoc/O.linux-x86_64'>
make[3]: Nothing to be done for `all'.
make[3]: Leaving directory `<https://jenkins.aps.anl.gov/job/epics-base-3.14-vx55/ws/src/softIoc/O.linux-x86_64'>
make -C O.vxWorks-ppc604_long -f ../Makefile TOP=../../.. T_A=vxWorks-ppc604_long
make[3]: Entering directory `<https://jenkins.aps.anl.gov/job/epics-base-3.14-vx55/ws/src/softIoc/O.vxWorks-ppc604_long'>
perl ../../../bin/linux-x86_64/registerRecordDeviceDriver.pl ../O.Common/softIoc.dbd softIoc_registerRecordDeviceDriver <https://jenkins.aps.anl.gov/job/epics-base-3.14-vx55/ws/> > softIoc.tmp
mv softIoc.tmp softIoc_registerRecordDeviceDriver.cpp

/usr/local/vw/tornado22-ppc/host/x86-linux/bin/ccppc -c            -DCPU=PPC604  -DvxWorks=vxWorks -include /usr/local/vw/tornado22-ppc/target/h/vxWorks.h    -O2   -Wall     -mcpu=604 -mstrict-align -mno-implicit-fp -mlongcall -fno-implicit-templates   -fno-builtin  -MMD -I. -I../O.Common -I. -I.. -I../../../include/os/vxWorks -I../../../include       -I/usr/local/vw/tornado22-ppc/target/h softIoc_registerRecordDeviceDriver.cpp 
/usr/local/vw/tornado22-ppc/host/x86-linux/bin/ldppc -r -o softIoc  -L../../../lib/vxWorks-ppc604_long/          -L/usr/local/vw/tornado22-ppc/host/x86-linux/powerpc-wrs-vxworks/lib           softIoc_registerRecordDeviceDriver.o    -lrecIoc -lsoftDevIoc -lmiscIoc -lrsrvIoc -ldbtoolsIoc -lasIoc -ldbIoc -lregistryIoc -ldbStaticIoc -lca -lCom
/usr/local/vw/tornado22-ppc/host/x86-linux/bin/nmppc softIoc  > softIoc.nm
perl ../../../bin/linux-x86_64/munch.pl -o softIoc_ctdt.c softIoc.nm
/usr/local/vw/tornado22-ppc/host/x86-linux/bin/ccppc -c            -DCPU=PPC604  -DvxWorks=vxWorks -include /usr/local/vw/tornado22-ppc/target/h/vxWorks.h  -O2 -Wall -mcpu=604 -mstrict-align -mno-implicit-fp -mlongcall -fno-builtin -MMD -fdollars-in-identifiers -I. -I../O.Common -I. -I.. -I../../../include/os/vxWorks -I../../../include       -I/usr/local/vw/tornado22-ppc/target/h  softIoc_ctdt.c
/usr/local/vw/tornado22-ppc/host/x86-linux/bin/ldppc -r  -o softIoc.munch softIoc_ctdt.o softIoc
Installing created file ../../../bin/vxWorks-ppc604_long/softIoc.munch
make[3]: Leaving directory `<https://jenkins.aps.anl.gov/job/epics-base-3.14-vx55/ws/src/softIoc/O.vxWorks-ppc604_long'>
make[2]: Leaving directory `<https://jenkins.aps.anl.gov/job/epics-base-3.14-vx55/ws/src/softIoc'>
make -C ./gdd vxWorks-ppc604_long 
make[2]: Entering directory `<https://jenkins.aps.anl.gov/job/epics-base-3.14-vx55/ws/src/gdd'>
perl ../../bin/linux-x86_64/makeMakefile.pl O.vxWorks-ppc604_long ../../..
make -C O.linux-x86_64 -f ../Makefile TOP=../../.. T_A=linux-x86_64
make[3]: Entering directory `<https://jenkins.aps.anl.gov/job/epics-base-3.14-vx55/ws/src/gdd/O.linux-x86_64'>
g++   -O3 -g   -Wall     -fno-strict-aliasing  -m64      -MMD  -D_POSIX_C_SOURCE=199506L -D_POSIX_THREADS -D_XOPEN_SOURCE=500           -D_X86_64_  -DUNIX  -D_BSD_SOURCE -Dlinux  -D_REENTRANT  -c -o genApps.o ../genApps.cc
In file included from ../gdd.h:46,
                 from ../gddAppTable.h:21,
                 from ../genApps.cc:17:
../gddNewDel.h:24:24: error: epicsMutex.h: No such file or directory
../gddNewDel.h:25:24: error: epicsGuard.h: No such file or directory
../gddNewDel.h:26:25: error: epicsThread.h: No such file or directory
In file included from ../gddUtils.h:28,
                 from ../gdd.h:47,
                 from ../gddAppTable.h:21,
                 from ../genApps.cc:17:
../aitTypes.h:25:22: error: shareLib.h: No such file or directory
In file included from ../gdd.h:50,
                 from ../gddAppTable.h:21,
                 from ../genApps.cc:17:
../aitConvert.h:29:21: error: osiSock.h: No such file or directory
In file included from ../aitTypes.h:58,
                 from ../gddUtils.h:28,
                 from ../gdd.h:47,
                 from ../gddAppTable.h:21,
                 from ../genApps.cc:17:
../aitHelpers.h:45: error: variable ‘epicsShareClass aitTimeStamp’ has initializer but incomplete type
../aitHelpers.h:45: warning: extended initializer lists only available with -std=c++0x or -std=gnu++0x
../aitHelpers.h:46: error: expected primary-expression before ‘friend’
../aitHelpers.h:46: error: expected ‘}’ before ‘friend’
../aitHelpers.h:46: error: expected ‘,’ or ‘;’ before ‘friend’
../aitHelpers.h:47: error: ‘friend’ used outside of class
../aitHelpers.h:47: error: expected initializer before ‘operator’
../aitHelpers.h:48: error: ‘friend’ used outside of class
../aitHelpers.h:48: error: ISO C++ forbids declaration of ‘aitTimeStamp’ with no type
../aitHelpers.h:48: error: expected ‘,’ or ‘...’ before ‘&’ token
../aitHelpers.h:48: error: ‘int operator>=(int)’ must have an argument of class or enumerated type
../aitHelpers.h:49: error: ‘friend’ used outside of class
../aitHelpers.h:50: error: expected unqualified-id before ‘public’
../aitHelpers.h:52: error: ISO C++ forbids declaration of ‘aitTimeStamp’ with no type
../aitHelpers.h:52: error: expected ‘,’ or ‘...’ before ‘&’ token
../aitHelpers.h:52: error: ISO C++ forbids declaration of ‘aitTimeStamp’ with no type
../aitHelpers.h: In function ‘int aitTimeStamp(int)’:
../aitHelpers.h:52: error: only constructors take base initializers
../aitHelpers.h:52: error: ‘t’ was not declared in this scope
../aitHelpers.h:52: warning: no return statement in function returning non-void
../aitHelpers.h: At global scope:
../aitHelpers.h:53: error: ISO C++ forbids declaration of ‘aitTimeStamp’ with no type
../aitHelpers.h: In function ‘int aitTimeStamp(long unsigned int, long unsigned int)’:
../aitHelpers.h:54: error: only constructors take base initializers
../aitHelpers.h:57: error: invalid use of ‘this’ in non-member function
../aitHelpers.h:57: error: invalid use of ‘this’ in non-member function
../aitHelpers.h:58: error: invalid use of ‘this’ in non-member function
../aitHelpers.h:58: error: invalid use of ‘this’ in non-member function
../aitHelpers.h:60: warning: no return statement in function returning non-void
../aitHelpers.h: At global scope:
../aitHelpers.h:66: error: non-member function ‘void getTV(long int&, long int&)’ cannot have cv-qualifier
../aitHelpers.h: In function ‘void getTV(long int&, long int&)’:
../aitHelpers.h:68: error: invalid use of ‘this’ in non-member function
../aitHelpers.h:69: error: invalid use of ‘this’ in non-member function
../aitHelpers.h:70: error: invalid use of ‘this’ in non-member function
../aitHelpers.h:71: error: invalid use of ‘this’ in non-member function
../aitHelpers.h: At global scope:
../aitHelpers.h:77: error: non-member function ‘void get(long unsigned int&, long unsigned int&)’ cannot have cv-qualifier
../aitHelpers.h: In function ‘void get(long unsigned int&, long unsigned int&)’:
../aitHelpers.h:79: error: invalid use of ‘this’ in non-member function
../aitHelpers.h:80: error: invalid use of ‘this’ in non-member function
../aitHelpers.h: At global scope:
../aitHelpers.h:83: error: non-member function ‘operator double()’ cannot have cv-qualifier
../aitHelpers.h:83: error: ‘operator double()’ must be a nonstatic member function
../aitHelpers.h:88: error: non-member function ‘operator float()’ cannot have cv-qualifier
../aitHelpers.h:88: error: ‘operator float()’ must be a nonstatic member function
../aitHelpers.h:96: error: expected constructor, destructor, or type conversion before ‘;’ token
../aitHelpers.h:97: error: non-member function ‘void get(timespec&)’ cannot have cv-qualifier
../aitHelpers.h:98: error: expected constructor, destructor, or type conversion before ‘;’ token
../aitHelpers.h:99: error: expected constructor, destructor, or type conversion before ‘operator’
../aitHelpers.h:104: error: expected constructor, destructor, or type conversion before ‘;’ token
../aitHelpers.h:105: error: non-member function ‘void get(epicsTimeStamp&)’ cannot have cv-qualifier
../aitHelpers.h:106: error: expected constructor, destructor, or type conversion before ‘;’ token
../aitHelpers.h:107: error: expected constructor, destructor, or type conversion before ‘operator’
../aitHelpers.h:110: error: expected constructor, destructor, or type conversion before ‘;’ token
../aitHelpers.h:111: error: expected constructor, destructor, or type conversion before ‘operator’
../aitHelpers.h:112: error: expected constructor, destructor, or type conversion before ‘;’ token
../aitHelpers.h:114: error: ‘aitTimeStamp’ does not name a type
../aitHelpers.h:119: error: expected unqualified-id before ‘private’
../aitHelpers.h:121: error: expected declaration before ‘}’ token
make[3]: *** [genApps.o] Error 1
make[3]: Leaving directory `<https://jenkins.aps.anl.gov/job/epics-base-3.14-vx55/ws/src/gdd/O.linux-x86_64'>
make[2]: *** [linux-x86_64] Error 2
make[2]: Leaving directory `<https://jenkins.aps.anl.gov/job/epics-base-3.14-vx55/ws/src/gdd'>
make[1]: *** [gdd.vxWorks-ppc604_long] Error 2
make[1]: Leaving directory `<https://jenkins.aps.anl.gov/job/epics-base-3.14-vx55/ws/src'>
make: *** [src.vxWorks-ppc604_long] Error 2
Build step 'Execute shell' marked build as failure
[WARNINGS] Skipping publisher since build result is FAILURE


Replies:
Jenkins build is back to normal : epics-base-3.14-vx55 #15 APS Jenkins
References:
Build failed in Jenkins: epics-base-3.14-vx55 #13 APS Jenkins

Navigate by Date:
Prev: Build failed in Jenkins: epics-base-3.14 #64 APS Jenkins
Next: Build failed in Jenkins: epics-base-3.14-rtems #13 APS Jenkins
Index: 2002  2003  2004  2005  2006  2007  2008  2009  2010  2011  2012  2013  <20142015  2016  2017  2018  2019  2020  2021  2022 
Navigate by Thread:
Prev: Build failed in Jenkins: epics-base-3.14-vx55 #13 APS Jenkins
Next: Jenkins build is back to normal : epics-base-3.14-vx55 #15 APS Jenkins
Index: 2002  2003  2004  2005  2006  2007  2008  2009  2010  2011  2012  2013  <20142015  2016  2017  2018  2019  2020  2021  2022