EPICS Controls Argonne National Laboratory

Experimental Physics and
Industrial Control System

2002  2003  2004  2005  2006  2007  2008  2009  2010  2011  2012  2013  <20142015  2016  2017  2018  2019  2020  2021  2022  Index 2002  2003  2004  2005  2006  2007  2008  2009  2010  2011  2012  2013  <20142015  2016  2017  2018  2019  2020  2021  2022 
<== Date ==> <== Thread ==>

Subject: Build failed in Jenkins: epics-base-3.14-rtems #13
From: APS Jenkins <[email protected]>
To: [email protected]
Date: Wed, 9 Apr 2014 17:07:14 -0500 (CDT)
See <https://jenkins.aps.anl.gov/job/epics-base-3.14-rtems/13/>

------------------------------------------
[...truncated 879 lines...]
make[2]: Entering directory `<https://jenkins.aps.anl.gov/job/epics-base-3.14-rtems/ws/src/RTEMS'>
make -C ./base RTEMS-uC5282 
make[3]: Entering directory `<https://jenkins.aps.anl.gov/job/epics-base-3.14-rtems/ws/src/RTEMS/base'>
perl ../../../bin/linux-x86_64/makeMakefile.pl O.RTEMS-uC5282 ../../../..
make -C O.linux-x86_64 -f ../Makefile TOP=../../../.. T_A=linux-x86_64
make[4]: Entering directory `<https://jenkins.aps.anl.gov/job/epics-base-3.14-rtems/ws/src/RTEMS/base/O.linux-x86_64'>
make[4]: Nothing to be done for `all'.
make[4]: Leaving directory `<https://jenkins.aps.anl.gov/job/epics-base-3.14-rtems/ws/src/RTEMS/base/O.linux-x86_64'>
make -C O.RTEMS-uC5282 -f ../Makefile TOP=../../../.. T_A=RTEMS-uC5282
make[4]: Entering directory `<https://jenkins.aps.anl.gov/job/epics-base-3.14-rtems/ws/src/RTEMS/base/O.RTEMS-uC5282'>

/usr/local/rtems/rtems-4.10.2/bin/m68k-rtems4.10.2-gcc --pipe -B/usr/local/rtems/rtems-4.10.2/m68k-rtems4.10.2/uC5282/lib/ -specs bsp_specs -qrtems   -fasm -c   -mcpu=5282              -DUNIX     -O2 -g -g  -Wall      -DMY_DO_BOOTP=NULL      -MMD -I. -I../O.Common -I. -I.. -I../../../../include/os/RTEMS -I../../../../include        ../rtems_init.c 

/usr/local/rtems/rtems-4.10.2/bin/m68k-rtems4.10.2-gcc --pipe -B/usr/local/rtems/rtems-4.10.2/m68k-rtems4.10.2/uC5282/lib/ -specs bsp_specs -qrtems   -fasm -c   -mcpu=5282              -DUNIX     -O2 -g -g  -Wall      -DMY_DO_BOOTP=NULL      -MMD -I. -I../O.Common -I. -I.. -I../../../../include/os/RTEMS -I../../../../include        ../rtems_config.c 

/usr/local/rtems/rtems-4.10.2/bin/m68k-rtems4.10.2-gcc --pipe -B/usr/local/rtems/rtems-4.10.2/m68k-rtems4.10.2/uC5282/lib/ -specs bsp_specs -qrtems   -fasm -c   -mcpu=5282              -DUNIX     -O2 -g -g  -Wall      -DMY_DO_BOOTP=NULL      -MMD -I. -I../O.Common -I. -I.. -I../../../../include/os/RTEMS -I../../../../include        ../rtems_netconfig.c 

/usr/local/rtems/rtems-4.10.2/bin/m68k-rtems4.10.2-gcc --pipe -B/usr/local/rtems/rtems-4.10.2/m68k-rtems4.10.2/uC5282/lib/ -specs bsp_specs -qrtems   -fasm -c   -mcpu=5282              -DUNIX     -O2 -g -g  -Wall      -DMY_DO_BOOTP=NULL      -MMD -I. -I../O.Common -I. -I.. -I../../../../include/os/RTEMS -I../../../../include        ../rtems_util.c 

/usr/local/rtems/rtems-4.10.2/bin/m68k-rtems4.10.2-gcc --pipe -B/usr/local/rtems/rtems-4.10.2/m68k-rtems4.10.2/uC5282/lib/ -specs bsp_specs -qrtems   -fasm -c   -mcpu=5282              -DUNIX     -O2 -g -g  -Wall      -DMY_DO_BOOTP=NULL      -MMD -I. -I../O.Common -I. -I.. -I../../../../include/os/RTEMS -I../../../../include        ../setBootConfigFromNVRAM.c 
../setBootConfigFromNVRAM.c: In function 'setBootConfigFromNVRAM':
../setBootConfigFromNVRAM.c:350: warning: assignment discards qualifiers from pointer target type
../setBootConfigFromNVRAM.c: At top level:
../setBootConfigFromNVRAM.c:42: warning: 'splitRtemsBsdnetBootpCmdline' defined but not used

/usr/local/rtems/rtems-4.10.2/bin/m68k-rtems4.10.2-gcc --pipe -B/usr/local/rtems/rtems-4.10.2/m68k-rtems4.10.2/uC5282/lib/ -specs bsp_specs -qrtems   -fasm -c   -mcpu=5282              -DUNIX     -O2 -g -g  -Wall      -DMY_DO_BOOTP=NULL      -MMD -I. -I../O.Common -I. -I.. -I../../../../include/os/RTEMS -I../../../../include        ../epicsRtemsInitHookPre.c 

/usr/local/rtems/rtems-4.10.2/bin/m68k-rtems4.10.2-gcc --pipe -B/usr/local/rtems/rtems-4.10.2/m68k-rtems4.10.2/uC5282/lib/ -specs bsp_specs -qrtems   -fasm -c   -mcpu=5282              -DUNIX     -O2 -g -g  -Wall      -DMY_DO_BOOTP=NULL      -MMD -I. -I../O.Common -I. -I.. -I../../../../include/os/RTEMS -I../../../../include        ../epicsRtemsInitHookPost.c 
/usr/local/rtems/rtems-4.10.2/bin/m68k-rtems4.10.2-ar rc  librtemsCom.a        rtems_init.o rtems_config.o rtems_netconfig.o rtems_util.o setBootConfigFromNVRAM.o epicsRtemsInitHookPre.o epicsRtemsInitHookPost.o 
/usr/local/rtems/rtems-4.10.2/bin/m68k-rtems4.10.2-ranlib librtemsCom.a
echo "Installing library ../../../../lib/RTEMS-uC5282/librtemsCom.a"
Installing library ../../../../lib/RTEMS-uC5282/librtemsCom.a
make[4]: Leaving directory `<https://jenkins.aps.anl.gov/job/epics-base-3.14-rtems/ws/src/RTEMS/base/O.RTEMS-uC5282'>
make[3]: Leaving directory `<https://jenkins.aps.anl.gov/job/epics-base-3.14-rtems/ws/src/RTEMS/base'>
make[2]: Leaving directory `<https://jenkins.aps.anl.gov/job/epics-base-3.14-rtems/ws/src/RTEMS'>
make -C libCom/test RTEMS-uC5282 
make[2]: Entering directory `<https://jenkins.aps.anl.gov/job/epics-base-3.14-rtems/ws/src/libCom/test'>
perl ../../../bin/linux-x86_64/makeMakefile.pl O.RTEMS-uC5282 ../../../..
make -C O.linux-x86_64 -f ../Makefile TOP=../../../.. T_A=linux-x86_64
make[3]: Entering directory `<https://jenkins.aps.anl.gov/job/epics-base-3.14-rtems/ws/src/libCom/test/O.linux-x86_64'>
make[3]: Nothing to be done for `all'.
make[3]: Leaving directory `<https://jenkins.aps.anl.gov/job/epics-base-3.14-rtems/ws/src/libCom/test/O.linux-x86_64'>
make -C O.RTEMS-uC5282 -f ../Makefile TOP=../../../.. T_A=RTEMS-uC5282
make[3]: Entering directory `<https://jenkins.aps.anl.gov/job/epics-base-3.14-rtems/ws/src/libCom/test/O.RTEMS-uC5282'>

/usr/local/rtems/rtems-4.10.2/bin/m68k-rtems4.10.2-gcc --pipe -B/usr/local/rtems/rtems-4.10.2/m68k-rtems4.10.2/uC5282/lib/ -specs bsp_specs -qrtems   -fasm -c   -mcpu=5282              -DUNIX     -O2 -g -g  -Wall      -DMY_DO_BOOTP=NULL      -MMD -I. -I../O.Common -I. -I.. -I../../../../include/os/RTEMS -I../../../../include        ../rtemsTestHarness.c 

/usr/local/rtems/rtems-4.10.2/bin/m68k-rtems4.10.2-g++ -B/usr/local/rtems/rtems-4.10.2/m68k-rtems4.10.2/uC5282/lib/ -specs bsp_specs -qrtems   -c   -mcpu=5282              -DUNIX     -O2 -g -g  -Wall      -DMY_DO_BOOTP=NULL     -MMD -I. -I../O.Common -I. -I.. -I../../../../include/os/RTEMS -I../../../../include        ../epicsCalcTest.cpp 

/usr/local/rtems/rtems-4.10.2/bin/m68k-rtems4.10.2-g++ -B/usr/local/rtems/rtems-4.10.2/m68k-rtems4.10.2/uC5282/lib/ -specs bsp_specs -qrtems   -c   -mcpu=5282              -DUNIX     -O2 -g -g  -Wall      -DMY_DO_BOOTP=NULL     -MMD -I. -I../O.Common -I. -I.. -I../../../../include/os/RTEMS -I../../../../include        ../epicsAlgorithmTest.cpp 

/usr/local/rtems/rtems-4.10.2/bin/m68k-rtems4.10.2-gcc --pipe -B/usr/local/rtems/rtems-4.10.2/m68k-rtems4.10.2/uC5282/lib/ -specs bsp_specs -qrtems   -fasm -c   -mcpu=5282              -DUNIX     -O2 -g -g  -Wall      -DMY_DO_BOOTP=NULL      -MMD -I. -I../O.Common -I. -I.. -I../../../../include/os/RTEMS -I../../../../include        ../epicsMathTest.c 

/usr/local/rtems/rtems-4.10.2/bin/m68k-rtems4.10.2-gcc --pipe -B/usr/local/rtems/rtems-4.10.2/m68k-rtems4.10.2/uC5282/lib/ -specs bsp_specs -qrtems   -fasm -c   -mcpu=5282              -DUNIX     -O2 -g -g  -Wall      -DMY_DO_BOOTP=NULL      -MMD -I. -I../O.Common -I. -I.. -I../../../../include/os/RTEMS -I../../../../include        ../epicsEllTest.c 

/usr/local/rtems/rtems-4.10.2/bin/m68k-rtems4.10.2-gcc --pipe -B/usr/local/rtems/rtems-4.10.2/m68k-rtems4.10.2/uC5282/lib/ -specs bsp_specs -qrtems   -fasm -c   -mcpu=5282              -DUNIX     -O2 -g -g  -Wall      -DMY_DO_BOOTP=NULL      -MMD -I. -I../O.Common -I. -I.. -I../../../../include/os/RTEMS -I../../../../include        ../epicsEnvTest.c 

/usr/local/rtems/rtems-4.10.2/bin/m68k-rtems4.10.2-gcc --pipe -B/usr/local/rtems/rtems-4.10.2/m68k-rtems4.10.2/uC5282/lib/ -specs bsp_specs -qrtems   -fasm -c   -mcpu=5282              -DUNIX     -O2 -g -g  -Wall      -DMY_DO_BOOTP=NULL      -MMD -I. -I../O.Common -I. -I.. -I../../../../include/os/RTEMS -I../../../../include        ../epicsErrlogTest.c 

/usr/local/rtems/rtems-4.10.2/bin/m68k-rtems4.10.2-gcc --pipe -B/usr/local/rtems/rtems-4.10.2/m68k-rtems4.10.2/uC5282/lib/ -specs bsp_specs -qrtems   -fasm -c   -mcpu=5282              -DUNIX     -O2 -g -g  -Wall      -DMY_DO_BOOTP=NULL      -MMD -I. -I../O.Common -I. -I.. -I../../../../include/os/RTEMS -I../../../../include        ../epicsStdioTest.c 

/usr/local/rtems/rtems-4.10.2/bin/m68k-rtems4.10.2-gcc --pipe -B/usr/local/rtems/rtems-4.10.2/m68k-rtems4.10.2/uC5282/lib/ -specs bsp_specs -qrtems   -fasm -c   -mcpu=5282              -DUNIX     -O2 -g -g  -Wall      -DMY_DO_BOOTP=NULL      -MMD -I. -I../O.Common -I. -I.. -I../../../../include/os/RTEMS -I../../../../include        ../epicsSockResolveTest.c 

/usr/local/rtems/rtems-4.10.2/bin/m68k-rtems4.10.2-gcc --pipe -B/usr/local/rtems/rtems-4.10.2/m68k-rtems4.10.2/uC5282/lib/ -specs bsp_specs -qrtems   -fasm -c   -mcpu=5282              -DUNIX     -O2 -g -g  -Wall      -DMY_DO_BOOTP=NULL      -MMD -I. -I../O.Common -I. -I.. -I../../../../include/os/RTEMS -I../../../../include        ../epicsStringTest.c 

/usr/local/rtems/rtems-4.10.2/bin/m68k-rtems4.10.2-g++ -B/usr/local/rtems/rtems-4.10.2/m68k-rtems4.10.2/uC5282/lib/ -specs bsp_specs -qrtems   -c   -mcpu=5282              -DUNIX     -O2 -g -g  -Wall      -DMY_DO_BOOTP=NULL     -MMD -I. -I../O.Common -I. -I.. -I../../../../include/os/RTEMS -I../../../../include        ../epicsTimeTest.cpp 

/usr/local/rtems/rtems-4.10.2/bin/m68k-rtems4.10.2-g++ -B/usr/local/rtems/rtems-4.10.2/m68k-rtems4.10.2/uC5282/lib/ -specs bsp_specs -qrtems   -c   -mcpu=5282              -DUNIX     -O2 -g -g  -Wall      -DMY_DO_BOOTP=NULL     -MMD -I. -I../O.Common -I. -I.. -I../../../../include/os/RTEMS -I../../../../include        ../epicsThreadTest.cpp 

/usr/local/rtems/rtems-4.10.2/bin/m68k-rtems4.10.2-gcc --pipe -B/usr/local/rtems/rtems-4.10.2/m68k-rtems4.10.2/uC5282/lib/ -specs bsp_specs -qrtems   -fasm -c   -mcpu=5282              -DUNIX     -O2 -g -g  -Wall      -DMY_DO_BOOTP=NULL      -MMD -I. -I../O.Common -I. -I.. -I../../../../include/os/RTEMS -I../../../../include        ../epicsThreadOnceTest.c 

/usr/local/rtems/rtems-4.10.2/bin/m68k-rtems4.10.2-g++ -B/usr/local/rtems/rtems-4.10.2/m68k-rtems4.10.2/uC5282/lib/ -specs bsp_specs -qrtems   -c   -mcpu=5282              -DUNIX     -O2 -g -g  -Wall      -DMY_DO_BOOTP=NULL     -MMD -I. -I../O.Common -I. -I.. -I../../../../include/os/RTEMS -I../../../../include        ../epicsThreadPriorityTest.cpp 

/usr/local/rtems/rtems-4.10.2/bin/m68k-rtems4.10.2-g++ -B/usr/local/rtems/rtems-4.10.2/m68k-rtems4.10.2/uC5282/lib/ -specs bsp_specs -qrtems   -c   -mcpu=5282              -DUNIX     -O2 -g -g  -Wall      -DMY_DO_BOOTP=NULL     -MMD -I. -I../O.Common -I. -I.. -I../../../../include/os/RTEMS -I../../../../include        ../epicsThreadPrivateTest.cpp 

/usr/local/rtems/rtems-4.10.2/bin/m68k-rtems4.10.2-gcc --pipe -B/usr/local/rtems/rtems-4.10.2/m68k-rtems4.10.2/uC5282/lib/ -specs bsp_specs -qrtems   -fasm -c   -mcpu=5282              -DUNIX     -O2 -g -g  -Wall      -DMY_DO_BOOTP=NULL      -MMD -I. -I../O.Common -I. -I.. -I../../../../include/os/RTEMS -I../../../../include        ../epicsExitTest.c 

/usr/local/rtems/rtems-4.10.2/bin/m68k-rtems4.10.2-g++ -B/usr/local/rtems/rtems-4.10.2/m68k-rtems4.10.2/uC5282/lib/ -specs bsp_specs -qrtems   -c   -mcpu=5282              -DUNIX     -O2 -g -g  -Wall      -DMY_DO_BOOTP=NULL     -MMD -I. -I../O.Common -I. -I.. -I../../../../include/os/RTEMS -I../../../../include        ../epicsTimerTest.cpp 

/usr/local/rtems/rtems-4.10.2/bin/m68k-rtems4.10.2-gcc --pipe -B/usr/local/rtems/rtems-4.10.2/m68k-rtems4.10.2/uC5282/lib/ -specs bsp_specs -qrtems   -fasm -c   -mcpu=5282              -DUNIX     -O2 -g -g  -Wall      -DMY_DO_BOOTP=NULL      -MMD -I. -I../O.Common -I. -I.. -I../../../../include/os/RTEMS -I../../../../include        ../ringPointerTest.c 

/usr/local/rtems/rtems-4.10.2/bin/m68k-rtems4.10.2-gcc --pipe -B/usr/local/rtems/rtems-4.10.2/m68k-rtems4.10.2/uC5282/lib/ -specs bsp_specs -qrtems   -fasm -c   -mcpu=5282              -DUNIX     -O2 -g -g  -Wall      -DMY_DO_BOOTP=NULL      -MMD -I. -I../O.Common -I. -I.. -I../../../../include/os/RTEMS -I../../../../include        ../ringBytesTest.c 

/usr/local/rtems/rtems-4.10.2/bin/m68k-rtems4.10.2-g++ -B/usr/local/rtems/rtems-4.10.2/m68k-rtems4.10.2/uC5282/lib/ -specs bsp_specs -qrtems   -c   -mcpu=5282              -DUNIX     -O2 -g -g  -Wall      -DMY_DO_BOOTP=NULL     -MMD -I. -I../O.Common -I. -I.. -I../../../../include/os/RTEMS -I../../../../include        ../epicsEventTest.cpp 

/usr/local/rtems/rtems-4.10.2/bin/m68k-rtems4.10.2-g++ -B/usr/local/rtems/rtems-4.10.2/m68k-rtems4.10.2/uC5282/lib/ -specs bsp_specs -qrtems   -c   -mcpu=5282              -DUNIX     -O2 -g -g  -Wall      -DMY_DO_BOOTP=NULL     -MMD -I. -I../O.Common -I. -I.. -I../../../../include/os/RTEMS -I../../../../include        ../epicsMutexTest.cpp 

/usr/local/rtems/rtems-4.10.2/bin/m68k-rtems4.10.2-g++ -B/usr/local/rtems/rtems-4.10.2/m68k-rtems4.10.2/uC5282/lib/ -specs bsp_specs -qrtems   -c   -mcpu=5282              -DUNIX     -O2 -g -g  -Wall      -DMY_DO_BOOTP=NULL     -MMD -I. -I../O.Common -I. -I.. -I../../../../include/os/RTEMS -I../../../../include        ../epicsExceptionTest.cpp 

/usr/local/rtems/rtems-4.10.2/bin/m68k-rtems4.10.2-gcc --pipe -B/usr/local/rtems/rtems-4.10.2/m68k-rtems4.10.2/uC5282/lib/ -specs bsp_specs -qrtems   -fasm -c   -mcpu=5282              -DUNIX     -O2 -g -g  -Wall      -DMY_DO_BOOTP=NULL      -MMD -I. -I../O.Common -I. -I.. -I../../../../include/os/RTEMS -I../../../../include        ../macEnvExpandTest.c 

/usr/local/rtems/rtems-4.10.2/bin/m68k-rtems4.10.2-gcc --pipe -B/usr/local/rtems/rtems-4.10.2/m68k-rtems4.10.2/uC5282/lib/ -specs bsp_specs -qrtems   -fasm -c   -mcpu=5282              -DUNIX     -O2 -g -g  -Wall      -DMY_DO_BOOTP=NULL      -MMD -I. -I../O.Common -I. -I.. -I../../../../include/os/RTEMS -I../../../../include        ../macLibTest.c 

/usr/local/rtems/rtems-4.10.2/bin/m68k-rtems4.10.2-gcc --pipe -B/usr/local/rtems/rtems-4.10.2/m68k-rtems4.10.2/uC5282/lib/ -specs bsp_specs -qrtems   -fasm -c   -mcpu=5282              -DUNIX     -O2 -g -g  -Wall      -DMY_DO_BOOTP=NULL      -MMD -I. -I../O.Common -I. -I.. -I../../../../include/os/RTEMS -I../../../../include        ../taskwdTest.c 

/usr/local/rtems/rtems-4.10.2/bin/m68k-rtems4.10.2-g++ -B/usr/local/rtems/rtems-4.10.2/m68k-rtems4.10.2/uC5282/lib/ -specs bsp_specs -qrtems   -c   -mcpu=5282              -DUNIX     -O2 -g -g  -Wall      -DMY_DO_BOOTP=NULL     -MMD -I. -I../O.Common -I. -I.. -I../../../../include/os/RTEMS -I../../../../include        ../blockingSockTest.cpp 

/usr/local/rtems/rtems-4.10.2/bin/m68k-rtems4.10.2-g++ -B/usr/local/rtems/rtems-4.10.2/m68k-rtems4.10.2/uC5282/lib/ -specs bsp_specs -qrtems   -c   -mcpu=5282              -DUNIX     -O2 -g -g  -Wall      -DMY_DO_BOOTP=NULL     -MMD -I. -I../O.Common -I. -I.. -I../../../../include/os/RTEMS -I../../../../include        ../epicsMessageQueueTest.cpp 

/usr/local/rtems/rtems-4.10.2/bin/m68k-rtems4.10.2-gcc --pipe -B/usr/local/rtems/rtems-4.10.2/m68k-rtems4.10.2/uC5282/lib/ -specs bsp_specs -qrtems   -fasm -c   -mcpu=5282              -DUNIX     -O2 -g -g  -Wall      -DMY_DO_BOOTP=NULL      -MMD -I. -I../O.Common -I. -I.. -I../../../../include/os/RTEMS -I../../../../include        ../epicsRunLibComTests.c 

/usr/local/rtems/rtems-4.10.2/bin/m68k-rtems4.10.2-g++ -B/usr/local/rtems/rtems-4.10.2/m68k-rtems4.10.2/uC5282/lib/ -specs bsp_specs -qrtems   -c   -mcpu=5282              -DUNIX     -O2 -g -g  -Wall      -DMY_DO_BOOTP=NULL     -MMD -I. -I../O.Common -I. -I.. -I../../../../include/os/RTEMS -I../../../../include        ../epicsThreadPerform.cpp 

/usr/local/rtems/rtems-4.10.2/bin/m68k-rtems4.10.2-gcc --pipe -B/usr/local/rtems/rtems-4.10.2/m68k-rtems4.10.2/uC5282/lib/ -specs bsp_specs -qrtems   -fasm -c   -mcpu=5282              -DUNIX     -O2 -g -g  -Wall      -DMY_DO_BOOTP=NULL      -MMD -I. -I../O.Common -I. -I.. -I../../../../include/os/RTEMS -I../../../../include        ../epicsMaxThreads.c 

/usr/local/rtems/rtems-4.10.2/bin/m68k-rtems4.10.2-gcc --pipe -B/usr/local/rtems/rtems-4.10.2/m68k-rtems4.10.2/uC5282/lib/ -specs bsp_specs -qrtems   -fasm -c   -mcpu=5282              -DUNIX     -O2 -g -g  -Wall      -DMY_DO_BOOTP=NULL      -MMD -I. -I../O.Common -I. -I.. -I../../../../include/os/RTEMS -I../../../../include        ../buckTest.c 

/usr/local/rtems/rtems-4.10.2/bin/m68k-rtems4.10.2-g++ -B/usr/local/rtems/rtems-4.10.2/m68k-rtems4.10.2/uC5282/lib/ -specs bsp_specs -qrtems   -c   -mcpu=5282              -DUNIX     -O2 -g -g  -Wall      -DMY_DO_BOOTP=NULL     -MMD -I. -I../O.Common -I. -I.. -I../../../../include/os/RTEMS -I../../../../include        ../cvtFastPerform.cpp 
/usr/local/rtems/rtems-4.10.2/bin/m68k-rtems4.10.2-g++ -B/usr/local/rtems/rtems-4.10.2/m68k-rtems4.10.2/uC5282/lib/ -specs bsp_specs -qrtems   -o rtemsTestHarness -static -L<https://jenkins.aps.anl.gov/job/epics-base-3.14-rtems/ws/lib/RTEMS-uC5282>         -mcpu=5282 -u Init /usr/local/rtems/rtems-4.10.2/m68k-rtems4.10.2/uC5282/lib/no-dpmem.rel /usr/local/rtems/rtems-4.10.2/m68k-rtems4.10.2/uC5282/lib/no-mp.rel /usr/local/rtems/rtems-4.10.2/m68k-rtems4.10.2/uC5282/lib/no-part.rel /usr/local/rtems/rtems-4.10.2/m68k-rtems4.10.2/uC5282/lib/no-signal.rel /usr/local/rtems/rtems-4.10.2/m68k-rtems4.10.2/uC5282/lib/no-rtmon.rel            rtemsTestHarness.o epicsCalcTest.o epicsAlgorithmTest.o epicsMathTest.o epicsEllTest.o epicsEnvTest.o epicsErrlogTest.o epicsStdioTest.o epicsSockResolveTest.o epicsStringTest.o epicsTimeTest.o epicsThreadTest.o epicsThreadOnceTest.o epicsThreadPriorityTest.o epicsThreadPrivateTest.o epicsExitTest.o epicsTimerTest.o ringPointerTest.o ringBytesTest.!
 o epicsEventTest.o epicsMutexTest.o epicsExceptionTest.o macEnvExpandTest.o macLibTest.o taskwdTest.o blockingSockTest.o epicsMessageQueueTest.o epicsRunLibComTests.o epicsThreadPerform.o epicsMaxThreads.o buckTest.o cvtFastPerform.o    -lCom      -lreadline -lncurses -lm -lrtemsCom -lc -lrtemscpu -lCom -lnfs -lm
/usr/local/rtems/rtems-4.10.2/bin/m68k-rtems4.10.2-objcopy -O binary -R .comment -S rtemsTestHarness rtemsTestHarness.boot
echo "Installing created file ../../../../bin/RTEMS-uC5282/rtemsTestHarness"
Installing created file ../../../../bin/RTEMS-uC5282/rtemsTestHarness
mkdir ../../../../bin/RTEMS-uC5282
echo "Installing created file ../../../../bin/RTEMS-uC5282/rtemsTestHarness.boot"
Installing created file ../../../../bin/RTEMS-uC5282/rtemsTestHarness.boot
make[3]: Leaving directory `<https://jenkins.aps.anl.gov/job/epics-base-3.14-rtems/ws/src/libCom/test/O.RTEMS-uC5282'>
make[2]: Leaving directory `<https://jenkins.aps.anl.gov/job/epics-base-3.14-rtems/ws/src/libCom/test'>
make -C db/test RTEMS-uC5282 
make[2]: Entering directory `<https://jenkins.aps.anl.gov/job/epics-base-3.14-rtems/ws/src/db/test'>
perl ../../../bin/linux-x86_64/makeMakefile.pl O.RTEMS-uC5282 ../../../..
make -C O.linux-x86_64 -f ../Makefile TOP=../../../.. T_A=linux-x86_64
make[3]: Entering directory `<https://jenkins.aps.anl.gov/job/epics-base-3.14-rtems/ws/src/db/test/O.linux-x86_64'>
make[3]: Nothing to be done for `all'.
make[3]: Leaving directory `<https://jenkins.aps.anl.gov/job/epics-base-3.14-rtems/ws/src/db/test/O.linux-x86_64'>
make -C O.RTEMS-uC5282 -f ../Makefile TOP=../../../.. T_A=RTEMS-uC5282
make[3]: Entering directory `<https://jenkins.aps.anl.gov/job/epics-base-3.14-rtems/ws/src/db/test/O.RTEMS-uC5282'>
make[3]: Leaving directory `<https://jenkins.aps.anl.gov/job/epics-base-3.14-rtems/ws/src/db/test/O.RTEMS-uC5282'>
make[2]: Leaving directory `<https://jenkins.aps.anl.gov/job/epics-base-3.14-rtems/ws/src/db/test'>
make -C ./softIoc RTEMS-uC5282 
make[2]: Entering directory `<https://jenkins.aps.anl.gov/job/epics-base-3.14-rtems/ws/src/softIoc'>
perl ../../bin/linux-x86_64/makeMakefile.pl O.RTEMS-uC5282 ../../..
make -C O.linux-x86_64 -f ../Makefile TOP=../../.. T_A=linux-x86_64
make[3]: Entering directory `<https://jenkins.aps.anl.gov/job/epics-base-3.14-rtems/ws/src/softIoc/O.linux-x86_64'>
make[3]: Nothing to be done for `all'.
make[3]: Leaving directory `<https://jenkins.aps.anl.gov/job/epics-base-3.14-rtems/ws/src/softIoc/O.linux-x86_64'>
make -C O.RTEMS-uC5282 -f ../Makefile TOP=../../.. T_A=RTEMS-uC5282
make[3]: Entering directory `<https://jenkins.aps.anl.gov/job/epics-base-3.14-rtems/ws/src/softIoc/O.RTEMS-uC5282'>
perl ../../../bin/linux-x86_64/registerRecordDeviceDriver.pl ../O.Common/softIoc.dbd softIoc_registerRecordDeviceDriver <https://jenkins.aps.anl.gov/job/epics-base-3.14-rtems/ws/> > softIoc.tmp
/bin/mv softIoc.tmp softIoc_registerRecordDeviceDriver.cpp

/usr/local/rtems/rtems-4.10.2/bin/m68k-rtems4.10.2-g++ -B/usr/local/rtems/rtems-4.10.2/m68k-rtems4.10.2/uC5282/lib/ -specs bsp_specs -qrtems   -c   -mcpu=5282              -DUNIX     -O2 -g -g  -Wall      -DMY_DO_BOOTP=NULL     -MMD -I. -I../O.Common -I. -I.. -I../../../include/os/RTEMS -I../../../include        softIoc_registerRecordDeviceDriver.cpp 
echo "FINAL_LOCATION=<https://jenkins.aps.anl.gov/job/epics-base-3.14-rtems/ws/";>
FINAL_LOCATION=<https://jenkins.aps.anl.gov/job/epics-base-3.14-rtems/ws/>
perl ../makeInstallDir.pl '<https://jenkins.aps.anl.gov/job/epics-base-3.14-rtems/ws/'> > epicsInstallDir.h

/usr/local/rtems/rtems-4.10.2/bin/m68k-rtems4.10.2-g++ -B/usr/local/rtems/rtems-4.10.2/m68k-rtems4.10.2/uC5282/lib/ -specs bsp_specs -qrtems   -c   -mcpu=5282              -DUNIX     -O2 -g -g  -Wall      -DMY_DO_BOOTP=NULL     -MMD -I. -I../O.Common -I. -I.. -I../../../include/os/RTEMS -I../../../include        ../softMain.cpp 
/usr/local/rtems/rtems-4.10.2/bin/m68k-rtems4.10.2-g++ -B/usr/local/rtems/rtems-4.10.2/m68k-rtems4.10.2/uC5282/lib/ -specs bsp_specs -qrtems   -o softIoc -static -L<https://jenkins.aps.anl.gov/job/epics-base-3.14-rtems/ws/lib/RTEMS-uC5282>         -mcpu=5282 -u Init /usr/local/rtems/rtems-4.10.2/m68k-rtems4.10.2/uC5282/lib/no-dpmem.rel /usr/local/rtems/rtems-4.10.2/m68k-rtems4.10.2/uC5282/lib/no-mp.rel /usr/local/rtems/rtems-4.10.2/m68k-rtems4.10.2/uC5282/lib/no-part.rel /usr/local/rtems/rtems-4.10.2/m68k-rtems4.10.2/uC5282/lib/no-signal.rel /usr/local/rtems/rtems-4.10.2/m68k-rtems4.10.2/uC5282/lib/no-rtmon.rel            softIoc_registerRecordDeviceDriver.o softMain.o    -lrecIoc -lsoftDevIoc -lmiscIoc -lrsrvIoc -ldbtoolsIoc -lasIoc -ldbIoc -lregistryIoc -ldbStaticIoc -lca -lCom      -lreadline -lncurses -lm -lrtemsCom -lc -lrtemscpu -lCom -lnfs -lm
/usr/local/rtems/rtems-4.10.2/bin/m68k-rtems4.10.2-objcopy -O binary -R .comment -S softIoc softIoc.boot
echo "Installing created file ../../../bin/RTEMS-uC5282/softIoc"
Installing created file ../../../bin/RTEMS-uC5282/softIoc
echo "Installing created file ../../../bin/RTEMS-uC5282/softIoc.boot"
Installing created file ../../../bin/RTEMS-uC5282/softIoc.boot
make[3]: Leaving directory `<https://jenkins.aps.anl.gov/job/epics-base-3.14-rtems/ws/src/softIoc/O.RTEMS-uC5282'>
make[2]: Leaving directory `<https://jenkins.aps.anl.gov/job/epics-base-3.14-rtems/ws/src/softIoc'>
make -C ./gdd RTEMS-uC5282 
make[2]: Entering directory `<https://jenkins.aps.anl.gov/job/epics-base-3.14-rtems/ws/src/gdd'>
perl ../../bin/linux-x86_64/makeMakefile.pl O.RTEMS-uC5282 ../../..
make -C O.linux-x86_64 -f ../Makefile TOP=../../.. T_A=linux-x86_64
make[3]: Entering directory `<https://jenkins.aps.anl.gov/job/epics-base-3.14-rtems/ws/src/gdd/O.linux-x86_64'>
g++   -O3 -g   -Wall     -fno-strict-aliasing  -m64      -MMD  -D_POSIX_C_SOURCE=199506L -D_POSIX_THREADS -D_XOPEN_SOURCE=500           -D_X86_64_  -DUNIX  -D_BSD_SOURCE -Dlinux  -D_REENTRANT  -c -o genApps.o ../genApps.cc
In file included from ../gdd.h:46,
                 from ../gddAppTable.h:21,
                 from ../genApps.cc:17:
../gddNewDel.h:24:24: error: epicsMutex.h: No such file or directory
../gddNewDel.h:25:24: error: epicsGuard.h: No such file or directory
../gddNewDel.h:26:25: error: epicsThread.h: No such file or directory
In file included from ../gddUtils.h:28,
                 from ../gdd.h:47,
                 from ../gddAppTable.h:21,
                 from ../genApps.cc:17:
../aitTypes.h:25:22: error: shareLib.h: No such file or directory
In file included from ../gdd.h:50,
                 from ../gddAppTable.h:21,
                 from ../genApps.cc:17:
../aitConvert.h:29:21: error: osiSock.h: No such file or directory
In file included from ../aitTypes.h:58,
                 from ../gddUtils.h:28,
                 from ../gdd.h:47,
                 from ../gddAppTable.h:21,
                 from ../genApps.cc:17:
../aitHelpers.h:45: error: variable ‘epicsShareClass aitTimeStamp’ has initializer but incomplete type
../aitHelpers.h:45: warning: extended initializer lists only available with -std=c++0x or -std=gnu++0x
../aitHelpers.h:46: error: expected primary-expression before ‘friend’
../aitHelpers.h:46: error: expected ‘}’ before ‘friend’
../aitHelpers.h:46: error: expected ‘,’ or ‘;’ before ‘friend’
../aitHelpers.h:47: error: ‘friend’ used outside of class
../aitHelpers.h:47: error: expected initializer before ‘operator’
../aitHelpers.h:48: error: ‘friend’ used outside of class
../aitHelpers.h:48: error: ISO C++ forbids declaration of ‘aitTimeStamp’ with no type
../aitHelpers.h:48: error: expected ‘,’ or ‘...’ before ‘&’ token
../aitHelpers.h:48: error: ‘int operator>=(int)’ must have an argument of class or enumerated type
../aitHelpers.h:49: error: ‘friend’ used outside of class
../aitHelpers.h:50: error: expected unqualified-id before ‘public’
../aitHelpers.h:52: error: ISO C++ forbids declaration of ‘aitTimeStamp’ with no type
../aitHelpers.h:52: error: expected ‘,’ or ‘...’ before ‘&’ token
../aitHelpers.h:52: error: ISO C++ forbids declaration of ‘aitTimeStamp’ with no type
../aitHelpers.h: In function ‘int aitTimeStamp(int)’:
../aitHelpers.h:52: error: only constructors take base initializers
../aitHelpers.h:52: error: ‘t’ was not declared in this scope
../aitHelpers.h:52: warning: no return statement in function returning non-void
../aitHelpers.h: At global scope:
../aitHelpers.h:53: error: ISO C++ forbids declaration of ‘aitTimeStamp’ with no type
../aitHelpers.h: In function ‘int aitTimeStamp(long unsigned int, long unsigned int)’:
../aitHelpers.h:54: error: only constructors take base initializers
../aitHelpers.h:57: error: invalid use of ‘this’ in non-member function
../aitHelpers.h:57: error: invalid use of ‘this’ in non-member function
../aitHelpers.h:58: error: invalid use of ‘this’ in non-member function
../aitHelpers.h:58: error: invalid use of ‘this’ in non-member function
../aitHelpers.h:60: warning: no return statement in function returning non-void
../aitHelpers.h: At global scope:
../aitHelpers.h:66: error: non-member function ‘void getTV(long int&, long int&)’ cannot have cv-qualifier
../aitHelpers.h: In function ‘void getTV(long int&, long int&)’:
../aitHelpers.h:68: error: invalid use of ‘this’ in non-member function
../aitHelpers.h:69: error: invalid use of ‘this’ in non-member function
../aitHelpers.h:70: error: invalid use of ‘this’ in non-member function
../aitHelpers.h:71: error: invalid use of ‘this’ in non-member function
../aitHelpers.h: At global scope:
../aitHelpers.h:77: error: non-member function ‘void get(long unsigned int&, long unsigned int&)’ cannot have cv-qualifier
../aitHelpers.h: In function ‘void get(long unsigned int&, long unsigned int&)’:
../aitHelpers.h:79: error: invalid use of ‘this’ in non-member function
../aitHelpers.h:80: error: invalid use of ‘this’ in non-member function
../aitHelpers.h: At global scope:
../aitHelpers.h:83: error: non-member function ‘operator double()’ cannot have cv-qualifier
../aitHelpers.h:83: error: ‘operator double()’ must be a nonstatic member function
../aitHelpers.h:88: error: non-member function ‘operator float()’ cannot have cv-qualifier
../aitHelpers.h:88: error: ‘operator float()’ must be a nonstatic member function
../aitHelpers.h:96: error: expected constructor, destructor, or type conversion before ‘;’ token
../aitHelpers.h:97: error: non-member function ‘void get(timespec&)’ cannot have cv-qualifier
../aitHelpers.h:98: error: expected constructor, destructor, or type conversion before ‘;’ token
../aitHelpers.h:99: error: expected constructor, destructor, or type conversion before ‘operator’
../aitHelpers.h:104: error: expected constructor, destructor, or type conversion before ‘;’ token
../aitHelpers.h:105: error: non-member function ‘void get(epicsTimeStamp&)’ cannot have cv-qualifier
../aitHelpers.h:106: error: expected constructor, destructor, or type conversion before ‘;’ token
../aitHelpers.h:107: error: expected constructor, destructor, or type conversion before ‘operator’
../aitHelpers.h:110: error: expected constructor, destructor, or type conversion before ‘;’ token
../aitHelpers.h:111: error: expected constructor, destructor, or type conversion before ‘operator’
../aitHelpers.h:112: error: expected constructor, destructor, or type conversion before ‘;’ token
../aitHelpers.h:114: error: ‘aitTimeStamp’ does not name a type
../aitHelpers.h:119: error: expected unqualified-id before ‘private’
../aitHelpers.h:121: error: expected declaration before ‘}’ token
make[3]: *** [genApps.o] Error 1
make[3]: Leaving directory `<https://jenkins.aps.anl.gov/job/epics-base-3.14-rtems/ws/src/gdd/O.linux-x86_64'>
make[2]: *** [linux-x86_64] Error 2
make[2]: Leaving directory `<https://jenkins.aps.anl.gov/job/epics-base-3.14-rtems/ws/src/gdd'>
make[1]: *** [gdd.RTEMS-uC5282] Error 2
make[1]: Leaving directory `<https://jenkins.aps.anl.gov/job/epics-base-3.14-rtems/ws/src'>
make: *** [src.RTEMS-uC5282] Error 2
Build step 'Execute shell' marked build as failure
[WARNINGS] Skipping publisher since build result is FAILURE


Replies:
Jenkins build is back to normal : epics-base-3.14-rtems #14 APS Jenkins
References:
Build failed in Jenkins: epics-base-3.14-rtems #12 APS Jenkins

Navigate by Date:
Prev: Build failed in Jenkins: epics-base-3.14-vx55 #14 APS Jenkins
Next: Build failed in Jenkins: epics-base-3.14-linux32 #17 APS Jenkins
Index: 2002  2003  2004  2005  2006  2007  2008  2009  2010  2011  2012  2013  <20142015  2016  2017  2018  2019  2020  2021  2022 
Navigate by Thread:
Prev: Build failed in Jenkins: epics-base-3.14-rtems #12 APS Jenkins
Next: Jenkins build is back to normal : epics-base-3.14-rtems #14 APS Jenkins
Index: 2002  2003  2004  2005  2006  2007  2008  2009  2010  2011  2012  2013  <20142015  2016  2017  2018  2019  2020  2021  2022 
ANJ, 16 May 2014 Valid HTML 4.01! · Home · News · About · Base · Modules · Extensions · Distributions · Download ·
· Search · EPICS V4 · IRMIS · Talk · Bugs · Documents · Links · Licensing ·