EPICS Home

Experimental Physics and Industrial Control System


 
2002  2003  2004  2005  2006  2007  2008  2009  2010  2011  2012  2013  2014  2015  2016  2017  <20182019  2020  2021  Index 2002  2003  2004  2005  2006  2007  2008  2009  2010  2011  2012  2013  2014  2015  2016  2017  <20182019  2020  2021 
<== Date ==> <== Thread ==>

Subject: Build failed in Jenkins: epics-7.0-windows » DLL, win64 #47
From: APS Jenkins <aps-jenkins@anl.gov>
To: core-talk@aps.anl.gov
Date: Thu, 21 Jun 2018 11:18:33 -0500 (CDT)
See <https://jenkins.aps.anl.gov/job/epics-7.0-windows/LIBRARIES=DLL,OS=win64/47/display/redirect>

------------------------------------------
[...truncated 2.85 MB...]
c:\jenkins\win64-1\workspace\epics-7.0-windows\libraries\dll\os\win64\include\pv\pvaccess.h(830): note: see declaration of 'epics::pvAccess::Channel'
c:\jenkins\win64-1\workspace\epics-7.0-windows\libraries\dll\os\win64\include\pv\pvaccess.h(1154): warning C4275: non dll-interface class 'epics::pvData::NoDefaultMethods' used as base for dll-interface class 'epics::pvAccess::ChannelProvider'
c:\jenkins\win64-1\workspace\epics-7.0-windows\libraries\dll\os\win64\include\pv\nodefaultmethods.h(50): note: see declaration of 'epics::pvData::NoDefaultMethods'
c:\jenkins\win64-1\workspace\epics-7.0-windows\libraries\dll\os\win64\include\pv\pvaccess.h(1153): note: see declaration of 'epics::pvAccess::ChannelProvider'
c:\jenkins\win64-1\workspace\epics-7.0-windows\libraries\dll\os\win64\include\pv\pvaccess.h(1245): warning C4275: non dll-interface class 'epics::pvData::NoDefaultMethods' used as base for dll-interface class 'epics::pvAccess::ChannelProviderFactory'
c:\jenkins\win64-1\workspace\epics-7.0-windows\libraries\dll\os\win64\include\pv\nodefaultmethods.h(50): note: see declaration of 'epics::pvData::NoDefaultMethods'
c:\jenkins\win64-1\workspace\epics-7.0-windows\libraries\dll\os\win64\include\pv\pvaccess.h(1245): note: see declaration of 'epics::pvAccess::ChannelProviderFactory'
make[4]: Leaving directory '<https://jenkins.aps.anl.gov/job/epics-7.0-windows/LIBRARIES=DLL,OS=win64/ws/modules/pva2pva/testApp/O.windows-x64'>
make[4]: Entering directory '<https://jenkins.aps.anl.gov/job/epics-7.0-windows/LIBRARIES=DLL,OS=win64/ws/modules/pva2pva/testApp/O.windows-x64'>
cl -EHsc -GR           -DUSE_TYPED_RSET -I../../pdbApp -I../../p2pApp -I../../common -DNOMINMAX     -nologo -FC -D__STDC__=0 -D_CRT_SECURE_NO_DEPRECATE -D_CRT_NONSTDC_NO_DEPRECATE   -Ox -GL -Oy-   -W3 -w44355 -w44344 -w44251        -MD -DEPICS_BUILD_DLL -DEPICS_CALL_DLL -TP  -I. -I../O.Common -I. -I. -I.. -I<https://jenkins.aps.anl.gov/job/epics-7.0-windows/LIBRARIES=DLL,OS=win64/ws/include/compiler/msvc> -I<https://jenkins.aps.anl.gov/job/epics-7.0-windows/LIBRARIES=DLL,OS=win64/ws/include/os/WIN32> -I<https://jenkins.aps.anl.gov/job/epics-7.0-windows/LIBRARIES=DLL,OS=win64/ws/include> -I<https://jenkins.aps.anl.gov/job/epics-7.0-windows/LIBRARIES=DLL,OS=win64/ws/include/compiler/msvc> -I<https://jenkins.aps.anl.gov/job/epics-7.0-windows/LIBRARIES=DLL,OS=win64/ws/include/os/WIN32> -I<https://jenkins.aps.anl.gov/job/epics-7.0-windows/LIBRARIES=DLL,OS=win64/ws/include>        -c pvaLinkTestIoc_registerRecordDeviceDriver.cpp
pvaLinkTestIoc_registerRecordDeviceDriver.cpp
make[4]: Leaving directory '<https://jenkins.aps.anl.gov/job/epics-7.0-windows/LIBRARIES=DLL,OS=win64/ws/modules/pva2pva/testApp/O.windows-x64'>
make[4]: Entering directory '<https://jenkins.aps.anl.gov/job/epics-7.0-windows/LIBRARIES=DLL,OS=win64/ws/modules/pva2pva/testApp/O.windows-x64'>
cl -EHsc -GR           -DUSE_TYPED_RSET -I../../pdbApp -I../../p2pApp -I../../common -DNOMINMAX     -nologo -FC -D__STDC__=0 -D_CRT_SECURE_NO_DEPRECATE -D_CRT_NONSTDC_NO_DEPRECATE   -Ox -GL -Oy-   -W3 -w44355 -w44344 -w44251        -MD -DEPICS_BUILD_DLL -DEPICS_CALL_DLL -TP  -I. -I../O.Common -I. -I. -I.. -I<https://jenkins.aps.anl.gov/job/epics-7.0-windows/LIBRARIES=DLL,OS=win64/ws/include/compiler/msvc> -I<https://jenkins.aps.anl.gov/job/epics-7.0-windows/LIBRARIES=DLL,OS=win64/ws/include/os/WIN32> -I<https://jenkins.aps.anl.gov/job/epics-7.0-windows/LIBRARIES=DLL,OS=win64/ws/include> -I<https://jenkins.aps.anl.gov/job/epics-7.0-windows/LIBRARIES=DLL,OS=win64/ws/include/compiler/msvc> -I<https://jenkins.aps.anl.gov/job/epics-7.0-windows/LIBRARIES=DLL,OS=win64/ws/include/os/WIN32> -I<https://jenkins.aps.anl.gov/job/epics-7.0-windows/LIBRARIES=DLL,OS=win64/ws/include>        -c ../testpvif.cpp
testpvif.cpp
c:\jenkins\win64-1\workspace\epics-7.0-windows\libraries\dll\os\win64\include\pv\pvdata.h(508): warning C4800: 'char': forcing value to bool 'true' or 'false' (performance warning)
c:\jenkins\win64-1\workspace\epics-7.0-windows\libraries\dll\os\win64\include\pv\pvdata.h(558): warning C4250: 'epics::pvData::PVString': inherits 'epics::pvData::PVScalarValue<std::string>::epics::pvData::PVScalarValue<std::string>::deserialize' via dominance
c:\jenkins\win64-1\workspace\epics-7.0-windows\libraries\dll\os\win64\include\pv\pvdata.h(461): note: see declaration of 'epics::pvData::PVScalarValue<std::string>::deserialize'
c:\jenkins\win64-1\workspace\epics-7.0-windows\libraries\dll\os\win64\include\pv\pvaversion.h(36): warning C4275: non dll-interface class 'epics::pvData::NoDefaultMethods' used as base for dll-interface class 'epics::pvAccess::Version'
c:\jenkins\win64-1\workspace\epics-7.0-windows\libraries\dll\os\win64\include\pv\nodefaultmethods.h(50): note: see declaration of 'epics::pvData::NoDefaultMethods'
c:\jenkins\win64-1\workspace\epics-7.0-windows\libraries\dll\os\win64\include\pv\pvaversion.h(36): note: see declaration of 'epics::pvAccess::Version'
c:\jenkins\win64-1\workspace\epics-7.0-windows\libraries\dll\os\win64\include\pv\pvaccess.h(104): warning C4275: non dll-interface class 'epics::pvData::NoDefaultMethods' used as base for dll-interface class 'epics::pvAccess::ScopedLock'
c:\jenkins\win64-1\workspace\epics-7.0-windows\libraries\dll\os\win64\include\pv\nodefaultmethods.h(50): note: see declaration of 'epics::pvData::NoDefaultMethods'
c:\jenkins\win64-1\workspace\epics-7.0-windows\libraries\dll\os\win64\include\pv\pvaccess.h(104): note: see declaration of 'epics::pvAccess::ScopedLock'
c:\jenkins\win64-1\workspace\epics-7.0-windows\libraries\dll\os\win64\include\pv\pvaccess.h(182): warning C4275: non dll-interface class 'epics::pvData::NoDefaultMethods' used as base for dll-interface class 'epics::pvAccess::ChannelRequest'
c:\jenkins\win64-1\workspace\epics-7.0-windows\libraries\dll\os\win64\include\pv\nodefaultmethods.h(50): note: see declaration of 'epics::pvData::NoDefaultMethods'
c:\jenkins\win64-1\workspace\epics-7.0-windows\libraries\dll\os\win64\include\pv\pvaccess.h(182): note: see declaration of 'epics::pvAccess::ChannelRequest'
c:\jenkins\win64-1\workspace\epics-7.0-windows\libraries\dll\os\win64\include\pv\pvaccess.h(379): warning C4275: non dll-interface class 'epics::pvData::NoDefaultMethods' used as base for dll-interface class 'epics::pvAccess::ChannelFind'
c:\jenkins\win64-1\workspace\epics-7.0-windows\libraries\dll\os\win64\include\pv\nodefaultmethods.h(50): note: see declaration of 'epics::pvData::NoDefaultMethods'
c:\jenkins\win64-1\workspace\epics-7.0-windows\libraries\dll\os\win64\include\pv\pvaccess.h(379): note: see declaration of 'epics::pvAccess::ChannelFind'
c:\jenkins\win64-1\workspace\epics-7.0-windows\libraries\dll\os\win64\include\pv\pvaccess.h(833): warning C4275: non dll-interface class 'epics::pvData::NoDefaultMethods' used as base for dll-interface class 'epics::pvAccess::Channel'
c:\jenkins\win64-1\workspace\epics-7.0-windows\libraries\dll\os\win64\include\pv\nodefaultmethods.h(50): note: see declaration of 'epics::pvData::NoDefaultMethods'
c:\jenkins\win64-1\workspace\epics-7.0-windows\libraries\dll\os\win64\include\pv\pvaccess.h(830): note: see declaration of 'epics::pvAccess::Channel'
c:\jenkins\win64-1\workspace\epics-7.0-windows\libraries\dll\os\win64\include\pv\pvaccess.h(1154): warning C4275: non dll-interface class 'epics::pvData::NoDefaultMethods' used as base for dll-interface class 'epics::pvAccess::ChannelProvider'
c:\jenkins\win64-1\workspace\epics-7.0-windows\libraries\dll\os\win64\include\pv\nodefaultmethods.h(50): note: see declaration of 'epics::pvData::NoDefaultMethods'
c:\jenkins\win64-1\workspace\epics-7.0-windows\libraries\dll\os\win64\include\pv\pvaccess.h(1153): note: see declaration of 'epics::pvAccess::ChannelProvider'
c:\jenkins\win64-1\workspace\epics-7.0-windows\libraries\dll\os\win64\include\pv\pvaccess.h(1245): warning C4275: non dll-interface class 'epics::pvData::NoDefaultMethods' used as base for dll-interface class 'epics::pvAccess::ChannelProviderFactory'
c:\jenkins\win64-1\workspace\epics-7.0-windows\libraries\dll\os\win64\include\pv\nodefaultmethods.h(50): note: see declaration of 'epics::pvData::NoDefaultMethods'
c:\jenkins\win64-1\workspace\epics-7.0-windows\libraries\dll\os\win64\include\pv\pvaccess.h(1245): note: see declaration of 'epics::pvAccess::ChannelProviderFactory'
c:\jenkins\win64-1\workspace\epics-7.0-windows\libraries\dll\os\win64\modules\pva2pva\testapp\testpvif.cpp(201): warning C4267: 'argument': conversion from 'size_t' to 'epics::pvData::uint32', possible loss of data
c:\jenkins\win64-1\workspace\epics-7.0-windows\libraries\dll\os\win64\modules\pva2pva\testapp\testpvif.cpp(260): warning C4267: 'argument': conversion from 'size_t' to 'epics::pvData::uint32', possible loss of data
c:\jenkins\win64-1\workspace\epics-7.0-windows\libraries\dll\os\win64\modules\pva2pva\testapp\testpvif.cpp(267): warning C4267: 'argument': conversion from 'size_t' to 'epics::pvData::uint32', possible loss of data
c:\jenkins\win64-1\workspace\epics-7.0-windows\libraries\dll\os\win64\modules\pva2pva\testapp\testpvif.cpp(274): warning C4267: 'argument': conversion from 'size_t' to 'epics::pvData::uint32', possible loss of data
c:\jenkins\win64-1\workspace\epics-7.0-windows\libraries\dll\os\win64\modules\pva2pva\testapp\testpvif.cpp(281): warning C4267: 'argument': conversion from 'size_t' to 'epics::pvData::uint32', possible loss of data
c:\jenkins\win64-1\workspace\epics-7.0-windows\libraries\dll\os\win64\modules\pva2pva\testapp\testpvif.cpp(288): warning C4267: 'argument': conversion from 'size_t' to 'epics::pvData::uint32', possible loss of data
c:\jenkins\win64-1\workspace\epics-7.0-windows\libraries\dll\os\win64\modules\pva2pva\testapp\testpvif.cpp(347): warning C4267: 'argument': conversion from 'size_t' to 'epics::pvData::uint32', possible loss of data
c:\jenkins\win64-1\workspace\epics-7.0-windows\libraries\dll\os\win64\modules\pva2pva\testapp\testpvif.cpp(356): warning C4267: 'argument': conversion from 'size_t' to 'epics::pvData::uint32', possible loss of data
c:\jenkins\win64-1\workspace\epics-7.0-windows\libraries\dll\os\win64\modules\pva2pva\testapp\testpvif.cpp(365): warning C4267: 'argument': conversion from 'size_t' to 'epics::pvData::uint32', possible loss of data
c:\jenkins\win64-1\workspace\epics-7.0-windows\libraries\dll\os\win64\modules\pva2pva\testapp\testpvif.cpp(374): warning C4267: 'argument': conversion from 'size_t' to 'epics::pvData::uint32', possible loss of data
c:\jenkins\win64-1\workspace\epics-7.0-windows\libraries\dll\os\win64\modules\pva2pva\testapp\testpvif.cpp(386): warning C4267: 'argument': conversion from 'size_t' to 'epics::pvData::uint32', possible loss of data
c:\jenkins\win64-1\workspace\epics-7.0-windows\libraries\dll\os\win64\modules\pva2pva\testapp\testpvif.cpp(393): warning C4267: 'argument': conversion from 'size_t' to 'epics::pvData::uint32', possible loss of data
c:\jenkins\win64-1\workspace\epics-7.0-windows\libraries\dll\os\win64\modules\pva2pva\testapp\testpvif.cpp(400): warning C4267: 'argument': conversion from 'size_t' to 'epics::pvData::uint32', possible loss of data
c:\jenkins\win64-1\workspace\epics-7.0-windows\libraries\dll\os\win64\modules\pva2pva\testapp\testpvif.cpp(407): warning C4267: 'argument': conversion from 'size_t' to 'epics::pvData::uint32', possible loss of data
make[4]: Leaving directory '<https://jenkins.aps.anl.gov/job/epics-7.0-windows/LIBRARIES=DLL,OS=win64/ws/modules/pva2pva/testApp/O.windows-x64'>
make[4]: Entering directory '<https://jenkins.aps.anl.gov/job/epics-7.0-windows/LIBRARIES=DLL,OS=win64/ws/modules/pva2pva/testApp/O.windows-x64'>
cl -EHsc -GR           -DUSE_TYPED_RSET -I../../pdbApp -I../../p2pApp -I../../common -DNOMINMAX     -nologo -FC -D__STDC__=0 -D_CRT_SECURE_NO_DEPRECATE -D_CRT_NONSTDC_NO_DEPRECATE   -Ox -GL -Oy-   -W3 -w44355 -w44344 -w44251        -MD -DEPICS_BUILD_DLL -DEPICS_CALL_DLL -TP  -I. -I../O.Common -I. -I. -I.. -I<https://jenkins.aps.anl.gov/job/epics-7.0-windows/LIBRARIES=DLL,OS=win64/ws/include/compiler/msvc> -I<https://jenkins.aps.anl.gov/job/epics-7.0-windows/LIBRARIES=DLL,OS=win64/ws/include/os/WIN32> -I<https://jenkins.aps.anl.gov/job/epics-7.0-windows/LIBRARIES=DLL,OS=win64/ws/include> -I<https://jenkins.aps.anl.gov/job/epics-7.0-windows/LIBRARIES=DLL,OS=win64/ws/include/compiler/msvc> -I<https://jenkins.aps.anl.gov/job/epics-7.0-windows/LIBRARIES=DLL,OS=win64/ws/include/os/WIN32> -I<https://jenkins.aps.anl.gov/job/epics-7.0-windows/LIBRARIES=DLL,OS=win64/ws/include>        -c ../testpdb.cpp
testpdb.cpp
c:\jenkins\win64-1\workspace\epics-7.0-windows\libraries\dll\os\win64\include\pv\pvdata.h(508): warning C4800: 'char': forcing value to bool 'true' or 'false' (performance warning)
c:\jenkins\win64-1\workspace\epics-7.0-windows\libraries\dll\os\win64\include\pv\pvdata.h(558): warning C4250: 'epics::pvData::PVString': inherits 'epics::pvData::PVScalarValue<std::string>::epics::pvData::PVScalarValue<std::string>::deserialize' via dominance
c:\jenkins\win64-1\workspace\epics-7.0-windows\libraries\dll\os\win64\include\pv\pvdata.h(461): note: see declaration of 'epics::pvData::PVScalarValue<std::string>::deserialize'
c:\jenkins\win64-1\workspace\epics-7.0-windows\libraries\dll\os\win64\include\pv\pvaversion.h(36): warning C4275: non dll-interface class 'epics::pvData::NoDefaultMethods' used as base for dll-interface class 'epics::pvAccess::Version'
c:\jenkins\win64-1\workspace\epics-7.0-windows\libraries\dll\os\win64\include\pv\nodefaultmethods.h(50): note: see declaration of 'epics::pvData::NoDefaultMethods'
c:\jenkins\win64-1\workspace\epics-7.0-windows\libraries\dll\os\win64\include\pv\pvaversion.h(36): note: see declaration of 'epics::pvAccess::Version'
c:\jenkins\win64-1\workspace\epics-7.0-windows\libraries\dll\os\win64\include\pv\pvaccess.h(104): warning C4275: non dll-interface class 'epics::pvData::NoDefaultMethods' used as base for dll-interface class 'epics::pvAccess::ScopedLock'
c:\jenkins\win64-1\workspace\epics-7.0-windows\libraries\dll\os\win64\include\pv\nodefaultmethods.h(50): note: see declaration of 'epics::pvData::NoDefaultMethods'
c:\jenkins\win64-1\workspace\epics-7.0-windows\libraries\dll\os\win64\include\pv\pvaccess.h(104): note: see declaration of 'epics::pvAccess::ScopedLock'
c:\jenkins\win64-1\workspace\epics-7.0-windows\libraries\dll\os\win64\include\pv\pvaccess.h(182): warning C4275: non dll-interface class 'epics::pvData::NoDefaultMethods' used as base for dll-interface class 'epics::pvAccess::ChannelRequest'
c:\jenkins\win64-1\workspace\epics-7.0-windows\libraries\dll\os\win64\include\pv\nodefaultmethods.h(50): note: see declaration of 'epics::pvData::NoDefaultMethods'
c:\jenkins\win64-1\workspace\epics-7.0-windows\libraries\dll\os\win64\include\pv\pvaccess.h(182): note: see declaration of 'epics::pvAccess::ChannelRequest'
c:\jenkins\win64-1\workspace\epics-7.0-windows\libraries\dll\os\win64\include\pv\pvaccess.h(379): warning C4275: non dll-interface class 'epics::pvData::NoDefaultMethods' used as base for dll-interface class 'epics::pvAccess::ChannelFind'
c:\jenkins\win64-1\workspace\epics-7.0-windows\libraries\dll\os\win64\include\pv\nodefaultmethods.h(50): note: see declaration of 'epics::pvData::NoDefaultMethods'
c:\jenkins\win64-1\workspace\epics-7.0-windows\libraries\dll\os\win64\include\pv\pvaccess.h(379): note: see declaration of 'epics::pvAccess::ChannelFind'
c:\jenkins\win64-1\workspace\epics-7.0-windows\libraries\dll\os\win64\include\pv\pvaccess.h(833): warning C4275: non dll-interface class 'epics::pvData::NoDefaultMethods' used as base for dll-interface class 'epics::pvAccess::Channel'
c:\jenkins\win64-1\workspace\epics-7.0-windows\libraries\dll\os\win64\include\pv\nodefaultmethods.h(50): note: see declaration of 'epics::pvData::NoDefaultMethods'
c:\jenkins\win64-1\workspace\epics-7.0-windows\libraries\dll\os\win64\include\pv\pvaccess.h(830): note: see declaration of 'epics::pvAccess::Channel'
c:\jenkins\win64-1\workspace\epics-7.0-windows\libraries\dll\os\win64\include\pv\pvaccess.h(1154): warning C4275: non dll-interface class 'epics::pvData::NoDefaultMethods' used as base for dll-interface class 'epics::pvAccess::ChannelProvider'
c:\jenkins\win64-1\workspace\epics-7.0-windows\libraries\dll\os\win64\include\pv\nodefaultmethods.h(50): note: see declaration of 'epics::pvData::NoDefaultMethods'
c:\jenkins\win64-1\workspace\epics-7.0-windows\libraries\dll\os\win64\include\pv\pvaccess.h(1153): note: see declaration of 'epics::pvAccess::ChannelProvider'
c:\jenkins\win64-1\workspace\epics-7.0-windows\libraries\dll\os\win64\include\pv\pvaccess.h(1245): warning C4275: non dll-interface class 'epics::pvData::NoDefaultMethods' used as base for dll-interface class 'epics::pvAccess::ChannelProviderFactory'
c:\jenkins\win64-1\workspace\epics-7.0-windows\libraries\dll\os\win64\include\pv\nodefaultmethods.h(50): note: see declaration of 'epics::pvData::NoDefaultMethods'
c:\jenkins\win64-1\workspace\epics-7.0-windows\libraries\dll\os\win64\include\pv\pvaccess.h(1245): note: see declaration of 'epics::pvAccess::ChannelProviderFactory'
c:\jenkins\win64-1\workspace\epics-7.0-windows\libraries\dll\os\win64\include\pv\configuration.h(46): warning C4275: non dll-interface class 'epics::pvData::NoDefaultMethods' used as base for dll-interface class 'epics::pvAccess::Configuration'
c:\jenkins\win64-1\workspace\epics-7.0-windows\libraries\dll\os\win64\include\pv\nodefaultmethods.h(50): note: see declaration of 'epics::pvData::NoDefaultMethods'
c:\jenkins\win64-1\workspace\epics-7.0-windows\libraries\dll\os\win64\include\pv\configuration.h(45): note: see declaration of 'epics::pvAccess::Configuration'
c:\jenkins\win64-1\workspace\epics-7.0-windows\libraries\dll\os\win64\include\pv\configuration.h(206): warning C4275: non dll-interface class 'epics::pvData::NoDefaultMethods' used as base for dll-interface class 'epics::pvAccess::ConfigurationProvider'
c:\jenkins\win64-1\workspace\epics-7.0-windows\libraries\dll\os\win64\include\pv\nodefaultmethods.h(50): note: see declaration of 'epics::pvData::NoDefaultMethods'
c:\jenkins\win64-1\workspace\epics-7.0-windows\libraries\dll\os\win64\include\pv\configuration.h(205): note: see declaration of 'epics::pvAccess::ConfigurationProvider'
c:\jenkins\win64-1\workspace\epics-7.0-windows\libraries\dll\os\win64\include\pv\configuration.h(249): warning C4275: non dll-interface class 'epics::pvData::NoDefaultMethods' used as base for dll-interface class 'epics::pvAccess::ConfigurationFactory'
c:\jenkins\win64-1\workspace\epics-7.0-windows\libraries\dll\os\win64\include\pv\nodefaultmethods.h(50): note: see declaration of 'epics::pvData::NoDefaultMethods'
c:\jenkins\win64-1\workspace\epics-7.0-windows\libraries\dll\os\win64\include\pv\configuration.h(248): note: see declaration of 'epics::pvAccess::ConfigurationFactory'
c:\jenkins\win64-1\workspace\epics-7.0-windows\libraries\dll\os\win64\modules\pva2pva\pdbapp\pdbsingle.h(23): warning C4275: non dll-interface struct 'PDBPV' used as base for dll-interface struct 'PDBSinglePV'
c:\jenkins\win64-1\workspace\epics-7.0-windows\libraries\dll\os\win64\modules\pva2pva\pdbapp\pdb.h(16): note: see declaration of 'PDBPV'
c:\jenkins\win64-1\workspace\epics-7.0-windows\libraries\dll\os\win64\modules\pva2pva\pdbapp\pdbsingle.h(22): note: see declaration of 'PDBSinglePV'
c:\jenkins\win64-1\workspace\epics-7.0-windows\libraries\dll\os\win64\modules\pva2pva\pdbapp\pdbgroup.h(74): warning C4275: non dll-interface struct 'PDBPV' used as base for dll-interface struct 'PDBGroupPV'
c:\jenkins\win64-1\workspace\epics-7.0-windows\libraries\dll\os\win64\modules\pva2pva\pdbapp\pdb.h(16): note: see declaration of 'PDBPV'
c:\jenkins\win64-1\workspace\epics-7.0-windows\libraries\dll\os\win64\modules\pva2pva\pdbapp\pdbgroup.h(73): note: see declaration of 'PDBGroupPV'
c:\jenkins\win64-1\workspace\epics-7.0-windows\libraries\dll\os\win64\modules\pva2pva\pdbapp\pdbgroup.h(136): warning C4275: non dll-interface struct 'BaseChannel' used as base for dll-interface struct 'PDBGroupChannel'
c:\jenkins\win64-1\workspace\epics-7.0-windows\libraries\dll\os\win64\modules\pva2pva\common\pvahelper.h(19): note: see declaration of 'BaseChannel'
c:\jenkins\win64-1\workspace\epics-7.0-windows\libraries\dll\os\win64\modules\pva2pva\pdbapp\pdbgroup.h(136): note: see declaration of 'PDBGroupChannel'
c:\jenkins\win64-1\workspace\epics-7.0-windows\libraries\dll\os\win64\modules\pva2pva\testapp\testpdb.cpp(153): warning C4267: 'argument': conversion from 'size_t' to 'epics::pvData::uint32', possible loss of data
c:\jenkins\win64-1\workspace\epics-7.0-windows\libraries\dll\os\win64\modules\pva2pva\testapp\testpdb.cpp(168): warning C4267: 'argument': conversion from 'size_t' to 'epics::pvData::uint32', possible loss of data
c:\jenkins\win64-1\workspace\epics-7.0-windows\libraries\dll\os\win64\modules\pva2pva\testapp\testpdb.cpp(169): warning C4267: 'argument': conversion from 'size_t' to 'epics::pvData::uint32', possible loss of data
c:\jenkins\win64-1\workspace\epics-7.0-windows\libraries\dll\os\win64\modules\pva2pva\testapp\testpdb.cpp(223): warning C4267: 'argument': conversion from 'size_t' to 'epics::pvData::uint32', possible loss of data
c:\jenkins\win64-1\workspace\epics-7.0-windows\libraries\dll\os\win64\modules\pva2pva\testapp\testpdb.cpp(282): warning C4267: 'argument': conversion from 'size_t' to 'epics::pvData::uint32', possible loss of data
make[4]: Leaving directory '<https://jenkins.aps.anl.gov/job/epics-7.0-windows/LIBRARIES=DLL,OS=win64/ws/modules/pva2pva/testApp/O.windows-x64'>
make[4]: Entering directory '<https://jenkins.aps.anl.gov/job/epics-7.0-windows/LIBRARIES=DLL,OS=win64/ws/modules/pva2pva/testApp/O.windows-x64'>
cl -EHsc -GR           -DUSE_TYPED_RSET -I../../pdbApp -I../../p2pApp -I../../common -DNOMINMAX     -nologo -FC -D__STDC__=0 -D_CRT_SECURE_NO_DEPRECATE -D_CRT_NONSTDC_NO_DEPRECATE   -Ox -GL -Oy-   -W3 -w44355 -w44344 -w44251        -MD -DEPICS_BUILD_DLL -DEPICS_CALL_DLL -TP  -I. -I../O.Common -I. -I. -I.. -I<https://jenkins.aps.anl.gov/job/epics-7.0-windows/LIBRARIES=DLL,OS=win64/ws/include/compiler/msvc> -I<https://jenkins.aps.anl.gov/job/epics-7.0-windows/LIBRARIES=DLL,OS=win64/ws/include/os/WIN32> -I<https://jenkins.aps.anl.gov/job/epics-7.0-windows/LIBRARIES=DLL,OS=win64/ws/include> -I<https://jenkins.aps.anl.gov/job/epics-7.0-windows/LIBRARIES=DLL,OS=win64/ws/include/compiler/msvc> -I<https://jenkins.aps.anl.gov/job/epics-7.0-windows/LIBRARIES=DLL,OS=win64/ws/include/os/WIN32> -I<https://jenkins.aps.anl.gov/job/epics-7.0-windows/LIBRARIES=DLL,OS=win64/ws/include>        -c ../testpvalink.cpp
testpvalink.cpp
c:\jenkins\win64-1\workspace\epics-7.0-windows\libraries\dll\os\win64\include\pv\pvdata.h(508): warning C4800: 'char': forcing value to bool 'true' or 'false' (performance warning)
c:\jenkins\win64-1\workspace\epics-7.0-windows\libraries\dll\os\win64\include\pv\pvdata.h(558): warning C4250: 'epics::pvData::PVString': inherits 'epics::pvData::PVScalarValue<std::string>::epics::pvData::PVScalarValue<std::string>::deserialize' via dominance
c:\jenkins\win64-1\workspace\epics-7.0-windows\libraries\dll\os\win64\include\pv\pvdata.h(461): note: see declaration of 'epics::pvData::PVScalarValue<std::string>::deserialize'
c:\jenkins\win64-1\workspace\epics-7.0-windows\libraries\dll\os\win64\include\pv\pvaversion.h(36): warning C4275: non dll-interface class 'epics::pvData::NoDefaultMethods' used as base for dll-interface class 'epics::pvAccess::Version'
c:\jenkins\win64-1\workspace\epics-7.0-windows\libraries\dll\os\win64\include\pv\nodefaultmethods.h(50): note: see declaration of 'epics::pvData::NoDefaultMethods'
c:\jenkins\win64-1\workspace\epics-7.0-windows\libraries\dll\os\win64\include\pv\pvaversion.h(36): note: see declaration of 'epics::pvAccess::Version'
c:\jenkins\win64-1\workspace\epics-7.0-windows\libraries\dll\os\win64\include\pv\pvaccess.h(104): warning C4275: non dll-interface class 'epics::pvData::NoDefaultMethods' used as base for dll-interface class 'epics::pvAccess::ScopedLock'
c:\jenkins\win64-1\workspace\epics-7.0-windows\libraries\dll\os\win64\include\pv\nodefaultmethods.h(50): note: see declaration of 'epics::pvData::NoDefaultMethods'
c:\jenkins\win64-1\workspace\epics-7.0-windows\libraries\dll\os\win64\include\pv\pvaccess.h(104): note: see declaration of 'epics::pvAccess::ScopedLock'
c:\jenkins\win64-1\workspace\epics-7.0-windows\libraries\dll\os\win64\include\pv\pvaccess.h(182): warning C4275: non dll-interface class 'epics::pvData::NoDefaultMethods' used as base for dll-interface class 'epics::pvAccess::ChannelRequest'
c:\jenkins\win64-1\workspace\epics-7.0-windows\libraries\dll\os\win64\include\pv\nodefaultmethods.h(50): note: see declaration of 'epics::pvData::NoDefaultMethods'
c:\jenkins\win64-1\workspace\epics-7.0-windows\libraries\dll\os\win64\include\pv\pvaccess.h(182): note: see declaration of 'epics::pvAccess::ChannelRequest'
c:\jenkins\win64-1\workspace\epics-7.0-windows\libraries\dll\os\win64\include\pv\pvaccess.h(379): warning C4275: non dll-interface class 'epics::pvData::NoDefaultMethods' used as base for dll-interface class 'epics::pvAccess::ChannelFind'
c:\jenkins\win64-1\workspace\epics-7.0-windows\libraries\dll\os\win64\include\pv\nodefaultmethods.h(50): note: see declaration of 'epics::pvData::NoDefaultMethods'
c:\jenkins\win64-1\workspace\epics-7.0-windows\libraries\dll\os\win64\include\pv\pvaccess.h(379): note: see declaration of 'epics::pvAccess::ChannelFind'
c:\jenkins\win64-1\workspace\epics-7.0-windows\libraries\dll\os\win64\include\pv\pvaccess.h(833): warning C4275: non dll-interface class 'epics::pvData::NoDefaultMethods' used as base for dll-interface class 'epics::pvAccess::Channel'
c:\jenkins\win64-1\workspace\epics-7.0-windows\libraries\dll\os\win64\include\pv\nodefaultmethods.h(50): note: see declaration of 'epics::pvData::NoDefaultMethods'
c:\jenkins\win64-1\workspace\epics-7.0-windows\libraries\dll\os\win64\include\pv\pvaccess.h(830): note: see declaration of 'epics::pvAccess::Channel'
c:\jenkins\win64-1\workspace\epics-7.0-windows\libraries\dll\os\win64\include\pv\pvaccess.h(1154): warning C4275: non dll-interface class 'epics::pvData::NoDefaultMethods' used as base for dll-interface class 'epics::pvAccess::ChannelProvider'
c:\jenkins\win64-1\workspace\epics-7.0-windows\libraries\dll\os\win64\include\pv\nodefaultmethods.h(50): note: see declaration of 'epics::pvData::NoDefaultMethods'
c:\jenkins\win64-1\workspace\epics-7.0-windows\libraries\dll\os\win64\include\pv\pvaccess.h(1153): note: see declaration of 'epics::pvAccess::ChannelProvider'
c:\jenkins\win64-1\workspace\epics-7.0-windows\libraries\dll\os\win64\include\pv\pvaccess.h(1245): warning C4275: non dll-interface class 'epics::pvData::NoDefaultMethods' used as base for dll-interface class 'epics::pvAccess::ChannelProviderFactory'
c:\jenkins\win64-1\workspace\epics-7.0-windows\libraries\dll\os\win64\include\pv\nodefaultmethods.h(50): note: see declaration of 'epics::pvData::NoDefaultMethods'
c:\jenkins\win64-1\workspace\epics-7.0-windows\libraries\dll\os\win64\include\pv\pvaccess.h(1245): note: see declaration of 'epics::pvAccess::ChannelProviderFactory'
make[4]: Leaving directory '<https://jenkins.aps.anl.gov/job/epics-7.0-windows/LIBRARIES=DLL,OS=win64/ws/modules/pva2pva/testApp/O.windows-x64'>
make[4]: Entering directory '<https://jenkins.aps.anl.gov/job/epics-7.0-windows/LIBRARIES=DLL,OS=win64/ws/modules/pva2pva/testApp/O.windows-x64'>
cl -EHsc -GR           -DUSE_TYPED_RSET -I../../pdbApp -I../../p2pApp -I../../common -DNOMINMAX     -nologo -FC -D__STDC__=0 -D_CRT_SECURE_NO_DEPRECATE -D_CRT_NONSTDC_NO_DEPRECATE   -Ox -GL -Oy-   -W3 -w44355 -w44344 -w44251        -MD -DEPICS_BUILD_DLL -DEPICS_CALL_DLL -TP  -I. -I../O.Common -I. -I. -I.. -I<https://jenkins.aps.anl.gov/job/epics-7.0-windows/LIBRARIES=DLL,OS=win64/ws/include/compiler/msvc> -I<https://jenkins.aps.anl.gov/job/epics-7.0-windows/LIBRARIES=DLL,OS=win64/ws/include/os/WIN32> -I<https://jenkins.aps.anl.gov/job/epics-7.0-windows/LIBRARIES=DLL,OS=win64/ws/include> -I<https://jenkins.aps.anl.gov/job/epics-7.0-windows/LIBRARIES=DLL,OS=win64/ws/include/compiler/msvc> -I<https://jenkins.aps.anl.gov/job/epics-7.0-windows/LIBRARIES=DLL,OS=win64/ws/include/os/WIN32> -I<https://jenkins.aps.anl.gov/job/epics-7.0-windows/LIBRARIES=DLL,OS=win64/ws/include>        -c ../testgroupconfig.cpp
testgroupconfig.cpp
c:\jenkins\win64-1\workspace\epics-7.0-windows\libraries\dll\os\win64\include\pv\pvdata.h(508): warning C4800: 'char': forcing value to bool 'true' or 'false' (performance warning)
c:\jenkins\win64-1\workspace\epics-7.0-windows\libraries\dll\os\win64\include\pv\pvdata.h(558): warning C4250: 'epics::pvData::PVString': inherits 'epics::pvData::PVScalarValue<std::string>::epics::pvData::PVScalarValue<std::string>::deserialize' via dominance
c:\jenkins\win64-1\workspace\epics-7.0-windows\libraries\dll\os\win64\include\pv\pvdata.h(461): note: see declaration of 'epics::pvData::PVScalarValue<std::string>::deserialize'
c:\jenkins\win64-1\workspace\epics-7.0-windows\libraries\dll\os\win64\include\pv\pvaversion.h(36): warning C4275: non dll-interface class 'epics::pvData::NoDefaultMethods' used as base for dll-interface class 'epics::pvAccess::Version'
c:\jenkins\win64-1\workspace\epics-7.0-windows\libraries\dll\os\win64\include\pv\nodefaultmethods.h(50): note: see declaration of 'epics::pvData::NoDefaultMethods'
c:\jenkins\win64-1\workspace\epics-7.0-windows\libraries\dll\os\win64\include\pv\pvaversion.h(36): note: see declaration of 'epics::pvAccess::Version'
c:\jenkins\win64-1\workspace\epics-7.0-windows\libraries\dll\os\win64\include\pv\pvaccess.h(104): warning C4275: non dll-interface class 'epics::pvData::NoDefaultMethods' used as base for dll-interface class 'epics::pvAccess::ScopedLock'
c:\jenkins\win64-1\workspace\epics-7.0-windows\libraries\dll\os\win64\include\pv\nodefaultmethods.h(50): note: see declaration of 'epics::pvData::NoDefaultMethods'
c:\jenkins\win64-1\workspace\epics-7.0-windows\libraries\dll\os\win64\include\pv\pvaccess.h(104): note: see declaration of 'epics::pvAccess::ScopedLock'
c:\jenkins\win64-1\workspace\epics-7.0-windows\libraries\dll\os\win64\include\pv\pvaccess.h(182): warning C4275: non dll-interface class 'epics::pvData::NoDefaultMethods' used as base for dll-interface class 'epics::pvAccess::ChannelRequest'
c:\jenkins\win64-1\workspace\epics-7.0-windows\libraries\dll\os\win64\include\pv\nodefaultmethods.h(50): note: see declaration of 'epics::pvData::NoDefaultMethods'
c:\jenkins\win64-1\workspace\epics-7.0-windows\libraries\dll\os\win64\include\pv\pvaccess.h(182): note: see declaration of 'epics::pvAccess::ChannelRequest'
c:\jenkins\win64-1\workspace\epics-7.0-windows\libraries\dll\os\win64\include\pv\pvaccess.h(379): warning C4275: non dll-interface class 'epics::pvData::NoDefaultMethods' used as base for dll-interface class 'epics::pvAccess::ChannelFind'
c:\jenkins\win64-1\workspace\epics-7.0-windows\libraries\dll\os\win64\include\pv\nodefaultmethods.h(50): note: see declaration of 'epics::pvData::NoDefaultMethods'
c:\jenkins\win64-1\workspace\epics-7.0-windows\libraries\dll\os\win64\include\pv\pvaccess.h(379): note: see declaration of 'epics::pvAccess::ChannelFind'
c:\jenkins\win64-1\workspace\epics-7.0-windows\libraries\dll\os\win64\include\pv\pvaccess.h(833): warning C4275: non dll-interface class 'epics::pvData::NoDefaultMethods' used as base for dll-interface class 'epics::pvAccess::Channel'
c:\jenkins\win64-1\workspace\epics-7.0-windows\libraries\dll\os\win64\include\pv\nodefaultmethods.h(50): note: see declaration of 'epics::pvData::NoDefaultMethods'
c:\jenkins\win64-1\workspace\epics-7.0-windows\libraries\dll\os\win64\include\pv\pvaccess.h(830): note: see declaration of 'epics::pvAccess::Channel'
c:\jenkins\win64-1\workspace\epics-7.0-windows\libraries\dll\os\win64\include\pv\pvaccess.h(1154): warning C4275: non dll-interface class 'epics::pvData::NoDefaultMethods' used as base for dll-interface class 'epics::pvAccess::ChannelProvider'
c:\jenkins\win64-1\workspace\epics-7.0-windows\libraries\dll\os\win64\include\pv\nodefaultmethods.h(50): note: see declaration of 'epics::pvData::NoDefaultMethods'
c:\jenkins\win64-1\workspace\epics-7.0-windows\libraries\dll\os\win64\include\pv\pvaccess.h(1153): note: see declaration of 'epics::pvAccess::ChannelProvider'
c:\jenkins\win64-1\workspace\epics-7.0-windows\libraries\dll\os\win64\include\pv\pvaccess.h(1245): warning C4275: non dll-interface class 'epics::pvData::NoDefaultMethods' used as base for dll-interface class 'epics::pvAccess::ChannelProviderFactory'
c:\jenkins\win64-1\workspace\epics-7.0-windows\libraries\dll\os\win64\include\pv\nodefaultmethods.h(50): note: see declaration of 'epics::pvData::NoDefaultMethods'
c:\jenkins\win64-1\workspace\epics-7.0-windows\libraries\dll\os\win64\include\pv\pvaccess.h(1245): note: see declaration of 'epics::pvAccess::ChannelProviderFactory'
c:\jenkins\win64-1\workspace\epics-7.0-windows\libraries\dll\os\win64\include\pv\configuration.h(46): warning C4275: non dll-interface class 'epics::pvData::NoDefaultMethods' used as base for dll-interface class 'epics::pvAccess::Configuration'
c:\jenkins\win64-1\workspace\epics-7.0-windows\libraries\dll\os\win64\include\pv\nodefaultmethods.h(50): note: see declaration of 'epics::pvData::NoDefaultMethods'
c:\jenkins\win64-1\workspace\epics-7.0-windows\libraries\dll\os\win64\include\pv\configuration.h(45): note: see declaration of 'epics::pvAccess::Configuration'
c:\jenkins\win64-1\workspace\epics-7.0-windows\libraries\dll\os\win64\include\pv\configuration.h(206): warning C4275: non dll-interface class 'epics::pvData::NoDefaultMethods' used as base for dll-interface class 'epics::pvAccess::ConfigurationProvider'
c:\jenkins\win64-1\workspace\epics-7.0-windows\libraries\dll\os\win64\include\pv\nodefaultmethods.h(50): note: see declaration of 'epics::pvData::NoDefaultMethods'
c:\jenkins\win64-1\workspace\epics-7.0-windows\libraries\dll\os\win64\include\pv\configuration.h(205): note: see declaration of 'epics::pvAccess::ConfigurationProvider'
c:\jenkins\win64-1\workspace\epics-7.0-windows\libraries\dll\os\win64\include\pv\configuration.h(249): warning C4275: non dll-interface class 'epics::pvData::NoDefaultMethods' used as base for dll-interface class 'epics::pvAccess::ConfigurationFactory'
c:\jenkins\win64-1\workspace\epics-7.0-windows\libraries\dll\os\win64\include\pv\nodefaultmethods.h(50): note: see declaration of 'epics::pvData::NoDefaultMethods'
c:\jenkins\win64-1\workspace\epics-7.0-windows\libraries\dll\os\win64\include\pv\configuration.h(248): note: see declaration of 'epics::pvAccess::ConfigurationFactory'
c:\jenkins\win64-1\workspace\epics-7.0-windows\libraries\dll\os\win64\modules\pva2pva\pdbapp\pdbgroup.h(74): warning C4275: non dll-interface struct 'PDBPV' used as base for dll-interface struct 'PDBGroupPV'
c:\jenkins\win64-1\workspace\epics-7.0-windows\libraries\dll\os\win64\modules\pva2pva\pdbapp\pdb.h(16): note: see declaration of 'PDBPV'
c:\jenkins\win64-1\workspace\epics-7.0-windows\libraries\dll\os\win64\modules\pva2pva\pdbapp\pdbgroup.h(73): note: see declaration of 'PDBGroupPV'
c:\jenkins\win64-1\workspace\epics-7.0-windows\libraries\dll\os\win64\modules\pva2pva\pdbapp\pdbgroup.h(136): warning C4275: non dll-interface struct 'BaseChannel' used as base for dll-interface struct 'PDBGroupChannel'
c:\jenkins\win64-1\workspace\epics-7.0-windows\libraries\dll\os\win64\modules\pva2pva\common\pvahelper.h(19): note: see declaration of 'BaseChannel'
c:\jenkins\win64-1\workspace\epics-7.0-windows\libraries\dll\os\win64\modules\pva2pva\pdbapp\pdbgroup.h(136): note: see declaration of 'PDBGroupChannel'
make[4]: Leaving directory '<https://jenkins.aps.anl.gov/job/epics-7.0-windows/LIBRARIES=DLL,OS=win64/ws/modules/pva2pva/testApp/O.windows-x64'>
make[4]: Entering directory '<https://jenkins.aps.anl.gov/job/epics-7.0-windows/LIBRARIES=DLL,OS=win64/ws/modules/pva2pva/testApp/O.windows-x64'>
cl -EHsc -GR           -DUSE_TYPED_RSET -I../../pdbApp -I../../p2pApp -I../../common -DNOMINMAX     -nologo -FC -D__STDC__=0 -D_CRT_SECURE_NO_DEPRECATE -D_CRT_NONSTDC_NO_DEPRECATE   -Ox -GL -Oy-   -W3 -w44355 -w44344 -w44251        -MD -DEPICS_BUILD_DLL -DEPICS_CALL_DLL -TP  -I. -I../O.Common -I. -I. -I.. -I<https://jenkins.aps.anl.gov/job/epics-7.0-windows/LIBRARIES=DLL,OS=win64/ws/include/compiler/msvc> -I<https://jenkins.aps.anl.gov/job/epics-7.0-windows/LIBRARIES=DLL,OS=win64/ws/include/os/WIN32> -I<https://jenkins.aps.anl.gov/job/epics-7.0-windows/LIBRARIES=DLL,OS=win64/ws/include> -I<https://jenkins.aps.anl.gov/job/epics-7.0-windows/LIBRARIES=DLL,OS=win64/ws/include/compiler/msvc> -I<https://jenkins.aps.anl.gov/job/epics-7.0-windows/LIBRARIES=DLL,OS=win64/ws/include/os/WIN32> -I<https://jenkins.aps.anl.gov/job/epics-7.0-windows/LIBRARIES=DLL,OS=win64/ws/include>        -c ../testdbf_copy.cpp
testdbf_copy.cpp
c:\jenkins\win64-1\workspace\epics-7.0-windows\libraries\dll\os\win64\include\pv\pvdata.h(508): warning C4800: 'char': forcing value to bool 'true' or 'false' (performance warning)
c:\jenkins\win64-1\workspace\epics-7.0-windows\libraries\dll\os\win64\include\pv\pvdata.h(558): warning C4250: 'epics::pvData::PVString': inherits 'epics::pvData::PVScalarValue<std::string>::epics::pvData::PVScalarValue<std::string>::deserialize' via dominance
c:\jenkins\win64-1\workspace\epics-7.0-windows\libraries\dll\os\win64\include\pv\pvdata.h(461): note: see declaration of 'epics::pvData::PVScalarValue<std::string>::deserialize'
c:\jenkins\win64-1\workspace\epics-7.0-windows\libraries\dll\os\win64\modules\pva2pva\testapp\testdbf_copy.cpp(123): error C2976: 'epics::pvData::ScalarTypeTraits': too few template arguments
c:\jenkins\win64-1\workspace\epics-7.0-windows\libraries\dll\os\win64\include\pv\pvintrospect.h(1260): note: see declaration of 'epics::pvData::ScalarTypeTraits'
c:\jenkins\win64-1\workspace\epics-7.0-windows\libraries\dll\os\win64\modules\pva2pva\testapp\testdbf_copy.cpp(123): error C2146: syntax error: missing '>' before identifier 'type'
c:\jenkins\win64-1\workspace\epics-7.0-windows\libraries\dll\os\win64\modules\pva2pva\testapp\testdbf_copy.cpp(124): error C2976: 'epics::pvData::ScalarTypeTraits': too few template arguments
c:\jenkins\win64-1\workspace\epics-7.0-windows\libraries\dll\os\win64\include\pv\pvintrospect.h(1260): note: see declaration of 'epics::pvData::ScalarTypeTraits'
c:\jenkins\win64-1\workspace\epics-7.0-windows\libraries\dll\os\win64\modules\pva2pva\testapp\testdbf_copy.cpp(124): error C2146: syntax error: missing '>' before identifier 'type'
c:\jenkins\win64-1\workspace\epics-7.0-windows\libraries\dll\os\win64\modules\pva2pva\testapp\testdbf_copy.cpp(205): warning C4267: 'argument': conversion from 'size_t' to 'epics::pvData::uint32', possible loss of data
c:\jenkins\win64-1\workspace\epics-7.0-windows\libraries\dll\os\win64\modules\pva2pva\testapp\testdbf_copy.cpp(226): warning C4267: 'argument': conversion from 'size_t' to 'epics::pvData::uint32', possible loss of data
c:\jenkins\win64-1\workspace\epics-7.0-windows\libraries\dll\os\win64\modules\pva2pva\testapp\testdbf_copy.cpp(254): error C2672: '`anonymous-namespace'::testDBR2PVD_scalar': no matching overloaded function found
c:\jenkins\win64-1\workspace\epics-7.0-windows\libraries\dll\os\win64\modules\pva2pva\testapp\testdbf_copy.cpp(254): error C2893: Failed to specialize function template 'void `anonymous-namespace'::testDBR2PVD_scalar(epics::pvData::meta::arg_type<int>::type,epics::pvData::meta::arg_type<int>::type)'
c:\jenkins\win64-1\workspace\epics-7.0-windows\libraries\dll\os\win64\modules\pva2pva\testapp\testdbf_copy.cpp(254): note: With the following template arguments:
c:\jenkins\win64-1\workspace\epics-7.0-windows\libraries\dll\os\win64\modules\pva2pva\testapp\testdbf_copy.cpp(254): note: '__formal=epics::pvData::pvDouble'
c:\jenkins\win64-1\workspace\epics-7.0-windows\libraries\dll\os\win64\modules\pva2pva\testapp\testdbf_copy.cpp(254): note: '__formal=epics::pvData::pvDouble'
c:\jenkins\win64-1\workspace\epics-7.0-windows\libraries\dll\os\win64\modules\pva2pva\testapp\testdbf_copy.cpp(255): error C2672: '`anonymous-namespace'::testDBR2PVD_scalar': no matching overloaded function found
c:\jenkins\win64-1\workspace\epics-7.0-windows\libraries\dll\os\win64\modules\pva2pva\testapp\testdbf_copy.cpp(255): error C2893: Failed to specialize function template 'void `anonymous-namespace'::testDBR2PVD_scalar(epics::pvData::meta::arg_type<int>::type,epics::pvData::meta::arg_type<int>::type)'
c:\jenkins\win64-1\workspace\epics-7.0-windows\libraries\dll\os\win64\modules\pva2pva\testapp\testdbf_copy.cpp(255): note: With the following template arguments:
c:\jenkins\win64-1\workspace\epics-7.0-windows\libraries\dll\os\win64\modules\pva2pva\testapp\testdbf_copy.cpp(255): note: '__formal=epics::pvData::pvUShort'
c:\jenkins\win64-1\workspace\epics-7.0-windows\libraries\dll\os\win64\modules\pva2pva\testapp\testdbf_copy.cpp(255): note: '__formal=epics::pvData::pvDouble'
c:\jenkins\win64-1\workspace\epics-7.0-windows\libraries\dll\os\win64\modules\pva2pva\testapp\testdbf_copy.cpp(256): error C2672: '`anonymous-namespace'::testDBR2PVD_scalar': no matching overloaded function found
c:\jenkins\win64-1\workspace\epics-7.0-windows\libraries\dll\os\win64\modules\pva2pva\testapp\testdbf_copy.cpp(256): error C2893: Failed to specialize function template 'void `anonymous-namespace'::testDBR2PVD_scalar(epics::pvData::meta::arg_type<int>::type,epics::pvData::meta::arg_type<int>::type)'
c:\jenkins\win64-1\workspace\epics-7.0-windows\libraries\dll\os\win64\modules\pva2pva\testapp\testdbf_copy.cpp(256): note: With the following template arguments:
c:\jenkins\win64-1\workspace\epics-7.0-windows\libraries\dll\os\win64\modules\pva2pva\testapp\testdbf_copy.cpp(256): note: '__formal=epics::pvData::pvInt'
c:\jenkins\win64-1\workspace\epics-7.0-windows\libraries\dll\os\win64\modules\pva2pva\testapp\testdbf_copy.cpp(256): note: '__formal=epics::pvData::pvInt'
c:\jenkins\win64-1\workspace\epics-7.0-windows\libraries\dll\os\win64\modules\pva2pva\testapp\testdbf_copy.cpp(257): error C2672: '`anonymous-namespace'::testDBR2PVD_scalar': no matching overloaded function found
c:\jenkins\win64-1\workspace\epics-7.0-windows\libraries\dll\os\win64\modules\pva2pva\testapp\testdbf_copy.cpp(257): error C2893: Failed to specialize function template 'void `anonymous-namespace'::testDBR2PVD_scalar(epics::pvData::meta::arg_type<int>::type,epics::pvData::meta::arg_type<int>::type)'
c:\jenkins\win64-1\workspace\epics-7.0-windows\libraries\dll\os\win64\modules\pva2pva\testapp\testdbf_copy.cpp(257): note: With the following template arguments:
c:\jenkins\win64-1\workspace\epics-7.0-windows\libraries\dll\os\win64\modules\pva2pva\testapp\testdbf_copy.cpp(257): note: '__formal=epics::pvData::pvString'
c:\jenkins\win64-1\workspace\epics-7.0-windows\libraries\dll\os\win64\modules\pva2pva\testapp\testdbf_copy.cpp(257): note: '__formal=epics::pvData::pvInt'
c:\jenkins\win64-1\workspace\epics-7.0-windows\libraries\dll\os\win64\modules\pva2pva\testapp\testdbf_copy.cpp(258): error C2672: '`anonymous-namespace'::testDBR2PVD_scalar': no matching overloaded function found
c:\jenkins\win64-1\workspace\epics-7.0-windows\libraries\dll\os\win64\modules\pva2pva\testapp\testdbf_copy.cpp(258): error C2893: Failed to specialize function template 'void `anonymous-namespace'::testDBR2PVD_scalar(epics::pvData::meta::arg_type<int>::type,epics::pvData::meta::arg_type<int>::type)'
c:\jenkins\win64-1\workspace\epics-7.0-windows\libraries\dll\os\win64\modules\pva2pva\testapp\testdbf_copy.cpp(258): note: With the following template arguments:
c:\jenkins\win64-1\workspace\epics-7.0-windows\libraries\dll\os\win64\modules\pva2pva\testapp\testdbf_copy.cpp(258): note: '__formal=epics::pvData::pvString'
c:\jenkins\win64-1\workspace\epics-7.0-windows\libraries\dll\os\win64\modules\pva2pva\testapp\testdbf_copy.cpp(258): note: '__formal=epics::pvData::pvString'
c:\jenkins\win64-1\workspace\epics-7.0-windows\libraries\dll\os\win64\modules\pva2pva\testapp\testdbf_copy.cpp(259): error C2672: '`anonymous-namespace'::testDBR2PVD_scalar': no matching overloaded function found
c:\jenkins\win64-1\workspace\epics-7.0-windows\libraries\dll\os\win64\modules\pva2pva\testapp\testdbf_copy.cpp(259): error C2893: Failed to specialize function template 'void `anonymous-namespace'::testDBR2PVD_scalar(epics::pvData::meta::arg_type<int>::type,epics::pvData::meta::arg_type<int>::type)'
c:\jenkins\win64-1\workspace\epics-7.0-windows\libraries\dll\os\win64\modules\pva2pva\testapp\testdbf_copy.cpp(259): note: With the following template arguments:
c:\jenkins\win64-1\workspace\epics-7.0-windows\libraries\dll\os\win64\modules\pva2pva\testapp\testdbf_copy.cpp(259): note: '__formal=epics::pvData::pvInt'
c:\jenkins\win64-1\workspace\epics-7.0-windows\libraries\dll\os\win64\modules\pva2pva\testapp\testdbf_copy.cpp(259): note: '__formal=epics::pvData::pvString'
<https://jenkins.aps.anl.gov/job/epics-7.0-windows/LIBRARIES=DLL,OS=win64/ws/configure/RULES_BUILD>:239: recipe for target 'testdbf_copy.obj' failed
make[4]: *** [testdbf_copy.obj] Error 2
make[4]: Leaving directory '<https://jenkins.aps.anl.gov/job/epics-7.0-windows/LIBRARIES=DLL,OS=win64/ws/modules/pva2pva/testApp/O.windows-x64'>
make[4]: *** Waiting for unfinished jobs....
make[4]: Entering directory '<https://jenkins.aps.anl.gov/job/epics-7.0-windows/LIBRARIES=DLL,OS=win64/ws/modules/pva2pva/testApp/O.windows-x64'>
link -nologo  -LTCG -incremental:no -opt:ref -release  -MACHINE:X64              -out:check_consist.exe       check_consist.obj utilitiesx.obj     <https://jenkins.aps.anl.gov/job/epics-7.0-windows/LIBRARIES=DLL,OS=win64/ws/lib/windows-x64/pvAccess.lib>  <https://jenkins.aps.anl.gov/job/epics-7.0-windows/LIBRARIES=DLL,OS=win64/ws/lib/windows-x64/pvData.lib>  <https://jenkins.aps.anl.gov/job/epics-7.0-windows/LIBRARIES=DLL,OS=win64/ws/lib/windows-x64/dbRecStd.lib>  <https://jenkins.aps.anl.gov/job/epics-7.0-windows/LIBRARIES=DLL,OS=win64/ws/lib/windows-x64/dbCore.lib>  <https://jenkins.aps.anl.gov/job/epics-7.0-windows/LIBRARIES=DLL,OS=win64/ws/lib/windows-x64/ca.lib>  <https://jenkins.aps.anl.gov/job/epics-7.0-windows/LIBRARIES=DLL,OS=win64/ws/lib/windows-x64/Com.lib>   
Generating code
Finished generating code
make[4]: Leaving directory '<https://jenkins.aps.anl.gov/job/epics-7.0-windows/LIBRARIES=DLL,OS=win64/ws/modules/pva2pva/testApp/O.windows-x64'>
make[4]: Entering directory '<https://jenkins.aps.anl.gov/job/epics-7.0-windows/LIBRARIES=DLL,OS=win64/ws/modules/pva2pva/testApp/O.windows-x64'>
link -nologo  -LTCG -incremental:no -opt:ref -release  -MACHINE:X64              -out:testweak.exe       testweak.obj utilitiesx.obj    <https://jenkins.aps.anl.gov/job/epics-7.0-windows/LIBRARIES=DLL,OS=win64/ws/lib/windows-x64/Com.lib>  <https://jenkins.aps.anl.gov/job/epics-7.0-windows/LIBRARIES=DLL,OS=win64/ws/lib/windows-x64/pvAccess.lib>  <https://jenkins.aps.anl.gov/job/epics-7.0-windows/LIBRARIES=DLL,OS=win64/ws/lib/windows-x64/pvData.lib>  <https://jenkins.aps.anl.gov/job/epics-7.0-windows/LIBRARIES=DLL,OS=win64/ws/lib/windows-x64/dbRecStd.lib>  <https://jenkins.aps.anl.gov/job/epics-7.0-windows/LIBRARIES=DLL,OS=win64/ws/lib/windows-x64/dbCore.lib>  <https://jenkins.aps.anl.gov/job/epics-7.0-windows/LIBRARIES=DLL,OS=win64/ws/lib/windows-x64/ca.lib>  <https://jenkins.aps.anl.gov/job/epics-7.0-windows/LIBRARIES=DLL,OS=win64/ws/lib/windows-x64/Com.lib>   
Generating code
Finished generating code
make[4]: Leaving directory '<https://jenkins.aps.anl.gov/job/epics-7.0-windows/LIBRARIES=DLL,OS=win64/ws/modules/pva2pva/testApp/O.windows-x64'>
make[4]: Entering directory '<https://jenkins.aps.anl.gov/job/epics-7.0-windows/LIBRARIES=DLL,OS=win64/ws/modules/pva2pva/testApp/O.windows-x64'>
link -nologo  -LTCG -incremental:no -opt:ref -release  -MACHINE:X64              -out:testtest.exe       testtest.obj utilitiesx.obj     <https://jenkins.aps.anl.gov/job/epics-7.0-windows/LIBRARIES=DLL,OS=win64/ws/lib/windows-x64/pvAccess.lib>  <https://jenkins.aps.anl.gov/job/epics-7.0-windows/LIBRARIES=DLL,OS=win64/ws/lib/windows-x64/pvData.lib>  <https://jenkins.aps.anl.gov/job/epics-7.0-windows/LIBRARIES=DLL,OS=win64/ws/lib/windows-x64/dbRecStd.lib>  <https://jenkins.aps.anl.gov/job/epics-7.0-windows/LIBRARIES=DLL,OS=win64/ws/lib/windows-x64/dbCore.lib>  <https://jenkins.aps.anl.gov/job/epics-7.0-windows/LIBRARIES=DLL,OS=win64/ws/lib/windows-x64/ca.lib>  <https://jenkins.aps.anl.gov/job/epics-7.0-windows/LIBRARIES=DLL,OS=win64/ws/lib/windows-x64/Com.lib>   
Generating code
Finished generating code
make[4]: Leaving directory '<https://jenkins.aps.anl.gov/job/epics-7.0-windows/LIBRARIES=DLL,OS=win64/ws/modules/pva2pva/testApp/O.windows-x64'>
<https://jenkins.aps.anl.gov/job/epics-7.0-windows/LIBRARIES=DLL,OS=win64/ws/configure/RULES_ARCHS>:58: recipe for target 'install.windows-x64' failed
make[3]: *** [install.windows-x64] Error 2
<https://jenkins.aps.anl.gov/job/epics-7.0-windows/LIBRARIES=DLL,OS=win64/ws/configure/RULES_DIRS>:84: recipe for target 'testApp.install' failed
make[2]: *** [testApp.install] Error 2
../configure/RULES_DIRS:84: recipe for target 'pva2pva.install' failed
make[1]: *** [pva2pva.install] Error 2
configure/RULES_DIRS:84: recipe for target 'modules.install' failed
make: *** [modules.install] Error 2
Build step 'Execute Windows batch command' marked build as failure
[WARNINGS] Skipping publisher since build result is FAILURE

Replies:
Build failed in Jenkins: epics-7.0-windows » DLL, win64 #48 APS Jenkins

Navigate by Date:
Prev: Build failed in Jenkins: epics-7.0-windows » STATIC,win32 #47 APS Jenkins
Next: Build failed in Jenkins: epics-7.0-windows » STATIC,win32 #48 APS Jenkins
Index: 2002  2003  2004  2005  2006  2007  2008  2009  2010  2011  2012  2013  2014  2015  2016  2017  <20182019  2020  2021 
Navigate by Thread:
Prev: Jenkins build is back to normal : epics-7.0-windows » STATIC,win32 #51 APS Jenkins
Next: Build failed in Jenkins: epics-7.0-windows » DLL, win64 #48 APS Jenkins
Index: 2002  2003  2004  2005  2006  2007  2008  2009  2010  2011  2012  2013  2014  2015  2016  2017  <20182019  2020  2021