EPICS Home

Experimental Physics and Industrial Control System


 
1994  1995  1996  1997  1998  1999  2000  2001  2002  <20032004  2005  2006  2007  2008  2009  2010  2011  2012  2013  2014  2015  2016  2017  2018  2019  Index 1994  1995  1996  1997  1998  1999  2000  2001  2002  <20032004  2005  2006  2007  2008  2009  2010  2011  2012  2013  2014  2015  2016  2017  2018  2019 
<== Date ==> <== Thread ==>

Subject: about edm1-10-0s-beta
From: "zhaozhuo" <zhaozhuo@ihep.ac.cn>
To: "tech-talk" <tech-talk@aps.anl.gov>
Date: Tue, 16 Dec 2003 16:58:05 +0800
Hi,everyone!
 
I'm compiling edm1-10-0s-beta based on base3.13.8.There are some error that i don't know how to solve.That is:
 
 
g++   -DSOLARIS=8  -g  -Wall -Wmissing-prototypes -Woverloaded-virtual -Wwrite-strings -Wconversion -Wstrict-prototypes -Wpointer-arith -Winline   -D__solaris__ -DSINGLE_THREADED=1 -D__epics__=1  -fPIC -D_REENTRANT  -DUNIX -DEXPL_TEMPL -I. -I.. -I../ -I../../util -I../../pvlib -I/usr/dt/include -I/usr/openwin/include -I../../../../include -I../../../../include/os/solaris -I/home1/local/epics/epics3.13.8/extensions/include -I/home1/local/epics/epics3.13.8/base/include/os/solaris -I/home1/local/epics/epics3.13.8/base/include    -c   ../process.cc
In file included from ../process.cc:19:
../process.h:38: syntax error before `;'
../process.cc: In method `processClass::processClass()':
../process.cc:26: implicit declaration of function `int thread_init(...)'
../process.cc:27: `processLock' undeclared (first use this function)
../process.cc:27: (Each undeclared identifier is reported only once
../process.cc:27: for each function it appears in.)
../process.cc:27: implicit declaration of function `int thread_create_lock_handle(...)'
../process.cc: In method `processClass::~processClass()':
../process.cc:36: implicit declaration of function `int thread_destroy_lock_handle(...)'
../process.cc: In method `int processClass::lock()':
../process.cc:46: implicit declaration of function `int thread_lock(...)'
../process.cc: In method `int processClass::unlock()':
../process.cc:56: implicit declaration of function `int thread_unlock(...)'
gmake[2]: *** [process.o] Error 1
gmake[2]: Leaving directory `/export/home1/local/epics/epics3.13.8/extensions/src/edm1.10.0/lib/O.solaris'
gmake[1]: *** [buildInstall.solaris] Error 2
gmake[1]: Leaving directory `/export/home1/local/epics/epics3.13.8/extensions/src/edm1.10.0/lib'
gmake: *** [lib.buildInstall] Error 2

Navigate by Date:
Prev: Re: Linking Unix Matlab-Compiled Programs against MCA Steven . Banks
Next: Re: mosub record and R3.14 Andy Foster
Index: 1994  1995  1996  1997  1998  1999  2000  2001  2002  <20032004  2005  2006  2007  2008  2009  2010  2011  2012  2013  2014  2015  2016  2017  2018  2019 
Navigate by Thread:
Prev: RE: Linking Unix Matlab-Compiled Programs against MCA Chestnut, Ronald P.
Next: SBS IP module support? Laznovsky, Michael
Index: 1994  1995  1996  1997  1998  1999  2000  2001  2002  <20032004  2005  2006  2007  2008  2009  2010  2011  2012  2013  2014  2015  2016  2017  2018  2019