EPICS Home

Experimental Physics and Industrial Control System


 
1994  1995  1996  1997  1998  1999  2000  2001  2002  2003  2004  2005  2006  2007  2008  2009  2010  2011  <20122013  2014  2015  2016  2017  2018  2019  Index 1994  1995  1996  1997  1998  1999  2000  2001  2002  2003  2004  2005  2006  2007  2008  2009  2010  2011  <20122013  2014  2015  2016  2017  2018  2019 
<== Date ==> <== Thread ==>

Subject: RE: dbd expand errors for measurementComputing module
From: Mark Rivers <rivers@cars.uchicago.edu>
To: "'S. Stein'" <stein@aps.anl.gov>, "tech-talk@aps.anl.gov" <tech-talk@aps.anl.gov>
Date: Wed, 20 Jun 2012 16:10:02 +0000
Hi Josh,

I suspect you have a problem with D:/epics/measCompR1-0/configure/RELEASE.  It probably is not pointing to the correct locations of asyn, etc. so it is not including them in the -I list when calling dbExpand.exe.

Mark


-----Original Message-----
From: tech-talk-bounces@aps.anl.gov [mailto:tech-talk-bounces@aps.anl.gov] On Behalf Of S. Stein
Sent: Wednesday, June 20, 2012 10:20 AM
To: tech-talk@aps.anl.gov
Subject: dbd expand errors for measurementComputing module

Mark, et-al:

I am attempting to build the Measurement Computing support on a windows box with Visual Studio 10. I have successfully built base (3.14.12.2) and synApps (5.6).

During the build for measCompR1-0, the following errors cause failure during the dbExpand portion:

 
D:\epics\measCompR1-0>make
make: Entering directory `D:/epics/measCompR1-0'
make -C ./configure install
make[1]: Entering directory `D:/epics/measCompR1-0/configure'
make -C O.win32-x86 -f ../Makefile TOP=../.. T_A=win32-x86 install
make[2]: Entering directory `D:/epics/measCompR1-0/configure/O.win32-x86'
perl D:/base/bin/win32-x86/convertRelease.pl checkRelease
make[2]: Leaving directory `D:/epics/measCompR1-0/configure/O.win32-x86'
make[1]: Leaving directory `D:/epics/measCompR1-0/configure'
make -C ./measCompApp install
make[1]: Entering directory `D:/epics/measCompR1-0/measCompApp'
make -C ./src install
make[2]: Entering directory `D:/epics/measCompR1-0/measCompApp/src'
perl D:/base/bin/win32-x86/makeMakefile.pl O.win32-x86 ../../..
perl -MExtUtils::Command -e mkpath O.Common
make -C O.win32-x86 -f ../Makefile TOP=../../.. T_A=win32-x86 install
make[3]: Entering directory `D:/epics/measCompR1-0/measCompApp/src/O.win32-x86'
echo "../measCompAppInclude.dbd : ../Makefile" >> measCompApp.dbd.d
"Expanding dbd"
D:\\base\\bin\\win32-x86\\dbExpand.exe  -I . -I .. -I ../../../dbd        -ID:/epics/synApps_5_6/support/seq-2-1-3/dbd  -ID:/base/dbd -o measCompApp.dbd ../measCompAppInclude.dbd
Can't open include file "asyn.dbd"
Error at or before ""asyn.dbd"" in file "../measCompAppInclude.dbd" line 2
Can't open include file "stdSupport.dbd"
Error at or before ""stdSupport.dbd"" in file "../measCompAppInclude.dbd" line 3
Can't open include file "busySupport.dbd"
Error at or before ""busySupport.dbd"" in file "../measCompAppInclude.dbd" line 4
Can't open include file "sscanSupport.dbd"
Error at or before ""sscanSupport.dbd"" in file "../measCompAppInclude.dbd" line 5
Can't open include file "calcSupport.dbd"
Error at or before ""calcSupport.dbd"" in file "../measCompAppInclude.dbd" line 6
Can't open include file "asSupport.dbd"
Error at or before ""asSupport.dbd"" in file "../measCompAppInclude.dbd" line 7
dbExpand: Input errors, no output generated
make[3]: *** [../O.Common/measCompApp.dbd] Error 1
make[3]: Leaving directory `D:/epics/measCompR1-0/measCompApp/src/O.win32-x86'
make[2]: *** [install.win32-x86] Error 2
make[2]: Leaving directory `D:/epics/measCompR1-0/measCompApp/src'
make[1]: *** [src.install] Error 2
make[1]: Leaving directory `D:/epics/measCompR1-0/measCompApp'
make: *** [measCompApp.install] Error 2
make: Leaving directory `D:/epics/measCompR1-0'

As always, any ideas are welcome.

--Josh


References:
dbd expand errors for measurementComputing module S. Stein

Navigate by Date:
Prev: Re: Strange performance results -- any ideas? Dirk Zimoch
Next: caxy-1.0.0 released; CA tunneling with SSH Till Straumann
Index: 1994  1995  1996  1997  1998  1999  2000  2001  2002  2003  2004  2005  2006  2007  2008  2009  2010  2011  <20122013  2014  2015  2016  2017  2018  2019 
Navigate by Thread:
Prev: dbd expand errors for measurementComputing module S. Stein
Next: Re: dbd expand errors for measurementComputing module Tim Mooney
Index: 1994  1995  1996  1997  1998  1999  2000  2001  2002  2003  2004  2005  2006  2007  2008  2009  2010  2011  <20122013  2014  2015  2016  2017  2018  2019