Argonne National Laboratory

Experimental Physics and
Industrial Control System

2002  2003  2004  2005  2006  2007  2008  2009  2010  2011  2012  2013  <20142015  2016  2017  2018  2019  2020  2021  Index 2002  2003  2004  2005  2006  2007  2008  2009  2010  2011  2012  2013  <20142015  2016  2017  2018  2019  2020  2021 
<== Date ==> <== Thread ==>

Subject: Build failed in Jenkins: epics-base-3.15-win32s #59
From: APS Jenkins <aps-jenkins@anl.gov>
To: core-talk@aps.anl.gov
Date: Fri, 26 Sep 2014 15:16:31 -0500 (CDT)
See <https://jenkins.aps.anl.gov/job/epics-base-3.15-win32s/59/>

------------------------------------------
[...truncated 426 lines...]
timerQueueActiveMgr.cpp
cl -EHsc -GR               -nologo -D__STDC__=0 -D_CRT_SECURE_NO_DEPRECATE -D_CRT_NONSTDC_NO_DEPRECATE   -Ox -GL -Oy-   -W3 -w44355       -MT  -TP  -I. -I../O.Common -I. -I../../../src/libCom/osi/compiler/msvc -I../../../src/libCom/osi/compiler/default -I. -I../../../src/libCom/osi/os/WIN32 -I../../../src/libCom/osi/os/default -I.. -I../../../src/libCom/as -I../../../src/libCom/bucketLib -I../../../src/libCom/calc -I../../../src/libCom/cvtFast -I../../../src/libCom/cppStd -I../../../src/libCom/cxxTemplates -I../../../src/libCom/dbmf -I../../../src/libCom/ellLib -I../../../src/libCom/env -I../../../src/libCom/error -I../../../src/libCom/fdmgr -I../../../src/libCom/flex -I../../../src/libCom/freeList -I../../../src/libCom/gpHash -I../../../src/libCom/iocsh -I../../../src/libCom/log -I../../../src/libCom/macLib -I../../../src/libCom/misc -I../../../src/libCom/osi -I../../../src/libCom/pool -I../../../src/libCom/ring -I../../../src/libCom/taskwd -I../../../src/libCom/timer -I../!
 ../../src/libCom/yacc -I../../../src/libCom/yacc -I../../../src/libCom/yajl -I../../../include/compiler/msvc -I../../../include/os/WIN32 -I../../../include        -c ../../../src/libCom/timer/timerQueuePassive.cpp
timerQueuePassive.cpp
cl               -nologo -D__STDC__=0 -D_CRT_SECURE_NO_DEPRECATE -D_CRT_NONSTDC_NO_DEPRECATE   -Ox -GL -Oy-   -W3 -w44355       -MT    -I. -I../O.Common -I. -I../../../src/libCom/osi/compiler/msvc -I../../../src/libCom/osi/compiler/default -I. -I../../../src/libCom/osi/os/WIN32 -I../../../src/libCom/osi/os/default -I.. -I../../../src/libCom/as -I../../../src/libCom/bucketLib -I../../../src/libCom/calc -I../../../src/libCom/cvtFast -I../../../src/libCom/cppStd -I../../../src/libCom/cxxTemplates -I../../../src/libCom/dbmf -I../../../src/libCom/ellLib -I../../../src/libCom/env -I../../../src/libCom/error -I../../../src/libCom/fdmgr -I../../../src/libCom/flex -I../../../src/libCom/freeList -I../../../src/libCom/gpHash -I../../../src/libCom/iocsh -I../../../src/libCom/log -I../../../src/libCom/macLib -I../../../src/libCom/misc -I../../../src/libCom/osi -I../../../src/libCom/pool -I../../../src/libCom/ring -I../../../src/libCom/taskwd -I../../../src/libCom/timer -I../../../src/lib!
 Com/yacc -I../../../src/libCom/yacc -I../../../src/libCom/yajl -I../../../include/compiler/msvc -I../../../include/os/WIN32 -I../../../include        -c ../../../src/libCom/yajl/yajl.c
yajl.c
cl               -nologo -D__STDC__=0 -D_CRT_SECURE_NO_DEPRECATE -D_CRT_NONSTDC_NO_DEPRECATE   -Ox -GL -Oy-   -W3 -w44355       -MT    -I. -I../O.Common -I. -I../../../src/libCom/osi/compiler/msvc -I../../../src/libCom/osi/compiler/default -I. -I../../../src/libCom/osi/os/WIN32 -I../../../src/libCom/osi/os/default -I.. -I../../../src/libCom/as -I../../../src/libCom/bucketLib -I../../../src/libCom/calc -I../../../src/libCom/cvtFast -I../../../src/libCom/cppStd -I../../../src/libCom/cxxTemplates -I../../../src/libCom/dbmf -I../../../src/libCom/ellLib -I../../../src/libCom/env -I../../../src/libCom/error -I../../../src/libCom/fdmgr -I../../../src/libCom/flex -I../../../src/libCom/freeList -I../../../src/libCom/gpHash -I../../../src/libCom/iocsh -I../../../src/libCom/log -I../../../src/libCom/macLib -I../../../src/libCom/misc -I../../../src/libCom/osi -I../../../src/libCom/pool -I../../../src/libCom/ring -I../../../src/libCom/taskwd -I../../../src/libCom/timer -I../../../src/lib!
 Com/yacc -I../../../src/libCom/yacc -I../../../src/libCom/yajl -I../../../include/compiler/msvc -I../../../include/os/WIN32 -I../../../include        -c ../../../src/libCom/yajl/yajl_alloc.c
yajl_alloc.c
cl               -nologo -D__STDC__=0 -D_CRT_SECURE_NO_DEPRECATE -D_CRT_NONSTDC_NO_DEPRECATE   -Ox -GL -Oy-   -W3 -w44355       -MT    -I. -I../O.Common -I. -I../../../src/libCom/osi/compiler/msvc -I../../../src/libCom/osi/compiler/default -I. -I../../../src/libCom/osi/os/WIN32 -I../../../src/libCom/osi/os/default -I.. -I../../../src/libCom/as -I../../../src/libCom/bucketLib -I../../../src/libCom/calc -I../../../src/libCom/cvtFast -I../../../src/libCom/cppStd -I../../../src/libCom/cxxTemplates -I../../../src/libCom/dbmf -I../../../src/libCom/ellLib -I../../../src/libCom/env -I../../../src/libCom/error -I../../../src/libCom/fdmgr -I../../../src/libCom/flex -I../../../src/libCom/freeList -I../../../src/libCom/gpHash -I../../../src/libCom/iocsh -I../../../src/libCom/log -I../../../src/libCom/macLib -I../../../src/libCom/misc -I../../../src/libCom/osi -I../../../src/libCom/pool -I../../../src/libCom/ring -I../../../src/libCom/taskwd -I../../../src/libCom/timer -I../../../src/lib!
 Com/yacc -I../../../src/libCom/yacc -I../../../src/libCom/yajl -I../../../include/compiler/msvc -I../../../include/os/WIN32 -I../../../include        -c ../../../src/libCom/yajl/yajl_buf.c
yajl_buf.c
cl               -nologo -D__STDC__=0 -D_CRT_SECURE_NO_DEPRECATE -D_CRT_NONSTDC_NO_DEPRECATE   -Ox -GL -Oy-   -W3 -w44355       -MT    -I. -I../O.Common -I. -I../../../src/libCom/osi/compiler/msvc -I../../../src/libCom/osi/compiler/default -I. -I../../../src/libCom/osi/os/WIN32 -I../../../src/libCom/osi/os/default -I.. -I../../../src/libCom/as -I../../../src/libCom/bucketLib -I../../../src/libCom/calc -I../../../src/libCom/cvtFast -I../../../src/libCom/cppStd -I../../../src/libCom/cxxTemplates -I../../../src/libCom/dbmf -I../../../src/libCom/ellLib -I../../../src/libCom/env -I../../../src/libCom/error -I../../../src/libCom/fdmgr -I../../../src/libCom/flex -I../../../src/libCom/freeList -I../../../src/libCom/gpHash -I../../../src/libCom/iocsh -I../../../src/libCom/log -I../../../src/libCom/macLib -I../../../src/libCom/misc -I../../../src/libCom/osi -I../../../src/libCom/pool -I../../../src/libCom/ring -I../../../src/libCom/taskwd -I../../../src/libCom/timer -I../../../src/lib!
 Com/yacc -I../../../src/libCom/yacc -I../../../src/libCom/yajl -I../../../include/compiler/msvc -I../../../include/os/WIN32 -I../../../include        -c ../../../src/libCom/yajl/yajl_encode.c
yajl_encode.c
cl               -nologo -D__STDC__=0 -D_CRT_SECURE_NO_DEPRECATE -D_CRT_NONSTDC_NO_DEPRECATE   -Ox -GL -Oy-   -W3 -w44355       -MT    -I. -I../O.Common -I. -I../../../src/libCom/osi/compiler/msvc -I../../../src/libCom/osi/compiler/default -I. -I../../../src/libCom/osi/os/WIN32 -I../../../src/libCom/osi/os/default -I.. -I../../../src/libCom/as -I../../../src/libCom/bucketLib -I../../../src/libCom/calc -I../../../src/libCom/cvtFast -I../../../src/libCom/cppStd -I../../../src/libCom/cxxTemplates -I../../../src/libCom/dbmf -I../../../src/libCom/ellLib -I../../../src/libCom/env -I../../../src/libCom/error -I../../../src/libCom/fdmgr -I../../../src/libCom/flex -I../../../src/libCom/freeList -I../../../src/libCom/gpHash -I../../../src/libCom/iocsh -I../../../src/libCom/log -I../../../src/libCom/macLib -I../../../src/libCom/misc -I../../../src/libCom/osi -I../../../src/libCom/pool -I../../../src/libCom/ring -I../../../src/libCom/taskwd -I../../../src/libCom/timer -I../../../src/lib!
 Com/yacc -I../../../src/libCom/yacc -I../../../src/libCom/yajl -I../../../include/compiler/msvc -I../../../include/os/WIN32 -I../../../include        -c ../../../src/libCom/yajl/yajl_gen.c
yajl_gen.c
cl               -nologo -D__STDC__=0 -D_CRT_SECURE_NO_DEPRECATE -D_CRT_NONSTDC_NO_DEPRECATE   -Ox -GL -Oy-   -W3 -w44355       -MT    -I. -I../O.Common -I. -I../../../src/libCom/osi/compiler/msvc -I../../../src/libCom/osi/compiler/default -I. -I../../../src/libCom/osi/os/WIN32 -I../../../src/libCom/osi/os/default -I.. -I../../../src/libCom/as -I../../../src/libCom/bucketLib -I../../../src/libCom/calc -I../../../src/libCom/cvtFast -I../../../src/libCom/cppStd -I../../../src/libCom/cxxTemplates -I../../../src/libCom/dbmf -I../../../src/libCom/ellLib -I../../../src/libCom/env -I../../../src/libCom/error -I../../../src/libCom/fdmgr -I../../../src/libCom/flex -I../../../src/libCom/freeList -I../../../src/libCom/gpHash -I../../../src/libCom/iocsh -I../../../src/libCom/log -I../../../src/libCom/macLib -I../../../src/libCom/misc -I../../../src/libCom/osi -I../../../src/libCom/pool -I../../../src/libCom/ring -I../../../src/libCom/taskwd -I../../../src/libCom/timer -I../../../src/lib!
 Com/yacc -I../../../src/libCom/yacc -I../../../src/libCom/yajl -I../../../include/compiler/msvc -I../../../include/os/WIN32 -I../../../include        -c ../../../src/libCom/yajl/yajl_lex.c
yajl_lex.c
cl               -nologo -D__STDC__=0 -D_CRT_SECURE_NO_DEPRECATE -D_CRT_NONSTDC_NO_DEPRECATE   -Ox -GL -Oy-   -W3 -w44355       -MT    -I. -I../O.Common -I. -I../../../src/libCom/osi/compiler/msvc -I../../../src/libCom/osi/compiler/default -I. -I../../../src/libCom/osi/os/WIN32 -I../../../src/libCom/osi/os/default -I.. -I../../../src/libCom/as -I../../../src/libCom/bucketLib -I../../../src/libCom/calc -I../../../src/libCom/cvtFast -I../../../src/libCom/cppStd -I../../../src/libCom/cxxTemplates -I../../../src/libCom/dbmf -I../../../src/libCom/ellLib -I../../../src/libCom/env -I../../../src/libCom/error -I../../../src/libCom/fdmgr -I../../../src/libCom/flex -I../../../src/libCom/freeList -I../../../src/libCom/gpHash -I../../../src/libCom/iocsh -I../../../src/libCom/log -I../../../src/libCom/macLib -I../../../src/libCom/misc -I../../../src/libCom/osi -I../../../src/libCom/pool -I../../../src/libCom/ring -I../../../src/libCom/taskwd -I../../../src/libCom/timer -I../../../src/lib!
 Com/yacc -I../../../src/libCom/yacc -I../../../src/libCom/yajl -I../../../include/compiler/msvc -I../../../include/os/WIN32 -I../../../include        -c ../../../src/libCom/yajl/yajl_parser.c
yajl_parser.c
cl               -nologo -D__STDC__=0 -D_CRT_SECURE_NO_DEPRECATE -D_CRT_NONSTDC_NO_DEPRECATE   -Ox -GL -Oy-   -W3 -w44355       -MT    -I. -I../O.Common -I. -I../../../src/libCom/osi/compiler/msvc -I../../../src/libCom/osi/compiler/default -I. -I../../../src/libCom/osi/os/WIN32 -I../../../src/libCom/osi/os/default -I.. -I../../../src/libCom/as -I../../../src/libCom/bucketLib -I../../../src/libCom/calc -I../../../src/libCom/cvtFast -I../../../src/libCom/cppStd -I../../../src/libCom/cxxTemplates -I../../../src/libCom/dbmf -I../../../src/libCom/ellLib -I../../../src/libCom/env -I../../../src/libCom/error -I../../../src/libCom/fdmgr -I../../../src/libCom/flex -I../../../src/libCom/freeList -I../../../src/libCom/gpHash -I../../../src/libCom/iocsh -I../../../src/libCom/log -I../../../src/libCom/macLib -I../../../src/libCom/misc -I../../../src/libCom/osi -I../../../src/libCom/pool -I../../../src/libCom/ring -I../../../src/libCom/taskwd -I../../../src/libCom/timer -I../../../src/lib!
 Com/yacc -I../../../src/libCom/yacc -I../../../src/libCom/yajl -I../../../include/compiler/msvc -I../../../include/os/WIN32 -I../../../include        -c ../../../src/libCom/osi/os/WIN32/epicsGetopt.c
epicsGetopt.c
cl -EHsc -GR               -nologo -D__STDC__=0 -D_CRT_SECURE_NO_DEPRECATE -D_CRT_NONSTDC_NO_DEPRECATE   -Ox -GL -Oy-   -W3 -w44355       -MT  -TP  -I. -I../O.Common -I. -I../../../src/libCom/osi/compiler/msvc -I../../../src/libCom/osi/compiler/default -I. -I../../../src/libCom/osi/os/WIN32 -I../../../src/libCom/osi/os/default -I.. -I../../../src/libCom/as -I../../../src/libCom/bucketLib -I../../../src/libCom/calc -I../../../src/libCom/cvtFast -I../../../src/libCom/cppStd -I../../../src/libCom/cxxTemplates -I../../../src/libCom/dbmf -I../../../src/libCom/ellLib -I../../../src/libCom/env -I../../../src/libCom/error -I../../../src/libCom/fdmgr -I../../../src/libCom/flex -I../../../src/libCom/freeList -I../../../src/libCom/gpHash -I../../../src/libCom/iocsh -I../../../src/libCom/log -I../../../src/libCom/macLib -I../../../src/libCom/misc -I../../../src/libCom/osi -I../../../src/libCom/pool -I../../../src/libCom/ring -I../../../src/libCom/taskwd -I../../../src/libCom/timer -I../!
 ../../src/libCom/yacc -I../../../src/libCom/yacc -I../../../src/libCom/yajl -I../../../include/compiler/msvc -I../../../include/os/WIN32 -I../../../include        -c ../../../src/libCom/osi/os/WIN32/setThreadName.cpp
setThreadName.cpp
cl -EHsc -GR               -nologo -D__STDC__=0 -D_CRT_SECURE_NO_DEPRECATE -D_CRT_NONSTDC_NO_DEPRECATE   -Ox -GL -Oy-   -W3 -w44355       -MT  -TP  -I. -I../O.Common -I. -I../../../src/libCom/osi/compiler/msvc -I../../../src/libCom/osi/compiler/default -I. -I../../../src/libCom/osi/os/WIN32 -I../../../src/libCom/osi/os/default -I.. -I../../../src/libCom/as -I../../../src/libCom/bucketLib -I../../../src/libCom/calc -I../../../src/libCom/cvtFast -I../../../src/libCom/cppStd -I../../../src/libCom/cxxTemplates -I../../../src/libCom/dbmf -I../../../src/libCom/ellLib -I../../../src/libCom/env -I../../../src/libCom/error -I../../../src/libCom/fdmgr -I../../../src/libCom/flex -I../../../src/libCom/freeList -I../../../src/libCom/gpHash -I../../../src/libCom/iocsh -I../../../src/libCom/log -I../../../src/libCom/macLib -I../../../src/libCom/misc -I../../../src/libCom/osi -I../../../src/libCom/pool -I../../../src/libCom/ring -I../../../src/libCom/taskwd -I../../../src/libCom/timer -I../!
 ../../src/libCom/yacc -I../../../src/libCom/yacc -I../../../src/libCom/yajl -I../../../include/compiler/msvc -I../../../include/os/WIN32 -I../../../include        -c ../../../src/libCom/osi/os/WIN32/forceBadAllocException.cpp
forceBadAllocException.cpp
rc -l 0x409 -I. -I../O.Common -I. -I../../../src/libCom/osi/compiler/msvc -I../../../src/libCom/osi/compiler/default -I. -I../../../src/libCom/osi/os/WIN32 -I../../../src/libCom/osi/os/default -I.. -I../../../src/libCom/as -I../../../src/libCom/bucketLib -I../../../src/libCom/calc -I../../../src/libCom/cvtFast -I../../../src/libCom/cppStd -I../../../src/libCom/cxxTemplates -I../../../src/libCom/dbmf -I../../../src/libCom/ellLib -I../../../src/libCom/env -I../../../src/libCom/error -I../../../src/libCom/fdmgr -I../../../src/libCom/flex -I../../../src/libCom/freeList -I../../../src/libCom/gpHash -I../../../src/libCom/iocsh -I../../../src/libCom/log -I../../../src/libCom/macLib -I../../../src/libCom/misc -I../../../src/libCom/osi -I../../../src/libCom/pool -I../../../src/libCom/ring -I../../../src/libCom/taskwd -I../../../src/libCom/timer -I../../../src/libCom/yacc -I../../../src/libCom/yacc -I../../../src/libCom/yajl -I../../../include/compiler/msvc -I../../../include/os/WIN32!
  -I../../../include        -fo Com.res ../Com.rc
Microsoft (R) Windows (R) Resource Compiler Version 6.1.7600.16385

Copyright (C) Microsoft Corporation.  All rights reserved.


lib -nologo -verbose -out:Com.lib -LTCG       asLib.obj asTrapWrite.obj bucketLib.obj postfix.obj calcPerform.obj cvtFast.obj resourceLib.obj epicsOnce.obj epicsSingletonMutex.obj dbmf.obj ellLib.obj envSubr.obj envData.obj errlog.obj errSymLib.obj errSymTbl.obj fdmgr.obj fdManager.obj freeListLib.obj gpHashLib.obj iocsh.obj registry.obj libComRegister.obj iocLog.obj logClient.obj macCore.obj macEnv.obj macUtil.obj alarmString.obj aToIPAddr.obj adjustment.obj cantProceed.obj epicsConvert.obj epicsExit.obj epicsStdlib.obj epicsString.obj truncateFile.obj ipAddrToAsciiAsynchronous.obj epicsUnitTest.obj epicsThread.obj epicsMutex.obj epicsEvent.obj epicsTime.obj epicsMessageQueue.obj epicsMath.obj epicsAtomicOSD.obj epicsGeneralTime.obj osiClockTime.obj osdSock.obj osdSockAddrReuse.obj osiSock.obj systemCallIntMech.obj epicsSocketConvertErrnoToString.obj osdAssert.obj osdFindSymbol.obj osdInterrupt.obj osdPoolStatus.obj osdSignal.obj osdEnv.obj epicsReadline.obj epicsTempFile.o!
 bj epicsStdio.obj osdStdio.obj osdThread.obj osdThreadExtra.obj osdThreadHooks.obj osdMutex.obj osdSpin.obj osdEvent.obj osdTime.obj osdProcess.obj osdNetIntf.obj osdMessageQueue.obj devLibVME.obj devLibVMEOSD.obj epicsStackTrace.obj osdBackTrace.obj osdFindAddr.obj poolJob.obj threadPool.obj epicsRingPointer.obj epicsRingBytes.obj taskwd.obj epicsTimer.obj timer.obj timerQueue.obj timerQueueActive.obj timerQueueActiveMgr.obj timerQueuePassive.obj yajl.obj yajl_alloc.obj yajl_buf.obj yajl_encode.obj yajl_gen.obj yajl_lex.obj yajl_parser.obj epicsGetopt.obj setThreadName.obj forceBadAllocException.obj 
Appending forceBadAllocException.obj
Appending setThreadName.obj
Appending epicsGetopt.obj
Appending yajl_parser.obj
Appending yajl_lex.obj
Appending yajl_gen.obj
Appending yajl_encode.obj
Appending yajl_buf.obj
Appending yajl_alloc.obj
Appending yajl.obj
Appending timerQueuePassive.obj
Appending timerQueueActiveMgr.obj
Appending timerQueueActive.obj
Appending timerQueue.obj
Appending timer.obj
Appending epicsTimer.obj
Appending taskwd.obj
Appending epicsRingBytes.obj
Appending epicsRingPointer.obj
Appending threadPool.obj
Appending poolJob.obj
Appending osdFindAddr.obj
Appending osdBackTrace.obj
Appending epicsStackTrace.obj
Appending devLibVMEOSD.obj
Appending devLibVME.obj
Appending osdMessageQueue.obj
Appending osdNetIntf.obj
Appending osdProcess.obj
Appending osdTime.obj
Appending osdEvent.obj
Appending osdSpin.obj
Appending osdMutex.obj
Appending osdThreadHooks.obj
Appending osdThreadExtra.obj
Appending osdThread.obj
Appending osdStdio.obj
Appending epicsStdio.obj
Appending epicsTempFile.obj
Appending epicsReadline.obj
Appending osdEnv.obj
Appending osdSignal.obj
Appending osdPoolStatus.obj
Appending osdInterrupt.obj
Appending osdFindSymbol.obj
Appending osdAssert.obj
Appending epicsSocketConvertErrnoToString.obj
Appending systemCallIntMech.obj
Appending osiSock.obj
Appending osdSockAddrReuse.obj
Appending osdSock.obj
Appending osiClockTime.obj
Appending epicsGeneralTime.obj
Appending epicsAtomicOSD.obj
Appending epicsMath.obj
Appending epicsMessageQueue.obj
Appending epicsTime.obj
Appending epicsEvent.obj
Appending epicsMutex.obj
Appending epicsThread.obj
Appending epicsUnitTest.obj
Appending ipAddrToAsciiAsynchronous.obj
Appending truncateFile.obj
Appending epicsString.obj
Appending epicsStdlib.obj
Appending epicsExit.obj
Appending epicsConvert.obj
Appending cantProceed.obj
Appending adjustment.obj
Appending aToIPAddr.obj
Appending alarmString.obj
Appending macUtil.obj
Appending macEnv.obj
Appending macCore.obj
Appending logClient.obj
Appending iocLog.obj
Appending libComRegister.obj
Appending registry.obj
Appending iocsh.obj
Appending gpHashLib.obj
Appending freeListLib.obj
Appending fdManager.obj
Appending fdmgr.obj
Appending errSymTbl.obj
Appending errSymLib.obj
Appending errlog.obj
Appending envData.obj
Appending envSubr.obj
Appending ellLib.obj
Appending dbmf.obj
Appending epicsSingletonMutex.obj
Appending epicsOnce.obj
Appending resourceLib.obj
Appending cvtFast.obj
Appending calcPerform.obj
Appending postfix.obj
Appending bucketLib.obj
Appending asTrapWrite.obj
Appending asLib.obj
mkdir ../../../lib/win32-x86-static
cl               -nologo -D__STDC__=0 -D_CRT_SECURE_NO_DEPRECATE -D_CRT_NONSTDC_NO_DEPRECATE   -Ox -GL -Oy-   -W3 -w44355       -MT    -I. -I../O.Common -I. -I../../../src/libCom/osi/compiler/msvc -I../../../src/libCom/osi/compiler/default -I. -I../../../src/libCom/osi/os/WIN32 -I../../../src/libCom/osi/os/default -I.. -I../../../src/libCom/as -I../../../src/libCom/bucketLib -I../../../src/libCom/calc -I../../../src/libCom/cvtFast -I../../../src/libCom/cppStd -I../../../src/libCom/cxxTemplates -I../../../src/libCom/dbmf -I../../../src/libCom/ellLib -I../../../src/libCom/env -I../../../src/libCom/error -I../../../src/libCom/fdmgr -I../../../src/libCom/flex -I../../../src/libCom/freeList -I../../../src/libCom/gpHash -I../../../src/libCom/iocsh -I../../../src/libCom/log -I../../../src/libCom/macLib -I../../../src/libCom/misc -I../../../src/libCom/osi -I../../../src/libCom/pool -I../../../src/libCom/ring -I../../../src/libCom/taskwd -I../../../src/libCom/timer -I../../../src/lib!
 Com/yacc -I../../../src/libCom/yacc -I../../../src/libCom/yajl -I../../../include/compiler/msvc -I../../../include/os/WIN32 -I../../../include        -c ../../../src/libCom/log/iocLogServer.c
iocLogServer.c
link -nologo  -LTCG -incremental:no -opt:ref -release -version:3.15             -out:iocLogServer.exe       iocLogServer.obj     ../../../lib/win32-x86-static/Com.lib  user32.lib ws2_32.lib ws2_32.lib advapi32.lib user32.lib kernel32.lib winmm.lib     
Generating code
Finished generating code
make[3]: Leaving directory `C:/jenkins/win32-1/workspace/epics-base-3.15-win32/src/libCom/O.win32-x86-static'
make[2]: Leaving directory `C:/jenkins/win32-1/workspace/epics-base-3.15-win32/src/libCom'
make -C libCom/RTEMS install 
make[2]: Entering directory `C:/jenkins/win32-1/workspace/epics-base-3.15-win32/src/libCom/RTEMS'
perl -CSD ../../../bin/win32-x86-static/makeMakefile.pl O.win32-x86-static ../../../..
make -C O.win32-x86-static -f ../Makefile TOP=../../../.. T_A=win32-x86-static install
make[3]: Entering directory `C:/jenkins/win32-1/workspace/epics-base-3.15-win32/src/libCom/RTEMS/O.win32-x86-static'
make[3]: Nothing to be done for `install'.
make[3]: Leaving directory `C:/jenkins/win32-1/workspace/epics-base-3.15-win32/src/libCom/RTEMS/O.win32-x86-static'
make[2]: Leaving directory `C:/jenkins/win32-1/workspace/epics-base-3.15-win32/src/libCom/RTEMS'
make -C libCom/test install 
make[2]: Entering directory `C:/jenkins/win32-1/workspace/epics-base-3.15-win32/src/libCom/test'
perl -CSD ../../../bin/win32-x86-static/makeMakefile.pl O.win32-x86-static ../../../..
make -C O.win32-x86-static -f ../Makefile TOP=../../../.. T_A=win32-x86-static install
make[3]: Entering directory `C:/jenkins/win32-1/workspace/epics-base-3.15-win32/src/libCom/test/O.win32-x86-static'
perl -CSD ../../../../bin/win32-x86-static/mkmf.pl  -m cvtFastPerform.d . ../O.Common . . .. ../../../../include/compiler/msvc ../../../../include/os/WIN32 ../../../../include        cvtFastPerform.d ../cvtFastPerform.cpp
perl -CSD ../../../../bin/win32-x86-static/mkmf.pl  -m epicsAtomicPerform.d . ../O.Common . . .. ../../../../include/compiler/msvc ../../../../include/os/WIN32 ../../../../include        epicsAtomicPerform.d ../epicsAtomicPerform.cpp
perl -CSD ../../../../bin/win32-x86-static/mkmf.pl  -m buckTest.d . ../O.Common . . .. ../../../../include/compiler/msvc ../../../../include/os/WIN32 ../../../../include        buckTest.d ../buckTest.c
perl -CSD ../../../../bin/win32-x86-static/mkmf.pl  -m epicsMaxThreads.d . ../O.Common . . .. ../../../../include/compiler/msvc ../../../../include/os/WIN32 ../../../../include        epicsMaxThreads.d ../epicsMaxThreads.c
perl -CSD ../../../../bin/win32-x86-static/mkmf.pl  -m epicsThreadPerform.d . ../O.Common . . .. ../../../../include/compiler/msvc ../../../../include/os/WIN32 ../../../../include        epicsThreadPerform.d ../epicsThreadPerform.cpp
perl -CSD ../../../../bin/win32-x86-static/mkmf.pl  -m epicsStackTraceTest.d . ../O.Common . . .. ../../../../include/compiler/msvc ../../../../include/os/WIN32 ../../../../include        epicsStackTraceTest.d ../epicsStackTraceTest.c
perl -CSD ../../../../bin/win32-x86-static/mkmf.pl  -m epicsMessageQueueTest.d . ../O.Common . . .. ../../../../include/compiler/msvc ../../../../include/os/WIN32 ../../../../include        epicsMessageQueueTest.d ../epicsMessageQueueTest.cpp
perl -CSD ../../../../bin/win32-x86-static/mkmf.pl  -m blockingSockTest.d . ../O.Common . . .. ../../../../include/compiler/msvc ../../../../include/os/WIN32 ../../../../include        blockingSockTest.d ../blockingSockTest.cpp
perl -CSD ../../../../bin/win32-x86-static/mkmf.pl  -m taskwdTest.d . ../O.Common . . .. ../../../../include/compiler/msvc ../../../../include/os/WIN32 ../../../../include        taskwdTest.d ../taskwdTest.c
perl -CSD ../../../../bin/win32-x86-static/mkmf.pl  -m macLibTest.d . ../O.Common . . .. ../../../../include/compiler/msvc ../../../../include/os/WIN32 ../../../../include        macLibTest.d ../macLibTest.c
perl -CSD ../../../../bin/win32-x86-static/mkmf.pl  -m macEnvExpandTest.d . ../O.Common . . .. ../../../../include/compiler/msvc ../../../../include/os/WIN32 ../../../../include        macEnvExpandTest.d ../macEnvExpandTest.c
perl -CSD ../../../../bin/win32-x86-static/mkmf.pl  -m epicsExceptionTest.d . ../O.Common . . .. ../../../../include/compiler/msvc ../../../../include/os/WIN32 ../../../../include        epicsExceptionTest.d ../epicsExceptionTest.cpp
perl -CSD ../../../../bin/win32-x86-static/mkmf.pl  -m epicsAtomicTest.d . ../O.Common . . .. ../../../../include/compiler/msvc ../../../../include/os/WIN32 ../../../../include        epicsAtomicTest.d ../epicsAtomicTest.cpp
perl -CSD ../../../../bin/win32-x86-static/mkmf.pl  -m epicsSpinTest.d . ../O.Common . . .. ../../../../include/compiler/msvc ../../../../include/os/WIN32 ../../../../include        epicsSpinTest.d ../epicsSpinTest.c
perl -CSD ../../../../bin/win32-x86-static/mkmf.pl  -m epicsMutexTest.d . ../O.Common . . .. ../../../../include/compiler/msvc ../../../../include/os/WIN32 ../../../../include        epicsMutexTest.d ../epicsMutexTest.cpp
perl -CSD ../../../../bin/win32-x86-static/mkmf.pl  -m epicsEventTest.d . ../O.Common . . .. ../../../../include/compiler/msvc ../../../../include/os/WIN32 ../../../../include        epicsEventTest.d ../epicsEventTest.cpp
perl -CSD ../../../../bin/win32-x86-static/mkmf.pl  -m ringBytesTest.d . ../O.Common . . .. ../../../../include/compiler/msvc ../../../../include/os/WIN32 ../../../../include        ringBytesTest.d ../ringBytesTest.c
perl -CSD ../../../../bin/win32-x86-static/mkmf.pl  -m ringPointerTest.d . ../O.Common . . .. ../../../../include/compiler/msvc ../../../../include/os/WIN32 ../../../../include        ringPointerTest.d ../ringPointerTest.c
perl -CSD ../../../../bin/win32-x86-static/mkmf.pl  -m epicsTimerTest.d . ../O.Common . . .. ../../../../include/compiler/msvc ../../../../include/os/WIN32 ../../../../include        epicsTimerTest.d ../epicsTimerTest.cpp
perl -CSD ../../../../bin/win32-x86-static/mkmf.pl  -m epicsExitTest.d . ../O.Common . . .. ../../../../include/compiler/msvc ../../../../include/os/WIN32 ../../../../include        epicsExitTest.d ../epicsExitTest.c
perl -CSD ../../../../bin/win32-x86-static/mkmf.pl  -m epicsThreadPoolTest.d . ../O.Common . . .. ../../../../include/compiler/msvc ../../../../include/os/WIN32 ../../../../include        epicsThreadPoolTest.d ../epicsThreadPoolTest.c
perl -CSD ../../../../bin/win32-x86-static/mkmf.pl  -m epicsThreadHooksTest.d . ../O.Common . . .. ../../../../include/compiler/msvc ../../../../include/os/WIN32 ../../../../include        epicsThreadHooksTest.d ../epicsThreadHooksTest.c
perl -CSD ../../../../bin/win32-x86-static/mkmf.pl  -m epicsThreadPrivateTest.d . ../O.Common . . .. ../../../../include/compiler/msvc ../../../../include/os/WIN32 ../../../../include        epicsThreadPrivateTest.d ../epicsThreadPrivateTest.cpp
perl -CSD ../../../../bin/win32-x86-static/mkmf.pl  -m epicsThreadPriorityTest.d . ../O.Common . . .. ../../../../include/compiler/msvc ../../../../include/os/WIN32 ../../../../include        epicsThreadPriorityTest.d ../epicsThreadPriorityTest.cpp
perl -CSD ../../../../bin/win32-x86-static/mkmf.pl  -m epicsThreadOnceTest.d . ../O.Common . . .. ../../../../include/compiler/msvc ../../../../include/os/WIN32 ../../../../include        epicsThreadOnceTest.d ../epicsThreadOnceTest.c
perl -CSD ../../../../bin/win32-x86-static/mkmf.pl  -m epicsThreadTest.d . ../O.Common . . .. ../../../../include/compiler/msvc ../../../../include/os/WIN32 ../../../../include        epicsThreadTest.d ../epicsThreadTest.cpp
perl -CSD ../../../../bin/win32-x86-static/mkmf.pl  -m epicsTimeTest.d . ../O.Common . . .. ../../../../include/compiler/msvc ../../../../include/os/WIN32 ../../../../include        epicsTimeTest.d ../epicsTimeTest.cpp
perl -CSD ../../../../bin/win32-x86-static/mkmf.pl  -m epicsStringTest.d . ../O.Common . . .. ../../../../include/compiler/msvc ../../../../include/os/WIN32 ../../../../include        epicsStringTest.d ../epicsStringTest.c
perl -CSD ../../../../bin/win32-x86-static/mkmf.pl  -m epicsSockResolveTest.d . ../O.Common . . .. ../../../../include/compiler/msvc ../../../../include/os/WIN32 ../../../../include        epicsSockResolveTest.d ../epicsSockResolveTest.c
perl -CSD ../../../../bin/win32-x86-static/mkmf.pl  -m epicsStdlibTest.d . ../O.Common . . .. ../../../../include/compiler/msvc ../../../../include/os/WIN32 ../../../../include        epicsStdlibTest.d ../epicsStdlibTest.c
perl -CSD ../../../../bin/win32-x86-static/mkmf.pl  -m epicsStdioTest.d . ../O.Common . . .. ../../../../include/compiler/msvc ../../../../include/os/WIN32 ../../../../include        epicsStdioTest.d ../epicsStdioTest.c
perl -CSD ../../../../bin/win32-x86-static/mkmf.pl  -m epicsErrlogTest.d . ../O.Common . . .. ../../../../include/compiler/msvc ../../../../include/os/WIN32 ../../../../include        epicsErrlogTest.d ../epicsErrlogTest.c
perl -CSD ../../../../bin/win32-x86-static/mkmf.pl  -m epicsEnvTest.d . ../O.Common . . .. ../../../../include/compiler/msvc ../../../../include/os/WIN32 ../../../../include        epicsEnvTest.d ../epicsEnvTest.c
perl -CSD ../../../../bin/win32-x86-static/mkmf.pl  -m epicsEllTest.d . ../O.Common . . .. ../../../../include/compiler/msvc ../../../../include/os/WIN32 ../../../../include        epicsEllTest.d ../epicsEllTest.c
perl -CSD ../../../../bin/win32-x86-static/mkmf.pl  -m epicsMMIOTest.d . ../O.Common . . .. ../../../../include/compiler/msvc ../../../../include/os/WIN32 ../../../../include        epicsMMIOTest.d ../epicsMMIOTest.c
perl -CSD ../../../../bin/win32-x86-static/mkmf.pl  -m epicsMathTest.d . ../O.Common . . .. ../../../../include/compiler/msvc ../../../../include/os/WIN32 ../../../../include        epicsMathTest.d ../epicsMathTest.c
perl -CSD ../../../../bin/win32-x86-static/mkmf.pl  -m epicsAlgorithmTest.d . ../O.Common . . .. ../../../../include/compiler/msvc ../../../../include/os/WIN32 ../../../../include        epicsAlgorithmTest.d ../epicsAlgorithmTest.cpp
perl -CSD ../../../../bin/win32-x86-static/mkmf.pl  -m epicsCalcTest.d . ../O.Common . . .. ../../../../include/compiler/msvc ../../../../include/os/WIN32 ../../../../include        epicsCalcTest.d ../epicsCalcTest.cpp
perl -CSD ../../../../bin/win32-x86-static/mkmf.pl  -m epicsTypesTest.d . ../O.Common . . .. ../../../../include/compiler/msvc ../../../../include/os/WIN32 ../../../../include        epicsTypesTest.d ../epicsTypesTest.c
perl -CSD ../../../../bin/win32-x86-static/mkmf.pl  -m epicsUnitTestTest.d . ../O.Common . . .. ../../../../include/compiler/msvc ../../../../include/os/WIN32 ../../../../include        epicsUnitTestTest.d ../epicsUnitTestTest.c
make[3]: Leaving directory `C:/jenkins/win32-1/workspace/epics-base-3.15-win32/src/libCom/test/O.win32-x86-static'
make[3]: Entering directory `C:/jenkins/win32-1/workspace/epics-base-3.15-win32/src/libCom/test/O.win32-x86-static'
cl               -nologo -D__STDC__=0 -D_CRT_SECURE_NO_DEPRECATE -D_CRT_NONSTDC_NO_DEPRECATE   -Ox -GL -Oy-   -W3 -w44355       -MT    -I. -I../O.Common -I. -I. -I.. -I../../../../include/compiler/msvc -I../../../../include/os/WIN32 -I../../../../include        -c ../epicsUnitTestTest.c
epicsUnitTestTest.c
link -nologo  -LTCG -incremental:no -opt:ref -release -version:3.15             -out:epicsUnitTestTest.exe       epicsUnitTestTest.obj      ../../../../lib/win32-x86-static/Com.lib  ws2_32.lib advapi32.lib user32.lib kernel32.lib winmm.lib     
Generating code
Finished generating code
cl               -nologo -D__STDC__=0 -D_CRT_SECURE_NO_DEPRECATE -D_CRT_NONSTDC_NO_DEPRECATE   -Ox -GL -Oy-   -W3 -w44355       -MT    -I. -I../O.Common -I. -I. -I.. -I../../../../include/compiler/msvc -I../../../../include/os/WIN32 -I../../../../include        -c ../epicsTypesTest.c
epicsTypesTest.c
link -nologo  -LTCG -incremental:no -opt:ref -release -version:3.15             -out:epicsTypesTest.exe       epicsTypesTest.obj      ../../../../lib/win32-x86-static/Com.lib  ws2_32.lib advapi32.lib user32.lib kernel32.lib winmm.lib     
Generating code
Finished generating code
cl -EHsc -GR               -nologo -D__STDC__=0 -D_CRT_SECURE_NO_DEPRECATE -D_CRT_NONSTDC_NO_DEPRECATE   -Ox -GL -Oy-   -W3 -w44355       -MT  -TP  -I. -I../O.Common -I. -I. -I.. -I../../../../include/compiler/msvc -I../../../../include/os/WIN32 -I../../../../include        -c ../epicsCalcTest.cpp
epicsCalcTest.cpp
../epicsCalcTest.cpp(58) : warning C4800: 'int' : forcing value to bool 'true' or 'false' (performance warning)
../epicsCalcTest.cpp(493) : warning C4806: '!=' : unsafe operation: no value of type 'bool' promoted to type 'int' can equal the given constant
../epicsCalcTest.cpp(513) : warning C4806: '!=' : unsafe operation: no value of type 'bool' promoted to type 'int' can equal the given constant
../epicsCalcTest.cpp(606) : warning C4804: '<' : unsafe use of type 'bool' in operation
../epicsCalcTest.cpp(629) : warning C4804: '<=' : unsafe use of type 'bool' in operation
../epicsCalcTest.cpp(674) : warning C4804: '>' : unsafe use of type 'bool' in operation
../epicsCalcTest.cpp(694) : warning C4804: '>=' : unsafe use of type 'bool' in operation
../epicsCalcTest.cpp(802) : warning C4554: '|' : check operator precedence for possible error; use parentheses to clarify precedence
../epicsCalcTest.cpp(803) : warning C4554: '|' : check operator precedence for possible error; use parentheses to clarify precedence
../epicsCalcTest.cpp(804) : warning C4554: '^' : check operator precedence for possible error; use parentheses to clarify precedence
../epicsCalcTest.cpp(812) : warning C4554: '&' : check operator precedence for possible error; use parentheses to clarify precedence
../epicsCalcTest.cpp(813) : warning C4554: '&' : check operator precedence for possible error; use parentheses to clarify precedence
../epicsCalcTest.cpp(814) : warning C4804: '<<' : unsafe use of type 'bool' in operation
../epicsCalcTest.cpp(815) : warning C4804: '>>' : unsafe use of type 'bool' in operation
link -nologo  -LTCG -incremental:no -opt:ref -release -version:3.15             -out:epicsCalcTest.exe       epicsCalcTest.obj      ../../../../lib/win32-x86-static/Com.lib  ws2_32.lib advapi32.lib user32.lib kernel32.lib winmm.lib     
Generating code
c:\jenkins\win32-1\workspace\epics-base-3.15-win32\src\libcom\test\epicscalctest.cpp(26) : warning C4723: potential divide by 0
c:\jenkins\win32-1\workspace\epics-base-3.15-win32\src\libcom\test\epicscalctest.cpp(46) : warning C4723: potential divide by 0
Finished generating code
cl -EHsc -GR               -nologo -D__STDC__=0 -D_CRT_SECURE_NO_DEPRECATE -D_CRT_NONSTDC_NO_DEPRECATE   -Ox -GL -Oy-   -W3 -w44355       -MT  -TP  -I. -I../O.Common -I. -I. -I.. -I../../../../include/compiler/msvc -I../../../../include/os/WIN32 -I../../../../include        -c ../epicsAlgorithmTest.cpp
epicsAlgorithmTest.cpp
link -nologo  -LTCG -incremental:no -opt:ref -release -version:3.15             -out:epicsAlgorithmTest.exe       epicsAlgorithmTest.obj      ../../../../lib/win32-x86-static/Com.lib  ws2_32.lib advapi32.lib user32.lib kernel32.lib winmm.lib     
Generating code
Finished generating code
cl               -nologo -D__STDC__=0 -D_CRT_SECURE_NO_DEPRECATE -D_CRT_NONSTDC_NO_DEPRECATE   -Ox -GL -Oy-   -W3 -w44355       -MT    -I. -I../O.Common -I. -I. -I.. -I../../../../include/compiler/msvc -I../../../../include/os/WIN32 -I../../../../include        -c ../epicsMathTest.c
epicsMathTest.c
link -nologo  -LTCG -incremental:no -opt:ref -release -version:3.15             -out:epicsMathTest.exe       epicsMathTest.obj      ../../../../lib/win32-x86-static/Com.lib  ws2_32.lib advapi32.lib user32.lib kernel32.lib winmm.lib     
Generating code
c:\jenkins\win32-1\workspace\epics-base-3.15-win32\src\libcom\test\epicsmathtest.c(52) : warning C4756: overflow in constant arithmetic
c:\jenkins\win32-1\workspace\epics-base-3.15-win32\src\libcom\test\epicsmathtest.c(57) : warning C4756: overflow in constant arithmetic
Finished generating code
cl               -nologo -D__STDC__=0 -D_CRT_SECURE_NO_DEPRECATE -D_CRT_NONSTDC_NO_DEPRECATE   -Ox -GL -Oy-   -W3 -w44355       -MT    -I. -I../O.Common -I. -I. -I.. -I../../../../include/compiler/msvc -I../../../../include/os/WIN32 -I../../../../include        -c ../epicsMMIOTest.c
epicsMMIOTest.c
c:\jenkins\win32-1\workspace\epics-base-3.15-win32\include\os\win32\epicsMMIODef.h(116) : fatal error C1083: Cannot open include file: 'arpa/inet.h': No such file or directory
make[3]: *** [epicsMMIOTest.obj] Error 2
make[3]: Leaving directory `C:/jenkins/win32-1/workspace/epics-base-3.15-win32/src/libCom/test/O.win32-x86-static'
make[2]: *** [install.win32-x86-static] Error 2
make[2]: Leaving directory `C:/jenkins/win32-1/workspace/epics-base-3.15-win32/src/libCom/test'
make[1]: *** [libCom/test.install] Error 2
make[1]: Leaving directory `C:/jenkins/win32-1/workspace/epics-base-3.15-win32/src'
make: *** [src.install] Error 2

<https://jenkins.aps.anl.gov/job/epics-base-3.15-win32s/ws/>exit> 2 
Build step 'Execute Windows batch command' marked build as failure
[WARNINGS] Skipping publisher since build result is FAILURE


Replies:
Build failed in Jenkins: epics-base-3.15-win32s #60 APS Jenkins

Navigate by Date:
Prev: Build failed in Jenkins: epics-base-3.15-win64 #79 APS Jenkins
Next: Build failed in Jenkins: epics-base-3.15-win64s #59 APS Jenkins
Index: 2002  2003  2004  2005  2006  2007  2008  2009  2010  2011  2012  2013  <20142015  2016  2017  2018  2019  2020  2021 
Navigate by Thread:
Prev: Jenkins build is back to normal : epics-base-3.15-win64 #82 APS Jenkins
Next: Build failed in Jenkins: epics-base-3.15-win32s #60 APS Jenkins
Index: 2002  2003  2004  2005  2006  2007  2008  2009  2010  2011  2012  2013  <20142015  2016  2017  2018  2019  2020  2021 
ANJ, 26 Sep 2014 Valid HTML 4.01! · Home · News · About · Base · Modules · Extensions · Distributions · Download ·
· Search · EPICS V4 · IRMIS · Talk · Bugs · Documents · Links · Licensing ·