Argonne National Laboratory

Experimental Physics and
Industrial Control System

2002  2003  2004  2005  2006  2007  2008  2009  2010  2011  2012  2013  <20142015  2016  2017  2018  2019  2020  2021  Index 2002  2003  2004  2005  2006  2007  2008  2009  2010  2011  2012  2013  <20142015  2016  2017  2018  2019  2020  2021 
<== Date ==> <== Thread ==>

Subject: Build failed in Jenkins: epics-base-3.15-win64 #118
From: APS Jenkins <aps-jenkins@anl.gov>
To: core-talk@aps.anl.gov
Date: Mon, 17 Nov 2014 17:17:21 -0600 (CST)
See <https://jenkins.aps.anl.gov/job/epics-base-3.15-win64/118/changes>

Changes:

[Michael Davidsaver] libCom/test: re-write ringPointerTest

------------------------------------------
[...truncated 861 lines...]
Generating code
Finished generating code
"Installing shared library ../../../bin/windows-x64/Com.dll"
"Installing library ../../../lib/windows-x64/Com.lib"
mkdir ../../../lib/windows-x64
cl             /favor:blend   -nologo -D__STDC__=0 -D_CRT_SECURE_NO_DEPRECATE -D_CRT_NONSTDC_NO_DEPRECATE   -Ox -GL -Oy-   -W3 -w44355       -MD -DEPICS_BUILD_DLL -DEPICS_CALL_DLL   -I. -I../O.Common -I. -I../../../src/libCom/osi/compiler/msvc -I../../../src/libCom/osi/compiler/default -I. -I../../../src/libCom/osi/os/WIN32 -I../../../src/libCom/osi/os/default -I.. -I../../../src/libCom/as -I../../../src/libCom/bucketLib -I../../../src/libCom/calc -I../../../src/libCom/cvtFast -I../../../src/libCom/cppStd -I../../../src/libCom/cxxTemplates -I../../../src/libCom/dbmf -I../../../src/libCom/ellLib -I../../../src/libCom/env -I../../../src/libCom/error -I../../../src/libCom/fdmgr -I../../../src/libCom/flex -I../../../src/libCom/freeList -I../../../src/libCom/gpHash -I../../../src/libCom/iocsh -I../../../src/libCom/log -I../../../src/libCom/macLib -I../../../src/libCom/misc -I../../../src/libCom/osi -I../../../src/libCom/pool -I../../../src/libCom/ring -I../../../src/libCom/taskwd!
  -I../../../src/libCom/timer -I../../../src/libCom/yacc -I../../../src/libCom/yacc -I../../../src/libCom/yajl -I../../../include/compiler/msvc -I../../../include/os/WIN32 -I../../../include        -c ../../../src/libCom/log/iocLogServer.c
iocLogServer.c
../../../src/libCom/log/iocLogServer.c(418) : warning C4244: 'function' : conversion from 'SOCKET' to 'int', possible loss of data
link -nologo  -LTCG -incremental:no -opt:ref -release -version:3.15 /MACHINE:X64             -out:iocLogServer.exe       iocLogServer.obj     ../../../lib/windows-x64/Com.lib  user32.lib ws2_32.lib  
Generating code
Finished generating code
"Installing created executable ../../../bin/windows-x64/iocLogServer.exe"
"Installing html ../../../html/./freeList/freeList.html"
mkdir ../../../html/./freeList
"Installing html ../../../html/./gpHash/gpHash.html"
mkdir ../../../html/./gpHash
make[3]: Leaving directory `C:/jenkins64-1/workspace/epics-base-3.15-win64/src/libCom/O.windows-x64'
make[2]: Leaving directory `C:/jenkins64-1/workspace/epics-base-3.15-win64/src/libCom'
make -C libCom/RTEMS install 
make[2]: Entering directory `C:/jenkins64-1/workspace/epics-base-3.15-win64/src/libCom/RTEMS'
perl -CSD ../../../bin/windows-x64/makeMakefile.pl O.windows-x64 ../../../..
perl -CSD -MExtUtils::Command -e mkpath O.Common
make -C O.windows-x64 -f ../Makefile TOP=../../../.. T_A=windows-x64 install
make[3]: Entering directory `C:/jenkins64-1/workspace/epics-base-3.15-win64/src/libCom/RTEMS/O.windows-x64'
"Installing generic include file ../../../../include/epicsRtemsInitHooks.h"
make[3]: Leaving directory `C:/jenkins64-1/workspace/epics-base-3.15-win64/src/libCom/RTEMS/O.windows-x64'
make[2]: Leaving directory `C:/jenkins64-1/workspace/epics-base-3.15-win64/src/libCom/RTEMS'
make -C libCom/test install 
make[2]: Entering directory `C:/jenkins64-1/workspace/epics-base-3.15-win64/src/libCom/test'
perl -CSD ../../../bin/windows-x64/makeMakefile.pl O.windows-x64 ../../../..
perl -CSD -MExtUtils::Command -e mkpath O.Common
make -C O.windows-x64 -f ../Makefile TOP=../../../.. T_A=windows-x64 install
make[3]: Entering directory `C:/jenkins64-1/workspace/epics-base-3.15-win64/src/libCom/test/O.windows-x64'
perl -CSD ../../../../bin/windows-x64/mkmf.pl  -m cvtFastPerform.d . ../O.Common . . .. ../../../../include/compiler/msvc ../../../../include/os/WIN32 ../../../../include        cvtFastPerform.d ../cvtFastPerform.cpp
perl -CSD ../../../../bin/windows-x64/mkmf.pl  -m epicsAtomicPerform.d . ../O.Common . . .. ../../../../include/compiler/msvc ../../../../include/os/WIN32 ../../../../include        epicsAtomicPerform.d ../epicsAtomicPerform.cpp
perl -CSD ../../../../bin/windows-x64/mkmf.pl  -m buckTest.d . ../O.Common . . .. ../../../../include/compiler/msvc ../../../../include/os/WIN32 ../../../../include        buckTest.d ../buckTest.c
perl -CSD ../../../../bin/windows-x64/mkmf.pl  -m epicsMaxThreads.d . ../O.Common . . .. ../../../../include/compiler/msvc ../../../../include/os/WIN32 ../../../../include        epicsMaxThreads.d ../epicsMaxThreads.c
perl -CSD ../../../../bin/windows-x64/mkmf.pl  -m epicsThreadPerform.d . ../O.Common . . .. ../../../../include/compiler/msvc ../../../../include/os/WIN32 ../../../../include        epicsThreadPerform.d ../epicsThreadPerform.cpp
perl -CSD ../../../../bin/windows-x64/mkmf.pl  -m epicsStackTraceTest.d . ../O.Common . . .. ../../../../include/compiler/msvc ../../../../include/os/WIN32 ../../../../include        epicsStackTraceTest.d ../epicsStackTraceTest.c
perl -CSD ../../../../bin/windows-x64/mkmf.pl  -m epicsMessageQueueTest.d . ../O.Common . . .. ../../../../include/compiler/msvc ../../../../include/os/WIN32 ../../../../include        epicsMessageQueueTest.d ../epicsMessageQueueTest.cpp
perl -CSD ../../../../bin/windows-x64/mkmf.pl  -m blockingSockTest.d . ../O.Common . . .. ../../../../include/compiler/msvc ../../../../include/os/WIN32 ../../../../include        blockingSockTest.d ../blockingSockTest.cpp
perl -CSD ../../../../bin/windows-x64/mkmf.pl  -m taskwdTest.d . ../O.Common . . .. ../../../../include/compiler/msvc ../../../../include/os/WIN32 ../../../../include        taskwdTest.d ../taskwdTest.c
perl -CSD ../../../../bin/windows-x64/mkmf.pl  -m macLibTest.d . ../O.Common . . .. ../../../../include/compiler/msvc ../../../../include/os/WIN32 ../../../../include        macLibTest.d ../macLibTest.c
perl -CSD ../../../../bin/windows-x64/mkmf.pl  -m macDefExpandTest.d . ../O.Common . . .. ../../../../include/compiler/msvc ../../../../include/os/WIN32 ../../../../include        macDefExpandTest.d ../macDefExpandTest.c
perl -CSD ../../../../bin/windows-x64/mkmf.pl  -m epicsExceptionTest.d . ../O.Common . . .. ../../../../include/compiler/msvc ../../../../include/os/WIN32 ../../../../include        epicsExceptionTest.d ../epicsExceptionTest.cpp
perl -CSD ../../../../bin/windows-x64/mkmf.pl  -m epicsAtomicTest.d . ../O.Common . . .. ../../../../include/compiler/msvc ../../../../include/os/WIN32 ../../../../include        epicsAtomicTest.d ../epicsAtomicTest.cpp
perl -CSD ../../../../bin/windows-x64/mkmf.pl  -m epicsSpinTest.d . ../O.Common . . .. ../../../../include/compiler/msvc ../../../../include/os/WIN32 ../../../../include        epicsSpinTest.d ../epicsSpinTest.c
perl -CSD ../../../../bin/windows-x64/mkmf.pl  -m epicsMutexTest.d . ../O.Common . . .. ../../../../include/compiler/msvc ../../../../include/os/WIN32 ../../../../include        epicsMutexTest.d ../epicsMutexTest.cpp
perl -CSD ../../../../bin/windows-x64/mkmf.pl  -m epicsEventTest.d . ../O.Common . . .. ../../../../include/compiler/msvc ../../../../include/os/WIN32 ../../../../include        epicsEventTest.d ../epicsEventTest.cpp
perl -CSD ../../../../bin/windows-x64/mkmf.pl  -m ringBytesTest.d . ../O.Common . . .. ../../../../include/compiler/msvc ../../../../include/os/WIN32 ../../../../include        ringBytesTest.d ../ringBytesTest.c
perl -CSD ../../../../bin/windows-x64/mkmf.pl  -m ringPointerTest.d . ../O.Common . . .. ../../../../include/compiler/msvc ../../../../include/os/WIN32 ../../../../include        ringPointerTest.d ../ringPointerTest.c
perl -CSD ../../../../bin/windows-x64/mkmf.pl  -m epicsTimerTest.d . ../O.Common . . .. ../../../../include/compiler/msvc ../../../../include/os/WIN32 ../../../../include        epicsTimerTest.d ../epicsTimerTest.cpp
perl -CSD ../../../../bin/windows-x64/mkmf.pl  -m epicsExitTest.d . ../O.Common . . .. ../../../../include/compiler/msvc ../../../../include/os/WIN32 ../../../../include        epicsExitTest.d ../epicsExitTest.c
perl -CSD ../../../../bin/windows-x64/mkmf.pl  -m epicsThreadPoolTest.d . ../O.Common . . .. ../../../../include/compiler/msvc ../../../../include/os/WIN32 ../../../../include        epicsThreadPoolTest.d ../epicsThreadPoolTest.c
perl -CSD ../../../../bin/windows-x64/mkmf.pl  -m epicsThreadHooksTest.d . ../O.Common . . .. ../../../../include/compiler/msvc ../../../../include/os/WIN32 ../../../../include        epicsThreadHooksTest.d ../epicsThreadHooksTest.c
perl -CSD ../../../../bin/windows-x64/mkmf.pl  -m epicsThreadPrivateTest.d . ../O.Common . . .. ../../../../include/compiler/msvc ../../../../include/os/WIN32 ../../../../include        epicsThreadPrivateTest.d ../epicsThreadPrivateTest.cpp
perl -CSD ../../../../bin/windows-x64/mkmf.pl  -m epicsThreadPriorityTest.d . ../O.Common . . .. ../../../../include/compiler/msvc ../../../../include/os/WIN32 ../../../../include        epicsThreadPriorityTest.d ../epicsThreadPriorityTest.cpp
perl -CSD ../../../../bin/windows-x64/mkmf.pl  -m epicsThreadOnceTest.d . ../O.Common . . .. ../../../../include/compiler/msvc ../../../../include/os/WIN32 ../../../../include        epicsThreadOnceTest.d ../epicsThreadOnceTest.c
perl -CSD ../../../../bin/windows-x64/mkmf.pl  -m epicsThreadTest.d . ../O.Common . . .. ../../../../include/compiler/msvc ../../../../include/os/WIN32 ../../../../include        epicsThreadTest.d ../epicsThreadTest.cpp
perl -CSD ../../../../bin/windows-x64/mkmf.pl  -m epicsTimeTest.d . ../O.Common . . .. ../../../../include/compiler/msvc ../../../../include/os/WIN32 ../../../../include        epicsTimeTest.d ../epicsTimeTest.cpp
perl -CSD ../../../../bin/windows-x64/mkmf.pl  -m epicsStringTest.d . ../O.Common . . .. ../../../../include/compiler/msvc ../../../../include/os/WIN32 ../../../../include        epicsStringTest.d ../epicsStringTest.c
perl -CSD ../../../../bin/windows-x64/mkmf.pl  -m epicsSockResolveTest.d . ../O.Common . . .. ../../../../include/compiler/msvc ../../../../include/os/WIN32 ../../../../include        epicsSockResolveTest.d ../epicsSockResolveTest.c
perl -CSD ../../../../bin/windows-x64/mkmf.pl  -m epicsStdlibTest.d . ../O.Common . . .. ../../../../include/compiler/msvc ../../../../include/os/WIN32 ../../../../include        epicsStdlibTest.d ../epicsStdlibTest.c
perl -CSD ../../../../bin/windows-x64/mkmf.pl  -m epicsStdioTest.d . ../O.Common . . .. ../../../../include/compiler/msvc ../../../../include/os/WIN32 ../../../../include        epicsStdioTest.d ../epicsStdioTest.c
perl -CSD ../../../../bin/windows-x64/mkmf.pl  -m epicsErrlogTest.d . ../O.Common . . .. ../../../../include/compiler/msvc ../../../../include/os/WIN32 ../../../../include        epicsErrlogTest.d ../epicsErrlogTest.c
perl -CSD ../../../../bin/windows-x64/mkmf.pl  -m epicsEnvTest.d . ../O.Common . . .. ../../../../include/compiler/msvc ../../../../include/os/WIN32 ../../../../include        epicsEnvTest.d ../epicsEnvTest.c
perl -CSD ../../../../bin/windows-x64/mkmf.pl  -m epicsEllTest.d . ../O.Common . . .. ../../../../include/compiler/msvc ../../../../include/os/WIN32 ../../../../include        epicsEllTest.d ../epicsEllTest.c
perl -CSD ../../../../bin/windows-x64/mkmf.pl  -m epicsMMIOTest.d . ../O.Common . . .. ../../../../include/compiler/msvc ../../../../include/os/WIN32 ../../../../include        epicsMMIOTest.d ../epicsMMIOTest.c
perl -CSD ../../../../bin/windows-x64/mkmf.pl  -m epicsMathTest.d . ../O.Common . . .. ../../../../include/compiler/msvc ../../../../include/os/WIN32 ../../../../include        epicsMathTest.d ../epicsMathTest.c
perl -CSD ../../../../bin/windows-x64/mkmf.pl  -m epicsAlgorithmTest.d . ../O.Common . . .. ../../../../include/compiler/msvc ../../../../include/os/WIN32 ../../../../include        epicsAlgorithmTest.d ../epicsAlgorithmTest.cpp
perl -CSD ../../../../bin/windows-x64/mkmf.pl  -m epicsCalcTest.d . ../O.Common . . .. ../../../../include/compiler/msvc ../../../../include/os/WIN32 ../../../../include        epicsCalcTest.d ../epicsCalcTest.cpp
perl -CSD ../../../../bin/windows-x64/mkmf.pl  -m epicsTypesTest.d . ../O.Common . . .. ../../../../include/compiler/msvc ../../../../include/os/WIN32 ../../../../include        epicsTypesTest.d ../epicsTypesTest.c
perl -CSD ../../../../bin/windows-x64/mkmf.pl  -m epicsUnitTestTest.d . ../O.Common . . .. ../../../../include/compiler/msvc ../../../../include/os/WIN32 ../../../../include        epicsUnitTestTest.d ../epicsUnitTestTest.c
make[3]: Leaving directory `C:/jenkins64-1/workspace/epics-base-3.15-win64/src/libCom/test/O.windows-x64'
make[3]: Entering directory `C:/jenkins64-1/workspace/epics-base-3.15-win64/src/libCom/test/O.windows-x64'
cl             /favor:blend   -nologo -D__STDC__=0 -D_CRT_SECURE_NO_DEPRECATE -D_CRT_NONSTDC_NO_DEPRECATE   -Ox -GL -Oy-   -W3 -w44355       -MD -DEPICS_BUILD_DLL -DEPICS_CALL_DLL   -I. -I../O.Common -I. -I. -I.. -I../../../../include/compiler/msvc -I../../../../include/os/WIN32 -I../../../../include        -c ../epicsUnitTestTest.c
epicsUnitTestTest.c
link -nologo  -LTCG -incremental:no -opt:ref -release -version:3.15 /MACHINE:X64             -out:epicsUnitTestTest.exe       epicsUnitTestTest.obj      ../../../../lib/windows-x64/Com.lib   
Generating code
Finished generating code
cl             /favor:blend   -nologo -D__STDC__=0 -D_CRT_SECURE_NO_DEPRECATE -D_CRT_NONSTDC_NO_DEPRECATE   -Ox -GL -Oy-   -W3 -w44355       -MD -DEPICS_BUILD_DLL -DEPICS_CALL_DLL   -I. -I../O.Common -I. -I. -I.. -I../../../../include/compiler/msvc -I../../../../include/os/WIN32 -I../../../../include        -c ../epicsTypesTest.c
epicsTypesTest.c
link -nologo  -LTCG -incremental:no -opt:ref -release -version:3.15 /MACHINE:X64             -out:epicsTypesTest.exe       epicsTypesTest.obj      ../../../../lib/windows-x64/Com.lib   
Generating code
Finished generating code
cl -EHsc -GR             /favor:blend   -nologo -D__STDC__=0 -D_CRT_SECURE_NO_DEPRECATE -D_CRT_NONSTDC_NO_DEPRECATE   -Ox -GL -Oy-   -W3 -w44355       -MD -DEPICS_BUILD_DLL -DEPICS_CALL_DLL -TP  -I. -I../O.Common -I. -I. -I.. -I../../../../include/compiler/msvc -I../../../../include/os/WIN32 -I../../../../include        -c ../epicsCalcTest.cpp
epicsCalcTest.cpp
../epicsCalcTest.cpp(58) : warning C4800: 'int' : forcing value to bool 'true' or 'false' (performance warning)
../epicsCalcTest.cpp(493) : warning C4806: '!=' : unsafe operation: no value of type 'bool' promoted to type 'int' can equal the given constant
../epicsCalcTest.cpp(513) : warning C4806: '!=' : unsafe operation: no value of type 'bool' promoted to type 'int' can equal the given constant
../epicsCalcTest.cpp(606) : warning C4804: '<' : unsafe use of type 'bool' in operation
../epicsCalcTest.cpp(629) : warning C4804: '<=' : unsafe use of type 'bool' in operation
../epicsCalcTest.cpp(674) : warning C4804: '>' : unsafe use of type 'bool' in operation
../epicsCalcTest.cpp(694) : warning C4804: '>=' : unsafe use of type 'bool' in operation
../epicsCalcTest.cpp(802) : warning C4554: '|' : check operator precedence for possible error; use parentheses to clarify precedence
../epicsCalcTest.cpp(803) : warning C4554: '|' : check operator precedence for possible error; use parentheses to clarify precedence
../epicsCalcTest.cpp(804) : warning C4554: '^' : check operator precedence for possible error; use parentheses to clarify precedence
../epicsCalcTest.cpp(812) : warning C4554: '&' : check operator precedence for possible error; use parentheses to clarify precedence
../epicsCalcTest.cpp(813) : warning C4554: '&' : check operator precedence for possible error; use parentheses to clarify precedence
../epicsCalcTest.cpp(814) : warning C4804: '<<' : unsafe use of type 'bool' in operation
../epicsCalcTest.cpp(815) : warning C4804: '>>' : unsafe use of type 'bool' in operation
link -nologo  -LTCG -incremental:no -opt:ref -release -version:3.15 /MACHINE:X64             -out:epicsCalcTest.exe       epicsCalcTest.obj      ../../../../lib/windows-x64/Com.lib   
Generating code
c:\jenkins64-1\workspace\epics-base-3.15-win64\src\libcom\test\epicscalctest.cpp(46) : warning C4723: potential divide by 0
c:\jenkins64-1\workspace\epics-base-3.15-win64\src\libcom\test\epicscalctest.cpp(26) : warning C4723: potential divide by 0
Finished generating code
cl -EHsc -GR             /favor:blend   -nologo -D__STDC__=0 -D_CRT_SECURE_NO_DEPRECATE -D_CRT_NONSTDC_NO_DEPRECATE   -Ox -GL -Oy-   -W3 -w44355       -MD -DEPICS_BUILD_DLL -DEPICS_CALL_DLL -TP  -I. -I../O.Common -I. -I. -I.. -I../../../../include/compiler/msvc -I../../../../include/os/WIN32 -I../../../../include        -c ../epicsAlgorithmTest.cpp
epicsAlgorithmTest.cpp
link -nologo  -LTCG -incremental:no -opt:ref -release -version:3.15 /MACHINE:X64             -out:epicsAlgorithmTest.exe       epicsAlgorithmTest.obj      ../../../../lib/windows-x64/Com.lib   
Generating code
Finished generating code
cl             /favor:blend   -nologo -D__STDC__=0 -D_CRT_SECURE_NO_DEPRECATE -D_CRT_NONSTDC_NO_DEPRECATE   -Ox -GL -Oy-   -W3 -w44355       -MD -DEPICS_BUILD_DLL -DEPICS_CALL_DLL   -I. -I../O.Common -I. -I. -I.. -I../../../../include/compiler/msvc -I../../../../include/os/WIN32 -I../../../../include        -c ../epicsMathTest.c
epicsMathTest.c
link -nologo  -LTCG -incremental:no -opt:ref -release -version:3.15 /MACHINE:X64             -out:epicsMathTest.exe       epicsMathTest.obj      ../../../../lib/windows-x64/Com.lib   
Generating code
Finished generating code
cl             /favor:blend   -nologo -D__STDC__=0 -D_CRT_SECURE_NO_DEPRECATE -D_CRT_NONSTDC_NO_DEPRECATE   -Ox -GL -Oy-   -W3 -w44355       -MD -DEPICS_BUILD_DLL -DEPICS_CALL_DLL   -I. -I../O.Common -I. -I. -I.. -I../../../../include/compiler/msvc -I../../../../include/os/WIN32 -I../../../../include        -c ../epicsMMIOTest.c
epicsMMIOTest.c
link -nologo  -LTCG -incremental:no -opt:ref -release -version:3.15 /MACHINE:X64             -out:epicsMMIOTest.exe       epicsMMIOTest.obj      ../../../../lib/windows-x64/Com.lib ws2_32.lib user32.lib  
Generating code
Finished generating code
cl             /favor:blend   -nologo -D__STDC__=0 -D_CRT_SECURE_NO_DEPRECATE -D_CRT_NONSTDC_NO_DEPRECATE   -Ox -GL -Oy-   -W3 -w44355       -MD -DEPICS_BUILD_DLL -DEPICS_CALL_DLL   -I. -I../O.Common -I. -I. -I.. -I../../../../include/compiler/msvc -I../../../../include/os/WIN32 -I../../../../include        -c ../epicsEllTest.c
epicsEllTest.c
link -nologo  -LTCG -incremental:no -opt:ref -release -version:3.15 /MACHINE:X64             -out:epicsEllTest.exe       epicsEllTest.obj      ../../../../lib/windows-x64/Com.lib   
Generating code
Finished generating code
cl             /favor:blend   -nologo -D__STDC__=0 -D_CRT_SECURE_NO_DEPRECATE -D_CRT_NONSTDC_NO_DEPRECATE   -Ox -GL -Oy-   -W3 -w44355       -MD -DEPICS_BUILD_DLL -DEPICS_CALL_DLL   -I. -I../O.Common -I. -I. -I.. -I../../../../include/compiler/msvc -I../../../../include/os/WIN32 -I../../../../include        -c ../epicsEnvTest.c
epicsEnvTest.c
link -nologo  -LTCG -incremental:no -opt:ref -release -version:3.15 /MACHINE:X64             -out:epicsEnvTest.exe       epicsEnvTest.obj      ../../../../lib/windows-x64/Com.lib   
Generating code
Finished generating code
cl             /favor:blend   -nologo -D__STDC__=0 -D_CRT_SECURE_NO_DEPRECATE -D_CRT_NONSTDC_NO_DEPRECATE   -Ox -GL -Oy-   -W3 -w44355       -MD -DEPICS_BUILD_DLL -DEPICS_CALL_DLL   -I. -I../O.Common -I. -I. -I.. -I../../../../include/compiler/msvc -I../../../../include/os/WIN32 -I../../../../include        -c ../epicsErrlogTest.c
epicsErrlogTest.c
../epicsErrlogTest.c(452) : warning C4244: 'function' : conversion from 'SOCKET' to 'int', possible loss of data
link -nologo  -LTCG -incremental:no -opt:ref -release -version:3.15 /MACHINE:X64             -out:epicsErrlogTest.exe       epicsErrlogTest.obj      ../../../../lib/windows-x64/Com.lib ws2_32.lib user32.lib  
Generating code
Finished generating code
cl             /favor:blend   -nologo -D__STDC__=0 -D_CRT_SECURE_NO_DEPRECATE -D_CRT_NONSTDC_NO_DEPRECATE   -Ox -GL -Oy-   -W3 -w44355       -MD -DEPICS_BUILD_DLL -DEPICS_CALL_DLL   -I. -I../O.Common -I. -I. -I.. -I../../../../include/compiler/msvc -I../../../../include/os/WIN32 -I../../../../include        -c ../epicsStdioTest.c
epicsStdioTest.c
../epicsStdioTest.c(42) : warning C4267: '=' : conversion from 'size_t' to 'int', possible loss of data
../epicsStdioTest.c(53) : warning C4267: '=' : conversion from 'size_t' to 'int', possible loss of data
../epicsStdioTest.c(102) : warning C4267: 'function' : conversion from 'size_t' to 'int', possible loss of data
../epicsStdioTest.c(110) : warning C4267: 'function' : conversion from 'size_t' to 'int', possible loss of data
../epicsStdioTest.c(116) : warning C4267: 'function' : conversion from 'size_t' to 'int', possible loss of data
link -nologo  -LTCG -incremental:no -opt:ref -release -version:3.15 /MACHINE:X64             -out:epicsStdioTest.exe       epicsStdioTest.obj      ../../../../lib/windows-x64/Com.lib   
Generating code
Finished generating code
cl             /favor:blend   -nologo -D__STDC__=0 -D_CRT_SECURE_NO_DEPRECATE -D_CRT_NONSTDC_NO_DEPRECATE   -Ox -GL -Oy-   -W3 -w44355       -MD -DEPICS_BUILD_DLL -DEPICS_CALL_DLL   -I. -I../O.Common -I. -I. -I.. -I../../../../include/compiler/msvc -I../../../../include/os/WIN32 -I../../../../include        -c ../epicsStdlibTest.c
epicsStdlibTest.c
../epicsStdlibTest.c(273) : warning C4146: unary minus operator applied to unsigned type, result still unsigned
../epicsStdlibTest.c(315) : warning C4146: unary minus operator applied to unsigned type, result still unsigned
link -nologo  -LTCG -incremental:no -opt:ref -release -version:3.15 /MACHINE:X64             -out:epicsStdlibTest.exe       epicsStdlibTest.obj      ../../../../lib/windows-x64/Com.lib   
Generating code
Finished generating code
cl             /favor:blend   -nologo -D__STDC__=0 -D_CRT_SECURE_NO_DEPRECATE -D_CRT_NONSTDC_NO_DEPRECATE   -Ox -GL -Oy-   -W3 -w44355       -MD -DEPICS_BUILD_DLL -DEPICS_CALL_DLL   -I. -I../O.Common -I. -I. -I.. -I../../../../include/compiler/msvc -I../../../../include/os/WIN32 -I../../../../include        -c ../epicsSockResolveTest.c
epicsSockResolveTest.c
link -nologo  -LTCG -incremental:no -opt:ref -release -version:3.15 /MACHINE:X64             -out:epicsSockResolveTest.exe       epicsSockResolveTest.obj      ../../../../lib/windows-x64/Com.lib ws2_32.lib user32.lib  
Generating code
Finished generating code
cl             /favor:blend   -nologo -D__STDC__=0 -D_CRT_SECURE_NO_DEPRECATE -D_CRT_NONSTDC_NO_DEPRECATE   -Ox -GL -Oy-   -W3 -w44355       -MD -DEPICS_BUILD_DLL -DEPICS_CALL_DLL   -I. -I../O.Common -I. -I. -I.. -I../../../../include/compiler/msvc -I../../../../include/os/WIN32 -I../../../../include        -c ../epicsStringTest.c
epicsStringTest.c
link -nologo  -LTCG -incremental:no -opt:ref -release -version:3.15 /MACHINE:X64             -out:epicsStringTest.exe       epicsStringTest.obj      ../../../../lib/windows-x64/Com.lib   
Generating code
Finished generating code
cl -EHsc -GR             /favor:blend   -nologo -D__STDC__=0 -D_CRT_SECURE_NO_DEPRECATE -D_CRT_NONSTDC_NO_DEPRECATE   -Ox -GL -Oy-   -W3 -w44355       -MD -DEPICS_BUILD_DLL -DEPICS_CALL_DLL -TP  -I. -I../O.Common -I. -I. -I.. -I../../../../include/compiler/msvc -I../../../../include/os/WIN32 -I../../../../include        -c ../epicsTimeTest.cpp
epicsTimeTest.cpp
link -nologo  -LTCG -incremental:no -opt:ref -release -version:3.15 /MACHINE:X64             -out:epicsTimeTest.exe       epicsTimeTest.obj      ../../../../lib/windows-x64/Com.lib   
Generating code
Finished generating code
cl -EHsc -GR             /favor:blend   -nologo -D__STDC__=0 -D_CRT_SECURE_NO_DEPRECATE -D_CRT_NONSTDC_NO_DEPRECATE   -Ox -GL -Oy-   -W3 -w44355       -MD -DEPICS_BUILD_DLL -DEPICS_CALL_DLL -TP  -I. -I../O.Common -I. -I. -I.. -I../../../../include/compiler/msvc -I../../../../include/os/WIN32 -I../../../../include        -c ../epicsThreadTest.cpp
epicsThreadTest.cpp
link -nologo  -LTCG -incremental:no -opt:ref -release -version:3.15 /MACHINE:X64             -out:epicsThreadTest.exe       epicsThreadTest.obj      ../../../../lib/windows-x64/Com.lib   
Generating code
Finished generating code
cl             /favor:blend   -nologo -D__STDC__=0 -D_CRT_SECURE_NO_DEPRECATE -D_CRT_NONSTDC_NO_DEPRECATE   -Ox -GL -Oy-   -W3 -w44355       -MD -DEPICS_BUILD_DLL -DEPICS_CALL_DLL   -I. -I../O.Common -I. -I. -I.. -I../../../../include/compiler/msvc -I../../../../include/os/WIN32 -I../../../../include        -c ../epicsThreadOnceTest.c
epicsThreadOnceTest.c
link -nologo  -LTCG -incremental:no -opt:ref -release -version:3.15 /MACHINE:X64             -out:epicsThreadOnceTest.exe       epicsThreadOnceTest.obj      ../../../../lib/windows-x64/Com.lib   
Generating code
Finished generating code
cl -EHsc -GR             /favor:blend   -nologo -D__STDC__=0 -D_CRT_SECURE_NO_DEPRECATE -D_CRT_NONSTDC_NO_DEPRECATE   -Ox -GL -Oy-   -W3 -w44355       -MD -DEPICS_BUILD_DLL -DEPICS_CALL_DLL -TP  -I. -I../O.Common -I. -I. -I.. -I../../../../include/compiler/msvc -I../../../../include/os/WIN32 -I../../../../include        -c ../epicsThreadPriorityTest.cpp
epicsThreadPriorityTest.cpp
link -nologo  -LTCG -incremental:no -opt:ref -release -version:3.15 /MACHINE:X64             -out:epicsThreadPriorityTest.exe       epicsThreadPriorityTest.obj      ../../../../lib/windows-x64/Com.lib   
Generating code
Finished generating code
cl -EHsc -GR             /favor:blend   -nologo -D__STDC__=0 -D_CRT_SECURE_NO_DEPRECATE -D_CRT_NONSTDC_NO_DEPRECATE   -Ox -GL -Oy-   -W3 -w44355       -MD -DEPICS_BUILD_DLL -DEPICS_CALL_DLL -TP  -I. -I../O.Common -I. -I. -I.. -I../../../../include/compiler/msvc -I../../../../include/os/WIN32 -I../../../../include        -c ../epicsThreadPrivateTest.cpp
epicsThreadPrivateTest.cpp
link -nologo  -LTCG -incremental:no -opt:ref -release -version:3.15 /MACHINE:X64             -out:epicsThreadPrivateTest.exe       epicsThreadPrivateTest.obj      ../../../../lib/windows-x64/Com.lib   
Generating code
Finished generating code
cl             /favor:blend   -nologo -D__STDC__=0 -D_CRT_SECURE_NO_DEPRECATE -D_CRT_NONSTDC_NO_DEPRECATE   -Ox -GL -Oy-   -W3 -w44355       -MD -DEPICS_BUILD_DLL -DEPICS_CALL_DLL   -I. -I../O.Common -I. -I. -I.. -I../../../../include/compiler/msvc -I../../../../include/os/WIN32 -I../../../../include        -c ../epicsThreadHooksTest.c
epicsThreadHooksTest.c
link -nologo  -LTCG -incremental:no -opt:ref -release -version:3.15 /MACHINE:X64             -out:epicsThreadHooksTest.exe       epicsThreadHooksTest.obj      ../../../../lib/windows-x64/Com.lib   
Generating code
Finished generating code
cl             /favor:blend   -nologo -D__STDC__=0 -D_CRT_SECURE_NO_DEPRECATE -D_CRT_NONSTDC_NO_DEPRECATE   -Ox -GL -Oy-   -W3 -w44355       -MD -DEPICS_BUILD_DLL -DEPICS_CALL_DLL   -I. -I../O.Common -I. -I. -I.. -I../../../../include/compiler/msvc -I../../../../include/os/WIN32 -I../../../../include        -c ../epicsThreadPoolTest.c
epicsThreadPoolTest.c
../epicsThreadPoolTest.c(103) : warning C4267: '=' : conversion from 'size_t' to 'unsigned int', possible loss of data
../epicsThreadPoolTest.c(111) : warning C4267: '=' : conversion from 'size_t' to 'unsigned int', possible loss of data
../epicsThreadPoolTest.c(112) : warning C4267: '=' : conversion from 'size_t' to 'unsigned int', possible loss of data
link -nologo  -LTCG -incremental:no -opt:ref -release -version:3.15 /MACHINE:X64             -out:epicsThreadPoolTest.exe       epicsThreadPoolTest.obj      ../../../../lib/windows-x64/Com.lib   
Generating code
Finished generating code
cl             /favor:blend   -nologo -D__STDC__=0 -D_CRT_SECURE_NO_DEPRECATE -D_CRT_NONSTDC_NO_DEPRECATE   -Ox -GL -Oy-   -W3 -w44355       -MD -DEPICS_BUILD_DLL -DEPICS_CALL_DLL   -I. -I../O.Common -I. -I. -I.. -I../../../../include/compiler/msvc -I../../../../include/os/WIN32 -I../../../../include        -c ../epicsExitTest.c
epicsExitTest.c
link -nologo  -LTCG -incremental:no -opt:ref -release -version:3.15 /MACHINE:X64             -out:epicsExitTest.exe       epicsExitTest.obj      ../../../../lib/windows-x64/Com.lib   
Generating code
Finished generating code
cl -EHsc -GR             /favor:blend   -nologo -D__STDC__=0 -D_CRT_SECURE_NO_DEPRECATE -D_CRT_NONSTDC_NO_DEPRECATE   -Ox -GL -Oy-   -W3 -w44355       -MD -DEPICS_BUILD_DLL -DEPICS_CALL_DLL -TP  -I. -I../O.Common -I. -I. -I.. -I../../../../include/compiler/msvc -I../../../../include/os/WIN32 -I../../../../include        -c ../epicsTimerTest.cpp
epicsTimerTest.cpp
link -nologo  -LTCG -incremental:no -opt:ref -release -version:3.15 /MACHINE:X64             -out:epicsTimerTest.exe       epicsTimerTest.obj      ../../../../lib/windows-x64/Com.lib   
Generating code
Finished generating code
cl             /favor:blend   -nologo -D__STDC__=0 -D_CRT_SECURE_NO_DEPRECATE -D_CRT_NONSTDC_NO_DEPRECATE   -Ox -GL -Oy-   -W3 -w44355       -MD -DEPICS_BUILD_DLL -DEPICS_CALL_DLL   -I. -I../O.Common -I. -I. -I.. -I../../../../include/compiler/msvc -I../../../../include/os/WIN32 -I../../../../include        -c ../ringPointerTest.c
ringPointerTest.c
../ringPointerTest.c(47) : error C2036: 'void *const ' : unknown size
../ringPointerTest.c(57) : error C2036: 'void *const ' : unknown size
../ringPointerTest.c(57) : error C2036: 'void *const ' : unknown size
../ringPointerTest.c(57) : error C2036: 'void *' : unknown size
../ringPointerTest.c(59) : error C2143: syntax error : missing ';' before 'type'
../ringPointerTest.c(60) : error C2065: 'ret' : undeclared identifier
../ringPointerTest.c(65) : error C2036: 'void *const ' : unknown size
../ringPointerTest.c(65) : error C2036: 'void *const ' : unknown size
../ringPointerTest.c(65) : error C2036: 'void *const ' : unknown size
../ringPointerTest.c(65) : error C2036: 'void *const ' : unknown size
../ringPointerTest.c(73) : error C2036: 'void *const ' : unknown size
../ringPointerTest.c(73) : error C2036: 'void *const ' : unknown size
../ringPointerTest.c(73) : error C2036: 'void *' : unknown size
../ringPointerTest.c(79) : error C2036: 'void *const ' : unknown size
../ringPointerTest.c(79) : error C2036: 'void *const ' : unknown size
../ringPointerTest.c(79) : error C2036: 'void *const ' : unknown size
../ringPointerTest.c(79) : error C2036: 'void *const ' : unknown size
../ringPointerTest.c(87) : error C2036: 'void *const ' : unknown size
../ringPointerTest.c(87) : error C2036: 'void *const ' : unknown size
../ringPointerTest.c(87) : error C2036: 'void *' : unknown size
../ringPointerTest.c(89) : error C2143: syntax error : missing ';' before 'type'
../ringPointerTest.c(90) : error C2065: 'ret' : undeclared identifier
../ringPointerTest.c(112) : error C2036: 'void *' : unknown size
../ringPointerTest.c(121) : error C2036: 'void *' : unknown size
make[3]: *** [ringPointerTest.obj] Error 2
make[3]: Leaving directory `C:/jenkins64-1/workspace/epics-base-3.15-win64/src/libCom/test/O.windows-x64'
make[2]: *** [install.windows-x64] Error 2
make[2]: Leaving directory `C:/jenkins64-1/workspace/epics-base-3.15-win64/src/libCom/test'
make[1]: *** [libCom/test.install] Error 2
make[1]: Leaving directory `C:/jenkins64-1/workspace/epics-base-3.15-win64/src'
make: *** [src.install] Error 2

<https://jenkins.aps.anl.gov/job/epics-base-3.15-win64/ws/>exit> 2 
Build step 'Execute Windows batch command' marked build as failure
[WARNINGS] Skipping publisher since build result is FAILURE


Replies:
Jenkins build is back to normal : epics-base-3.15-win64 #119 APS Jenkins

Navigate by Date:
Prev: Build failed in Jenkins: epics-base-3.15-win32 #106 APS Jenkins
Next: Build failed in Jenkins: epics-base-3.15-win64s #98 APS Jenkins
Index: 2002  2003  2004  2005  2006  2007  2008  2009  2010  2011  2012  2013  <20142015  2016  2017  2018  2019  2020  2021 
Navigate by Thread:
Prev: Jenkins build is back to normal : epics-base-3.15-win32 #107 APS Jenkins
Next: Jenkins build is back to normal : epics-base-3.15-win64 #119 APS Jenkins
Index: 2002  2003  2004  2005  2006  2007  2008  2009  2010  2011  2012  2013  <20142015  2016  2017  2018  2019  2020  2021 
ANJ, 17 Nov 2014 Valid HTML 4.01! · Home · News · About · Base · Modules · Extensions · Distributions · Download ·
· Search · EPICS V4 · IRMIS · Talk · Bugs · Documents · Links · Licensing ·