EPICS Controls Argonne National Laboratory

Experimental Physics and
Industrial Control System

2002  2003  2004  2005  2006  2007  2008  2009  2010  2011  2012  2013  2014  <20152016  2017  2018  2019  2020  2021  2022  Index 2002  2003  2004  2005  2006  2007  2008  2009  2010  2011  2012  2013  2014  <20152016  2017  2018  2019  2020  2021  2022 
<== Date ==> <== Thread ==>

Subject: Build failed in Jenkins: epics-base-3.15-win64s #152
From: APS Jenkins <[email protected]>
To: [email protected]
Date: Thu, 16 Apr 2015 16:12:01 -0500 (CDT)
See <https://jenkins.aps.anl.gov/job/epics-base-3.15-win64s/152/>

------------------------------------------
Started by user Andrew Johnson
[EnvInject] - Loading node environment variables.
Building remotely on win64-1 (win64) in workspace <https://jenkins.aps.anl.gov/job/epics-base-3.15-win64s/ws/>
[epics-base-3.15-win64] $ cmd /c call C:\Users\jenkins\hudson2474089729216336261.bat

<https://jenkins.aps.anl.gov/job/epics-base-3.15-win64s/ws/>make> EPICS_HOST_ARCH=windows-x64-static host 
make -C ./configure install.windows-x64-static 
make[1]: Entering directory `C:/jenkins64-1/workspace/epics-base-3.15-win64/configure'
make -C O.windows-x64-static -f ../Makefile TOP=../.. \
	    T_A=windows-x64-static install
make[2]: Entering directory `C:/jenkins64-1/workspace/epics-base-3.15-win64/configure/O.windows-x64-static'
make[2]: Nothing to be done for `install'.
make[2]: Leaving directory `C:/jenkins64-1/workspace/epics-base-3.15-win64/configure/O.windows-x64-static'
make[1]: Leaving directory `C:/jenkins64-1/workspace/epics-base-3.15-win64/configure'
make -C ./src install.windows-x64-static 
make[1]: Entering directory `C:/jenkins64-1/workspace/epics-base-3.15-win64/src'
make -C ./tools install.windows-x64-static 
make[2]: Entering directory `C:/jenkins64-1/workspace/epics-base-3.15-win64/src/tools'
make -C O.windows-x64-static -f ../Makefile TOP=../../.. \
	    T_A=windows-x64-static install
make[3]: Entering directory `C:/jenkins64-1/workspace/epics-base-3.15-win64/src/tools/O.windows-x64-static'
make[3]: Nothing to be done for `install'.
make[3]: Leaving directory `C:/jenkins64-1/workspace/epics-base-3.15-win64/src/tools/O.windows-x64-static'
make[2]: Leaving directory `C:/jenkins64-1/workspace/epics-base-3.15-win64/src/tools'
make -C tools/test install.windows-x64-static 
make[2]: Entering directory `C:/jenkins64-1/workspace/epics-base-3.15-win64/src/tools/test'
make -C O.windows-x64-static -f ../Makefile TOP=../../../.. \
	    T_A=windows-x64-static install
make[3]: Entering directory `C:/jenkins64-1/workspace/epics-base-3.15-win64/src/tools/test/O.windows-x64-static'
make[3]: Nothing to be done for `install'.
make[3]: Leaving directory `C:/jenkins64-1/workspace/epics-base-3.15-win64/src/tools/test/O.windows-x64-static'
make[2]: Leaving directory `C:/jenkins64-1/workspace/epics-base-3.15-win64/src/tools/test'
make -C template/base install.windows-x64-static 
make[2]: Entering directory `C:/jenkins64-1/workspace/epics-base-3.15-win64/src/template/base'
make -C O.windows-x64-static -f ../Makefile TOP=../../../.. \
	    T_A=windows-x64-static install
make[3]: Entering directory `C:/jenkins64-1/workspace/epics-base-3.15-win64/src/template/base/O.windows-x64-static'
make[3]: Nothing to be done for `install'.
make[3]: Leaving directory `C:/jenkins64-1/workspace/epics-base-3.15-win64/src/template/base/O.windows-x64-static'
make[2]: Leaving directory `C:/jenkins64-1/workspace/epics-base-3.15-win64/src/template/base'
make -C template/ext install.windows-x64-static 
make[2]: Entering directory `C:/jenkins64-1/workspace/epics-base-3.15-win64/src/template/ext'
make -C O.windows-x64-static -f ../Makefile TOP=../../../.. \
	    T_A=windows-x64-static install
make[3]: Entering directory `C:/jenkins64-1/workspace/epics-base-3.15-win64/src/template/ext/O.windows-x64-static'
make[3]: Nothing to be done for `install'.
make[3]: Leaving directory `C:/jenkins64-1/workspace/epics-base-3.15-win64/src/template/ext/O.windows-x64-static'
make[2]: Leaving directory `C:/jenkins64-1/workspace/epics-base-3.15-win64/src/template/ext'
make -C ./libCom install.windows-x64-static 
make[2]: Entering directory `C:/jenkins64-1/workspace/epics-base-3.15-win64/src/libCom'
make -C O.windows-x64-static -f ../Makefile TOP=../../.. \
	    T_A=windows-x64-static install
make[3]: Entering directory `C:/jenkins64-1/workspace/epics-base-3.15-win64/src/libCom/O.windows-x64-static'
cl -EHsc -GR                -nologo -D__STDC__=0 -D_CRT_SECURE_NO_DEPRECATE -D_CRT_NONSTDC_NO_DEPRECATE   -RTCsu -Zi   -W3 -w44355        -MTd  -TP  -I. -I../O.Common -I. -I../../../src/libCom/osi/compiler/msvc -I../../../src/libCom/osi/compiler/default -I. -I../../../src/libCom/osi/os/WIN32 -I../../../src/libCom/osi/os/default -I.. -I../../../src/libCom/as -I../../../src/libCom/bucketLib -I../../../src/libCom/calc -I../../../src/libCom/cvtFast -I../../../src/libCom/cppStd -I../../../src/libCom/cxxTemplates -I../../../src/libCom/dbmf -I../../../src/libCom/ellLib -I../../../src/libCom/env -I../../../src/libCom/error -I../../../src/libCom/fdmgr -I../../../src/libCom/flex -I../../../src/libCom/freeList -I../../../src/libCom/gpHash -I../../../src/libCom/iocsh -I../../../src/libCom/log -I../../../src/libCom/macLib -I../../../src/libCom/misc -I../../../src/libCom/osi -I../../../src/libCom/pool -I../../../src/libCom/ring -I../../../src/libCom/taskwd -I../../../src/libCom/timer -I..!
 /../../src/libCom/yacc -I../../../src/libCom/yacc -I../../../src/libCom/yajl -I../../../include/compiler/msvc -I../../../include/os/WIN32 -I../../../include         -c ../../../src/libCom/osi/os/WIN32/epicsTempFile.cpp
epicsTempFile.cpp
../../../src/libCom/osi/os/WIN32/epicsTempFile.cpp : fatal error C1902: Program database manager mismatch; please check your installation
make[3]: Leaving directory `C:/jenkins64-1/workspace/epics-base-3.15-win64/src/libCom/O.windows-x64-static'
make[2]: *** [install.windows-x64-static] Error 2
make[2]: Leaving directory `C:/jenkins64-1/workspace/epics-base-3.15-win64/src/libCom'
make[1]: *** [libCom.install.windows-x64-static] Error 2
make[1]: Leaving directory `C:/jenkins64-1/workspace/epics-base-3.15-win64/src'
make: *** [src.install.windows-x64-static] Error 2

<https://jenkins.aps.anl.gov/job/epics-base-3.15-win64s/ws/>make> EPICS_HOST_ARCH=windows-x64-static tapfiles 
make -C ./configure tapfiles 
make[1]: Entering directory `C:/jenkins64-1/workspace/epics-base-3.15-win64/configure'
make -C O.windows-x64-static -f ../Makefile TOP=../.. \
	    T_A=windows-x64-static tapfiles
make[2]: Entering directory `C:/jenkins64-1/workspace/epics-base-3.15-win64/configure/O.windows-x64-static'
make[2]: Nothing to be done for `tapfiles'.
make[2]: Leaving directory `C:/jenkins64-1/workspace/epics-base-3.15-win64/configure/O.windows-x64-static'
make[1]: Leaving directory `C:/jenkins64-1/workspace/epics-base-3.15-win64/configure'
make -C ./src tapfiles 
make[1]: Entering directory `C:/jenkins64-1/workspace/epics-base-3.15-win64/src'
make -C ./tools tapfiles 
make[2]: Entering directory `C:/jenkins64-1/workspace/epics-base-3.15-win64/src/tools'
make -C O.windows-x64-static -f ../Makefile TOP=../../.. \
	    T_A=windows-x64-static tapfiles
make[3]: Entering directory `C:/jenkins64-1/workspace/epics-base-3.15-win64/src/tools/O.windows-x64-static'
make[3]: Nothing to be done for `tapfiles'.
make[3]: Leaving directory `C:/jenkins64-1/workspace/epics-base-3.15-win64/src/tools/O.windows-x64-static'
make[2]: Leaving directory `C:/jenkins64-1/workspace/epics-base-3.15-win64/src/tools'
make -C tools/test tapfiles 
make[2]: Entering directory `C:/jenkins64-1/workspace/epics-base-3.15-win64/src/tools/test'
make -C O.windows-x64-static -f ../Makefile TOP=../../../.. \
	    T_A=windows-x64-static tapfiles
make[3]: Entering directory `C:/jenkins64-1/workspace/epics-base-3.15-win64/src/tools/test/O.windows-x64-static'
make[3]: Nothing to be done for `tapfiles'.
make[3]: Leaving directory `C:/jenkins64-1/workspace/epics-base-3.15-win64/src/tools/test/O.windows-x64-static'
make[2]: Leaving directory `C:/jenkins64-1/workspace/epics-base-3.15-win64/src/tools/test'
make -C template/base tapfiles 
make[2]: Entering directory `C:/jenkins64-1/workspace/epics-base-3.15-win64/src/template/base'
make -C O.windows-x64-static -f ../Makefile TOP=../../../.. \
	    T_A=windows-x64-static tapfiles
make[3]: Entering directory `C:/jenkins64-1/workspace/epics-base-3.15-win64/src/template/base/O.windows-x64-static'
make[3]: Nothing to be done for `tapfiles'.
make[3]: Leaving directory `C:/jenkins64-1/workspace/epics-base-3.15-win64/src/template/base/O.windows-x64-static'
make[2]: Leaving directory `C:/jenkins64-1/workspace/epics-base-3.15-win64/src/template/base'
make -C template/ext tapfiles 
make[2]: Entering directory `C:/jenkins64-1/workspace/epics-base-3.15-win64/src/template/ext'
make -C O.windows-x64-static -f ../Makefile TOP=../../../.. \
	    T_A=windows-x64-static tapfiles
make[3]: Entering directory `C:/jenkins64-1/workspace/epics-base-3.15-win64/src/template/ext/O.windows-x64-static'
make[3]: Nothing to be done for `tapfiles'.
make[3]: Leaving directory `C:/jenkins64-1/workspace/epics-base-3.15-win64/src/template/ext/O.windows-x64-static'
make[2]: Leaving directory `C:/jenkins64-1/workspace/epics-base-3.15-win64/src/template/ext'
make -C ./libCom tapfiles 
make[2]: Entering directory `C:/jenkins64-1/workspace/epics-base-3.15-win64/src/libCom'
make -C O.windows-x64-static -f ../Makefile TOP=../../.. \
	    T_A=windows-x64-static tapfiles
make[3]: Entering directory `C:/jenkins64-1/workspace/epics-base-3.15-win64/src/libCom/O.windows-x64-static'
cl -EHsc -GR                -nologo -D__STDC__=0 -D_CRT_SECURE_NO_DEPRECATE -D_CRT_NONSTDC_NO_DEPRECATE   -RTCsu -Zi   -W3 -w44355        -MTd  -TP  -I. -I../O.Common -I. -I../../../src/libCom/osi/compiler/msvc -I../../../src/libCom/osi/compiler/default -I. -I../../../src/libCom/osi/os/WIN32 -I../../../src/libCom/osi/os/default -I.. -I../../../src/libCom/as -I../../../src/libCom/bucketLib -I../../../src/libCom/calc -I../../../src/libCom/cvtFast -I../../../src/libCom/cppStd -I../../../src/libCom/cxxTemplates -I../../../src/libCom/dbmf -I../../../src/libCom/ellLib -I../../../src/libCom/env -I../../../src/libCom/error -I../../../src/libCom/fdmgr -I../../../src/libCom/flex -I../../../src/libCom/freeList -I../../../src/libCom/gpHash -I../../../src/libCom/iocsh -I../../../src/libCom/log -I../../../src/libCom/macLib -I../../../src/libCom/misc -I../../../src/libCom/osi -I../../../src/libCom/pool -I../../../src/libCom/ring -I../../../src/libCom/taskwd -I../../../src/libCom/timer -I..!
 /../../src/libCom/yacc -I../../../src/libCom/yacc -I../../../src/libCom/yajl -I../../../include/compiler/msvc -I../../../include/os/WIN32 -I../../../include         -c ../../../src/libCom/osi/os/WIN32/epicsTempFile.cpp
epicsTempFile.cpp
../../../src/libCom/osi/os/WIN32/epicsTempFile.cpp : fatal error C1902: Program database manager mismatch; please check your installation
make[3]: Nothing to be done for `tapfiles'.
make[3]: Leaving directory `C:/jenkins64-1/workspace/epics-base-3.15-win64/src/libCom/O.windows-x64-static'
make[2]: Leaving directory `C:/jenkins64-1/workspace/epics-base-3.15-win64/src/libCom'
make -C libCom/RTEMS tapfiles 
make[2]: Entering directory `C:/jenkins64-1/workspace/epics-base-3.15-win64/src/libCom/RTEMS'
make -C O.windows-x64-static -f ../Makefile TOP=../../../.. \
	    T_A=windows-x64-static tapfiles
make[3]: Entering directory `C:/jenkins64-1/workspace/epics-base-3.15-win64/src/libCom/RTEMS/O.windows-x64-static'
make[3]: Nothing to be done for `tapfiles'.
make[3]: Leaving directory `C:/jenkins64-1/workspace/epics-base-3.15-win64/src/libCom/RTEMS/O.windows-x64-static'
make[2]: Leaving directory `C:/jenkins64-1/workspace/epics-base-3.15-win64/src/libCom/RTEMS'
make -C libCom/test tapfiles 
make[2]: Entering directory `C:/jenkins64-1/workspace/epics-base-3.15-win64/src/libCom/test'
make -C O.windows-x64-static -f ../Makefile TOP=../../../.. \
	    T_A=windows-x64-static tapfiles
make[3]: Entering directory `C:/jenkins64-1/workspace/epics-base-3.15-win64/src/libCom/test/O.windows-x64-static'
cl                -nologo -D__STDC__=0 -D_CRT_SECURE_NO_DEPRECATE -D_CRT_NONSTDC_NO_DEPRECATE   -Zi -RTCsu   -W3 -w44355        -MTd    -I. -I../O.Common -I. -I. -I.. -I../../../../include/compiler/msvc -I../../../../include/os/WIN32 -I../../../../include         -c ../epicsTypesTest.c
epicsTypesTest.c
../epicsTypesTest.c : fatal error C1902: Program database manager mismatch; please check your installation
make[3]: *** [epicsTypesTest.obj] Error 2
make[3]: Leaving directory `C:/jenkins64-1/workspace/epics-base-3.15-win64/src/libCom/test/O.windows-x64-static'
make[2]: *** [tapfiles.windows-x64-static] Error 2
make[2]: Leaving directory `C:/jenkins64-1/workspace/epics-base-3.15-win64/src/libCom/test'
make[1]: *** [libCom/test.tapfiles] Error 2
make[1]: Leaving directory `C:/jenkins64-1/workspace/epics-base-3.15-win64/src'
make: *** [src.tapfiles] Error 2

<https://jenkins.aps.anl.gov/job/epics-base-3.15-win64s/ws/>exit> 2 
Build step 'Execute Windows batch command' marked build as failure
TAP Reports Processing: START
Looking for TAP results report in workspace using pattern: src/**/O.windows-x64-static/*.tap
Saving reports...
Processing '/var/lib/jenkins/jobs/epics-base-3.15-win64s/builds/152/tap-master-files/src/tools/test/O.windows-x64-static/Breaktable.tap'
Parsing TAP test result [/var/lib/jenkins/jobs/epics-base-3.15-win64s/builds/152/tap-master-files/src/tools/test/O.windows-x64-static/Breaktable.tap].
Processing '/var/lib/jenkins/jobs/epics-base-3.15-win64s/builds/152/tap-master-files/src/tools/test/O.windows-x64-static/DBD.tap'
Parsing TAP test result [/var/lib/jenkins/jobs/epics-base-3.15-win64s/builds/152/tap-master-files/src/tools/test/O.windows-x64-static/DBD.tap].
Processing '/var/lib/jenkins/jobs/epics-base-3.15-win64s/builds/152/tap-master-files/src/tools/test/O.windows-x64-static/Device.tap'
Parsing TAP test result [/var/lib/jenkins/jobs/epics-base-3.15-win64s/builds/152/tap-master-files/src/tools/test/O.windows-x64-static/Device.tap].
Processing '/var/lib/jenkins/jobs/epics-base-3.15-win64s/builds/152/tap-master-files/src/tools/test/O.windows-x64-static/Driver.tap'
Parsing TAP test result [/var/lib/jenkins/jobs/epics-base-3.15-win64s/builds/152/tap-master-files/src/tools/test/O.windows-x64-static/Driver.tap].
Processing '/var/lib/jenkins/jobs/epics-base-3.15-win64s/builds/152/tap-master-files/src/tools/test/O.windows-x64-static/Function.tap'
Parsing TAP test result [/var/lib/jenkins/jobs/epics-base-3.15-win64s/builds/152/tap-master-files/src/tools/test/O.windows-x64-static/Function.tap].
Processing '/var/lib/jenkins/jobs/epics-base-3.15-win64s/builds/152/tap-master-files/src/tools/test/O.windows-x64-static/Menu.tap'
Parsing TAP test result [/var/lib/jenkins/jobs/epics-base-3.15-win64s/builds/152/tap-master-files/src/tools/test/O.windows-x64-static/Menu.tap].
Processing '/var/lib/jenkins/jobs/epics-base-3.15-win64s/builds/152/tap-master-files/src/tools/test/O.windows-x64-static/Recfield.tap'
Parsing TAP test result [/var/lib/jenkins/jobs/epics-base-3.15-win64s/builds/152/tap-master-files/src/tools/test/O.windows-x64-static/Recfield.tap].
Processing '/var/lib/jenkins/jobs/epics-base-3.15-win64s/builds/152/tap-master-files/src/tools/test/O.windows-x64-static/Recordtype.tap'
Parsing TAP test result [/var/lib/jenkins/jobs/epics-base-3.15-win64s/builds/152/tap-master-files/src/tools/test/O.windows-x64-static/Recordtype.tap].
Processing '/var/lib/jenkins/jobs/epics-base-3.15-win64s/builds/152/tap-master-files/src/tools/test/O.windows-x64-static/Registrar.tap'
Parsing TAP test result [/var/lib/jenkins/jobs/epics-base-3.15-win64s/builds/152/tap-master-files/src/tools/test/O.windows-x64-static/Registrar.tap].
Processing '/var/lib/jenkins/jobs/epics-base-3.15-win64s/builds/152/tap-master-files/src/tools/test/O.windows-x64-static/Variable.tap'
Parsing TAP test result [/var/lib/jenkins/jobs/epics-base-3.15-win64s/builds/152/tap-master-files/src/tools/test/O.windows-x64-static/Variable.tap].
Processing '/var/lib/jenkins/jobs/epics-base-3.15-win64s/builds/152/tap-master-files/src/tools/test/O.windows-x64-static/macLib.tap'
Parsing TAP test result [/var/lib/jenkins/jobs/epics-base-3.15-win64s/builds/152/tap-master-files/src/tools/test/O.windows-x64-static/macLib.tap].
TAP Reports Processing: FINISH
[WARNINGS] Skipping publisher since build result is FAILURE


References:
Build failed in Jenkins: epics-base-3.15-win64s #151 APS Jenkins

Navigate by Date:
Prev: Re: Jenkins build is back to normal : epics-base-3.15-cyg64 #190 Andrew Johnson
Next: Build failed in Jenkins: epics-base-3.16-cyg64 #20 APS Jenkins
Index: 2002  2003  2004  2005  2006  2007  2008  2009  2010  2011  2012  2013  2014  <20152016  2017  2018  2019  2020  2021  2022 
Navigate by Thread:
Prev: Build failed in Jenkins: epics-base-3.15-win64s #151 APS Jenkins
Next: Build failed in Jenkins: epics-base-3.16-win64s #11 APS Jenkins
Index: 2002  2003  2004  2005  2006  2007  2008  2009  2010  2011  2012  2013  2014  <20152016  2017  2018  2019  2020  2021  2022 
ANJ, 16 Dec 2015 Valid HTML 4.01! · Home · News · About · Base · Modules · Extensions · Distributions · Download ·
· Search · EPICS V4 · IRMIS · Talk · Bugs · Documents · Links · Licensing ·