Argonne National Laboratory

Experimental Physics and
Industrial Control System

2002  2003  2004  2005  2006  2007  2008  2009  2010  2011  2012  2013  2014  2015  <20162017  2018  Index 2002  2003  2004  2005  2006  2007  2008  2009  2010  2011  2012  2013  2014  2015  <20162017  2018 
<== Date ==> <== Thread ==>

Subject: Build failed in Jenkins: epics-base-3.16-sol #48
From: APS Jenkins <aps-jenkins@anl.gov>
To: core-talk@aps.anl.gov
Date: Wed, 4 May 2016 19:00:11 -0500 (CDT)
See <https://jenkins.aps.anl.gov/job/epics-base-3.16-sol/48/changes>

Changes:

[Andrew Johnson] Merged Michael's cxxcleanup branch

------------------------------------------
[...truncated 827 lines...]
/opt/SUNWspro/bin/cc              -DUNIX  -DSOLARIS=10 -mt  -D__EXTENSIONS__  -xc99 -D_POSIX_C_SOURCE=200112L -xO4                -I. -I../O.Common -I. -I. -I.. -I../../../../include/compiler/solStudio -I../../../../include/os/solaris -I../../../../include         -c ../epicsSockResolveTest.c
/opt/SUNWspro/bin/CC -o epicsSockResolveTest  -L<https://jenkins.aps.anl.gov/job/epics-base-3.16-sol/ws/lib/solaris-sparc> -R<https://jenkins.aps.anl.gov/job/epics-base-3.16-sol/ws/lib/solaris-sparc>           -mt  -z ignore -z combreloc -z lazyload            epicsSockResolveTest.o    -lCom  -lsocket 
/opt/SUNWspro/bin/cc              -DUNIX  -DSOLARIS=10 -mt  -D__EXTENSIONS__  -xc99 -D_POSIX_C_SOURCE=200112L -xO4                -I. -I../O.Common -I. -I. -I.. -I../../../../include/compiler/solStudio -I../../../../include/os/solaris -I../../../../include         -c ../epicsStringTest.c
/opt/SUNWspro/bin/CC -o epicsStringTest  -L<https://jenkins.aps.anl.gov/job/epics-base-3.16-sol/ws/lib/solaris-sparc> -R<https://jenkins.aps.anl.gov/job/epics-base-3.16-sol/ws/lib/solaris-sparc>           -mt  -z ignore -z combreloc -z lazyload            epicsStringTest.o    -lCom   
/opt/SUNWspro/bin/CC              -DUNIX  -DSOLARIS=10 -mt  -D__EXTENSIONS__   -O   +w             -I. -I../O.Common -I. -I. -I.. -I../../../../include/compiler/solStudio -I../../../../include/os/solaris -I../../../../include         -c ../epicsTimeTest.cpp
/opt/SUNWspro/bin/CC -o epicsTimeTest  -L<https://jenkins.aps.anl.gov/job/epics-base-3.16-sol/ws/lib/solaris-sparc> -R<https://jenkins.aps.anl.gov/job/epics-base-3.16-sol/ws/lib/solaris-sparc>           -mt  -z ignore -z combreloc -z lazyload            epicsTimeTest.o    -lCom   
/opt/SUNWspro/bin/cc              -DUNIX  -DSOLARIS=10 -mt  -D__EXTENSIONS__  -xc99 -D_POSIX_C_SOURCE=200112L -xO4                -I. -I../O.Common -I. -I. -I.. -I../../../../include/compiler/solStudio -I../../../../include/os/solaris -I../../../../include         -c ../epicsTimeZoneTest.c
/opt/SUNWspro/bin/CC -o epicsTimeZoneTest  -L<https://jenkins.aps.anl.gov/job/epics-base-3.16-sol/ws/lib/solaris-sparc> -R<https://jenkins.aps.anl.gov/job/epics-base-3.16-sol/ws/lib/solaris-sparc>           -mt  -z ignore -z combreloc -z lazyload            epicsTimeZoneTest.o    -lCom   
/opt/SUNWspro/bin/CC              -DUNIX  -DSOLARIS=10 -mt  -D__EXTENSIONS__   -O   +w             -I. -I../O.Common -I. -I. -I.. -I../../../../include/compiler/solStudio -I../../../../include/os/solaris -I../../../../include         -c ../epicsThreadTest.cpp
/opt/SUNWspro/bin/CC -o epicsThreadTest  -L<https://jenkins.aps.anl.gov/job/epics-base-3.16-sol/ws/lib/solaris-sparc> -R<https://jenkins.aps.anl.gov/job/epics-base-3.16-sol/ws/lib/solaris-sparc>           -mt  -z ignore -z combreloc -z lazyload            epicsThreadTest.o    -lCom   
/opt/SUNWspro/bin/cc              -DUNIX  -DSOLARIS=10 -mt  -D__EXTENSIONS__  -xc99 -D_POSIX_C_SOURCE=200112L -xO4                -I. -I../O.Common -I. -I. -I.. -I../../../../include/compiler/solStudio -I../../../../include/os/solaris -I../../../../include         -c ../epicsThreadOnceTest.c
/opt/SUNWspro/bin/CC -o epicsThreadOnceTest  -L<https://jenkins.aps.anl.gov/job/epics-base-3.16-sol/ws/lib/solaris-sparc> -R<https://jenkins.aps.anl.gov/job/epics-base-3.16-sol/ws/lib/solaris-sparc>           -mt  -z ignore -z combreloc -z lazyload            epicsThreadOnceTest.o    -lCom   
/opt/SUNWspro/bin/CC              -DUNIX  -DSOLARIS=10 -mt  -D__EXTENSIONS__   -O   +w             -I. -I../O.Common -I. -I. -I.. -I../../../../include/compiler/solStudio -I../../../../include/os/solaris -I../../../../include         -c ../epicsThreadPriorityTest.cpp
/opt/SUNWspro/bin/CC -o epicsThreadPriorityTest  -L<https://jenkins.aps.anl.gov/job/epics-base-3.16-sol/ws/lib/solaris-sparc> -R<https://jenkins.aps.anl.gov/job/epics-base-3.16-sol/ws/lib/solaris-sparc>           -mt  -z ignore -z combreloc -z lazyload            epicsThreadPriorityTest.o    -lCom   
/opt/SUNWspro/bin/CC              -DUNIX  -DSOLARIS=10 -mt  -D__EXTENSIONS__   -O   +w             -I. -I../O.Common -I. -I. -I.. -I../../../../include/compiler/solStudio -I../../../../include/os/solaris -I../../../../include         -c ../epicsThreadPrivateTest.cpp
/opt/SUNWspro/bin/CC -o epicsThreadPrivateTest  -L<https://jenkins.aps.anl.gov/job/epics-base-3.16-sol/ws/lib/solaris-sparc> -R<https://jenkins.aps.anl.gov/job/epics-base-3.16-sol/ws/lib/solaris-sparc>           -mt  -z ignore -z combreloc -z lazyload            epicsThreadPrivateTest.o    -lCom   
/opt/SUNWspro/bin/cc              -DUNIX  -DSOLARIS=10 -mt  -D__EXTENSIONS__  -xc99 -D_POSIX_C_SOURCE=200112L -xO4                -I. -I../O.Common -I. -I. -I.. -I../../../../include/compiler/solStudio -I../../../../include/os/solaris -I../../../../include         -c ../epicsThreadHooksTest.c
/opt/SUNWspro/bin/CC -o epicsThreadHooksTest  -L<https://jenkins.aps.anl.gov/job/epics-base-3.16-sol/ws/lib/solaris-sparc> -R<https://jenkins.aps.anl.gov/job/epics-base-3.16-sol/ws/lib/solaris-sparc>           -mt  -z ignore -z combreloc -z lazyload            epicsThreadHooksTest.o    -lCom   
/opt/SUNWspro/bin/cc              -DUNIX  -DSOLARIS=10 -mt  -D__EXTENSIONS__  -xc99 -D_POSIX_C_SOURCE=200112L -xO4                -I. -I../O.Common -I. -I. -I.. -I../../../../include/compiler/solStudio -I../../../../include/os/solaris -I../../../../include         -c ../epicsThreadPoolTest.c
/opt/SUNWspro/bin/CC -o epicsThreadPoolTest  -L<https://jenkins.aps.anl.gov/job/epics-base-3.16-sol/ws/lib/solaris-sparc> -R<https://jenkins.aps.anl.gov/job/epics-base-3.16-sol/ws/lib/solaris-sparc>           -mt  -z ignore -z combreloc -z lazyload            epicsThreadPoolTest.o    -lCom   
/opt/SUNWspro/bin/cc              -DUNIX  -DSOLARIS=10 -mt  -D__EXTENSIONS__  -xc99 -D_POSIX_C_SOURCE=200112L -xO4                -I. -I../O.Common -I. -I. -I.. -I../../../../include/compiler/solStudio -I../../../../include/os/solaris -I../../../../include         -c ../epicsExitTest.c
/opt/SUNWspro/bin/CC -o epicsExitTest  -L<https://jenkins.aps.anl.gov/job/epics-base-3.16-sol/ws/lib/solaris-sparc> -R<https://jenkins.aps.anl.gov/job/epics-base-3.16-sol/ws/lib/solaris-sparc>           -mt  -z ignore -z combreloc -z lazyload            epicsExitTest.o    -lCom   
/opt/SUNWspro/bin/CC              -DUNIX  -DSOLARIS=10 -mt  -D__EXTENSIONS__   -O   +w             -I. -I../O.Common -I. -I. -I.. -I../../../../include/compiler/solStudio -I../../../../include/os/solaris -I../../../../include         -c ../epicsTimerTest.cpp
/opt/SUNWspro/bin/CC -o epicsTimerTest  -L<https://jenkins.aps.anl.gov/job/epics-base-3.16-sol/ws/lib/solaris-sparc> -R<https://jenkins.aps.anl.gov/job/epics-base-3.16-sol/ws/lib/solaris-sparc>           -mt  -z ignore -z combreloc -z lazyload            epicsTimerTest.o    -lCom   
/opt/SUNWspro/bin/cc              -DUNIX  -DSOLARIS=10 -mt  -D__EXTENSIONS__  -xc99 -D_POSIX_C_SOURCE=200112L -xO4                -I. -I../O.Common -I. -I. -I.. -I../../../../include/compiler/solStudio -I../../../../include/os/solaris -I../../../../include         -c ../ringPointerTest.c
/opt/SUNWspro/bin/CC -o ringPointerTest  -L<https://jenkins.aps.anl.gov/job/epics-base-3.16-sol/ws/lib/solaris-sparc> -R<https://jenkins.aps.anl.gov/job/epics-base-3.16-sol/ws/lib/solaris-sparc>           -mt  -z ignore -z combreloc -z lazyload            ringPointerTest.o    -lCom   
/opt/SUNWspro/bin/cc              -DUNIX  -DSOLARIS=10 -mt  -D__EXTENSIONS__  -xc99 -D_POSIX_C_SOURCE=200112L -xO4                -I. -I../O.Common -I. -I. -I.. -I../../../../include/compiler/solStudio -I../../../../include/os/solaris -I../../../../include         -c ../ringBytesTest.c
/opt/SUNWspro/bin/CC -o ringBytesTest  -L<https://jenkins.aps.anl.gov/job/epics-base-3.16-sol/ws/lib/solaris-sparc> -R<https://jenkins.aps.anl.gov/job/epics-base-3.16-sol/ws/lib/solaris-sparc>           -mt  -z ignore -z combreloc -z lazyload            ringBytesTest.o    -lCom   
/opt/SUNWspro/bin/CC              -DUNIX  -DSOLARIS=10 -mt  -D__EXTENSIONS__   -O   +w             -I. -I../O.Common -I. -I. -I.. -I../../../../include/compiler/solStudio -I../../../../include/os/solaris -I../../../../include         -c ../epicsEventTest.cpp
/opt/SUNWspro/bin/CC -o epicsEventTest  -L<https://jenkins.aps.anl.gov/job/epics-base-3.16-sol/ws/lib/solaris-sparc> -R<https://jenkins.aps.anl.gov/job/epics-base-3.16-sol/ws/lib/solaris-sparc>           -mt  -z ignore -z combreloc -z lazyload            epicsEventTest.o    -lCom   
/opt/SUNWspro/bin/CC              -DUNIX  -DSOLARIS=10 -mt  -D__EXTENSIONS__   -O   +w             -I. -I../O.Common -I. -I. -I.. -I../../../../include/compiler/solStudio -I../../../../include/os/solaris -I../../../../include         -c ../epicsMutexTest.cpp
/opt/SUNWspro/bin/CC -o epicsMutexTest  -L<https://jenkins.aps.anl.gov/job/epics-base-3.16-sol/ws/lib/solaris-sparc> -R<https://jenkins.aps.anl.gov/job/epics-base-3.16-sol/ws/lib/solaris-sparc>           -mt  -z ignore -z combreloc -z lazyload            epicsMutexTest.o    -lCom   
/opt/SUNWspro/bin/cc              -DUNIX  -DSOLARIS=10 -mt  -D__EXTENSIONS__  -xc99 -D_POSIX_C_SOURCE=200112L -xO4                -I. -I../O.Common -I. -I. -I.. -I../../../../include/compiler/solStudio -I../../../../include/os/solaris -I../../../../include         -c ../epicsSpinTest.c
/opt/SUNWspro/bin/CC -o epicsSpinTest  -L<https://jenkins.aps.anl.gov/job/epics-base-3.16-sol/ws/lib/solaris-sparc> -R<https://jenkins.aps.anl.gov/job/epics-base-3.16-sol/ws/lib/solaris-sparc>           -mt  -z ignore -z combreloc -z lazyload            epicsSpinTest.o    -lCom   
/opt/SUNWspro/bin/CC              -DUNIX  -DSOLARIS=10 -mt  -D__EXTENSIONS__   -O   +w             -I. -I../O.Common -I. -I. -I.. -I../../../../include/compiler/solStudio -I../../../../include/os/solaris -I../../../../include         -c ../epicsAtomicTest.cpp
"../epicsAtomicTest.cpp", line 150: Warning (Anachronism): Formal argument funptr of type extern "C" void(*)(void*) in call to epicsThreadMustCreate(const char*, unsigned, unsigned, extern "C" void(*)(void*), void*) is being passed void(*)(void*).
"../epicsAtomicTest.cpp", line 256:     Where: While instantiating "::testIncrDecr<int>()".
"../epicsAtomicTest.cpp", line 256:     Where: Instantiated from non-template code.
"../epicsAtomicTest.cpp", line 152: Warning (Anachronism): Formal argument funptr of type extern "C" void(*)(void*) in call to epicsThreadMustCreate(const char*, unsigned, unsigned, extern "C" void(*)(void*), void*) is being passed void(*)(void*).
"../epicsAtomicTest.cpp", line 256:     Where: While instantiating "::testIncrDecr<int>()".
"../epicsAtomicTest.cpp", line 256:     Where: Instantiated from non-template code.
"../epicsAtomicTest.cpp", line 150: Warning (Anachronism): Formal argument funptr of type extern "C" void(*)(void*) in call to epicsThreadMustCreate(const char*, unsigned, unsigned, extern "C" void(*)(void*), void*) is being passed void(*)(void*).
"../epicsAtomicTest.cpp", line 257:     Where: While instantiating "::testIncrDecr<unsigned>()".
"../epicsAtomicTest.cpp", line 257:     Where: Instantiated from non-template code.
"../epicsAtomicTest.cpp", line 152: Warning (Anachronism): Formal argument funptr of type extern "C" void(*)(void*) in call to epicsThreadMustCreate(const char*, unsigned, unsigned, extern "C" void(*)(void*), void*) is being passed void(*)(void*).
"../epicsAtomicTest.cpp", line 257:     Where: While instantiating "::testIncrDecr<unsigned>()".
"../epicsAtomicTest.cpp", line 257:     Where: Instantiated from non-template code.
"../epicsAtomicTest.cpp", line 187: Warning (Anachronism): Formal argument funptr of type extern "C" void(*)(void*) in call to epicsThreadMustCreate(const char*, unsigned, unsigned, extern "C" void(*)(void*), void*) is being passed void(*)(void*).
"../epicsAtomicTest.cpp", line 258:     Where: While instantiating "::testAddSub<int>()".
"../epicsAtomicTest.cpp", line 258:     Where: Instantiated from non-template code.
"../epicsAtomicTest.cpp", line 189: Warning (Anachronism): Formal argument funptr of type extern "C" void(*)(void*) in call to epicsThreadMustCreate(const char*, unsigned, unsigned, extern "C" void(*)(void*), void*) is being passed void(*)(void*).
"../epicsAtomicTest.cpp", line 258:     Where: While instantiating "::testAddSub<int>()".
"../epicsAtomicTest.cpp", line 258:     Where: Instantiated from non-template code.
"../epicsAtomicTest.cpp", line 187: Warning (Anachronism): Formal argument funptr of type extern "C" void(*)(void*) in call to epicsThreadMustCreate(const char*, unsigned, unsigned, extern "C" void(*)(void*), void*) is being passed void(*)(void*).
"../epicsAtomicTest.cpp", line 259:     Where: While instantiating "::testAddSub<unsigned>()".
"../epicsAtomicTest.cpp", line 259:     Where: Instantiated from non-template code.
"../epicsAtomicTest.cpp", line 189: Warning (Anachronism): Formal argument funptr of type extern "C" void(*)(void*) in call to epicsThreadMustCreate(const char*, unsigned, unsigned, extern "C" void(*)(void*), void*) is being passed void(*)(void*).
"../epicsAtomicTest.cpp", line 259:     Where: While instantiating "::testAddSub<unsigned>()".
"../epicsAtomicTest.cpp", line 259:     Where: Instantiated from non-template code.
"../epicsAtomicTest.cpp", line 225: Warning (Anachronism): Formal argument funptr of type extern "C" void(*)(void*) in call to epicsThreadMustCreate(const char*, unsigned, unsigned, extern "C" void(*)(void*), void*) is being passed void(*)(void*).
"../epicsAtomicTest.cpp", line 260:     Where: While instantiating "::testCAS<int>()".
"../epicsAtomicTest.cpp", line 260:     Where: Instantiated from non-template code.
"../epicsAtomicTest.cpp", line 225: Warning (Anachronism): Formal argument funptr of type extern "C" void(*)(void*) in call to epicsThreadMustCreate(const char*, unsigned, unsigned, extern "C" void(*)(void*), void*) is being passed void(*)(void*).
"../epicsAtomicTest.cpp", line 261:     Where: While instantiating "::testCAS<unsigned>()".
"../epicsAtomicTest.cpp", line 261:     Where: Instantiated from non-template code.
"../epicsAtomicTest.cpp", line 225: Warning (Anachronism): Formal argument funptr of type extern "C" void(*)(void*) in call to epicsThreadMustCreate(const char*, unsigned, unsigned, extern "C" void(*)(void*), void*) is being passed void(*)(void*).
"../epicsAtomicTest.cpp", line 262:     Where: While instantiating "::testCAS<void*>()".
"../epicsAtomicTest.cpp", line 262:     Where: Instantiated from non-template code.
"../epicsAtomicTest.cpp", line 55: Warning: Could not find source for::TestDataAddSub<int>::delta.
"../epicsAtomicTest.cpp", line 55: Warning: Could not find source for::TestDataAddSub<unsigned>::delta.
13 Warning(s) detected.
/opt/SUNWspro/bin/CC -o epicsAtomicTest  -L<https://jenkins.aps.anl.gov/job/epics-base-3.16-sol/ws/lib/solaris-sparc> -R<https://jenkins.aps.anl.gov/job/epics-base-3.16-sol/ws/lib/solaris-sparc>           -mt  -z ignore -z combreloc -z lazyload            epicsAtomicTest.o    -lCom   
/opt/SUNWspro/bin/CC              -DUNIX  -DSOLARIS=10 -mt  -D__EXTENSIONS__   -O   +w             -I. -I../O.Common -I. -I. -I.. -I../../../../include/compiler/solStudio -I../../../../include/os/solaris -I../../../../include         -c ../epicsExceptionTest.cpp
/opt/SUNWspro/bin/CC -o epicsExceptionTest  -L<https://jenkins.aps.anl.gov/job/epics-base-3.16-sol/ws/lib/solaris-sparc> -R<https://jenkins.aps.anl.gov/job/epics-base-3.16-sol/ws/lib/solaris-sparc>           -mt  -z ignore -z combreloc -z lazyload            epicsExceptionTest.o    -lCom   
/opt/SUNWspro/bin/cc              -DUNIX  -DSOLARIS=10 -mt  -D__EXTENSIONS__  -xc99 -D_POSIX_C_SOURCE=200112L -xO4                -I. -I../O.Common -I. -I. -I.. -I../../../../include/compiler/solStudio -I../../../../include/os/solaris -I../../../../include         -c ../macDefExpandTest.c
/opt/SUNWspro/bin/CC -o macDefExpandTest  -L<https://jenkins.aps.anl.gov/job/epics-base-3.16-sol/ws/lib/solaris-sparc> -R<https://jenkins.aps.anl.gov/job/epics-base-3.16-sol/ws/lib/solaris-sparc>           -mt  -z ignore -z combreloc -z lazyload            macDefExpandTest.o    -lCom   
/opt/SUNWspro/bin/cc              -DUNIX  -DSOLARIS=10 -mt  -D__EXTENSIONS__  -xc99 -D_POSIX_C_SOURCE=200112L -xO4                -I. -I../O.Common -I. -I. -I.. -I../../../../include/compiler/solStudio -I../../../../include/os/solaris -I../../../../include         -c ../macLibTest.c
/opt/SUNWspro/bin/CC -o macLibTest  -L<https://jenkins.aps.anl.gov/job/epics-base-3.16-sol/ws/lib/solaris-sparc> -R<https://jenkins.aps.anl.gov/job/epics-base-3.16-sol/ws/lib/solaris-sparc>           -mt  -z ignore -z combreloc -z lazyload            macLibTest.o    -lCom   
/opt/SUNWspro/bin/cc              -DUNIX  -DSOLARIS=10 -mt  -D__EXTENSIONS__  -xc99 -D_POSIX_C_SOURCE=200112L -xO4                -I. -I../O.Common -I. -I. -I.. -I../../../../include/compiler/solStudio -I../../../../include/os/solaris -I../../../../include         -c ../taskwdTest.c
/opt/SUNWspro/bin/CC -o taskwdTest  -L<https://jenkins.aps.anl.gov/job/epics-base-3.16-sol/ws/lib/solaris-sparc> -R<https://jenkins.aps.anl.gov/job/epics-base-3.16-sol/ws/lib/solaris-sparc>           -mt  -z ignore -z combreloc -z lazyload            taskwdTest.o    -lCom   
/opt/SUNWspro/bin/CC              -DUNIX  -DSOLARIS=10 -mt  -D__EXTENSIONS__   -O   +w             -I. -I../O.Common -I. -I. -I.. -I../../../../include/compiler/solStudio -I../../../../include/os/solaris -I../../../../include         -c ../blockingSockTest.cpp
/opt/SUNWspro/bin/CC -o blockingSockTest  -L<https://jenkins.aps.anl.gov/job/epics-base-3.16-sol/ws/lib/solaris-sparc> -R<https://jenkins.aps.anl.gov/job/epics-base-3.16-sol/ws/lib/solaris-sparc>           -mt  -z ignore -z combreloc -z lazyload            blockingSockTest.o    -lCom  -lsocket 
/opt/SUNWspro/bin/CC              -DUNIX  -DSOLARIS=10 -mt  -D__EXTENSIONS__   -O   +w             -I. -I../O.Common -I. -I. -I.. -I../../../../include/compiler/solStudio -I../../../../include/os/solaris -I../../../../include         -c ../epicsMessageQueueTest.cpp
/opt/SUNWspro/bin/CC -o epicsMessageQueueTest  -L<https://jenkins.aps.anl.gov/job/epics-base-3.16-sol/ws/lib/solaris-sparc> -R<https://jenkins.aps.anl.gov/job/epics-base-3.16-sol/ws/lib/solaris-sparc>           -mt  -z ignore -z combreloc -z lazyload            epicsMessageQueueTest.o    -lCom   
/opt/SUNWspro/bin/cc              -DUNIX  -DSOLARIS=10 -mt  -D__EXTENSIONS__  -xc99 -D_POSIX_C_SOURCE=200112L -xO4                -I. -I../O.Common -I. -I. -I.. -I../../../../include/compiler/solStudio -I../../../../include/os/solaris -I../../../../include         -c ../epicsStackTraceTest.c
/opt/SUNWspro/bin/CC -o epicsStackTraceTest  -L<https://jenkins.aps.anl.gov/job/epics-base-3.16-sol/ws/lib/solaris-sparc> -R<https://jenkins.aps.anl.gov/job/epics-base-3.16-sol/ws/lib/solaris-sparc>           -mt  -z ignore -z combreloc -z lazyload            epicsStackTraceTest.o    -lCom   
/opt/SUNWspro/bin/CC              -DUNIX  -DSOLARIS=10 -mt  -D__EXTENSIONS__   -O   +w             -I. -I../O.Common -I. -I. -I.. -I../../../../include/compiler/solStudio -I../../../../include/os/solaris -I../../../../include         -c ../epicsThreadPerform.cpp
/opt/SUNWspro/bin/CC -o epicsThreadPerform  -L<https://jenkins.aps.anl.gov/job/epics-base-3.16-sol/ws/lib/solaris-sparc> -R<https://jenkins.aps.anl.gov/job/epics-base-3.16-sol/ws/lib/solaris-sparc>           -mt  -z ignore -z combreloc -z lazyload            epicsThreadPerform.o    -lCom   
/opt/SUNWspro/bin/cc              -DUNIX  -DSOLARIS=10 -mt  -D__EXTENSIONS__  -xc99 -D_POSIX_C_SOURCE=200112L -xO4                -I. -I../O.Common -I. -I. -I.. -I../../../../include/compiler/solStudio -I../../../../include/os/solaris -I../../../../include         -c ../epicsMaxThreads.c
/opt/SUNWspro/bin/CC -o epicsMaxThreads  -L<https://jenkins.aps.anl.gov/job/epics-base-3.16-sol/ws/lib/solaris-sparc> -R<https://jenkins.aps.anl.gov/job/epics-base-3.16-sol/ws/lib/solaris-sparc>           -mt  -z ignore -z combreloc -z lazyload            epicsMaxThreads.o    -lCom   
/opt/SUNWspro/bin/cc              -DUNIX  -DSOLARIS=10 -mt  -D__EXTENSIONS__  -xc99 -D_POSIX_C_SOURCE=200112L -xO4                -I. -I../O.Common -I. -I. -I.. -I../../../../include/compiler/solStudio -I../../../../include/os/solaris -I../../../../include         -c ../buckTest.c
/opt/SUNWspro/bin/CC -o buckTest  -L<https://jenkins.aps.anl.gov/job/epics-base-3.16-sol/ws/lib/solaris-sparc> -R<https://jenkins.aps.anl.gov/job/epics-base-3.16-sol/ws/lib/solaris-sparc>           -mt  -z ignore -z combreloc -z lazyload            buckTest.o    -lCom   
/opt/SUNWspro/bin/CC              -DUNIX  -DSOLARIS=10 -mt  -D__EXTENSIONS__   -O   +w             -I. -I../O.Common -I. -I. -I.. -I../../../../include/compiler/solStudio -I../../../../include/os/solaris -I../../../../include         -c ../epicsAtomicPerform.cpp
/opt/SUNWspro/bin/CC -o epicsAtomicPerform  -L<https://jenkins.aps.anl.gov/job/epics-base-3.16-sol/ws/lib/solaris-sparc> -R<https://jenkins.aps.anl.gov/job/epics-base-3.16-sol/ws/lib/solaris-sparc>           -mt  -z ignore -z combreloc -z lazyload            epicsAtomicPerform.o    -lCom   
/opt/SUNWspro/bin/CC              -DUNIX  -DSOLARIS=10 -mt  -D__EXTENSIONS__   -O   +w             -I. -I../O.Common -I. -I. -I.. -I../../../../include/compiler/solStudio -I../../../../include/os/solaris -I../../../../include         -c ../cvtFastPerform.cpp
/opt/SUNWspro/bin/CC -o cvtFastPerform  -L<https://jenkins.aps.anl.gov/job/epics-base-3.16-sol/ws/lib/solaris-sparc> -R<https://jenkins.aps.anl.gov/job/epics-base-3.16-sol/ws/lib/solaris-sparc>           -mt  -z ignore -z combreloc -z lazyload            cvtFastPerform.o    -lCom   
cp ../epicsUnitTestTest.plt epicsUnitTestTest.t
perl -CSD <https://jenkins.aps.anl.gov/job/epics-base-3.16-sol/ws/bin/solaris-sparc/makeTestfile.pl> epicsTypesTest.t epicsTypesTest
perl -CSD <https://jenkins.aps.anl.gov/job/epics-base-3.16-sol/ws/bin/solaris-sparc/makeTestfile.pl> epicsInlineTest.t epicsInlineTest
perl -CSD <https://jenkins.aps.anl.gov/job/epics-base-3.16-sol/ws/bin/solaris-sparc/makeTestfile.pl> epicsCalcTest.t epicsCalcTest
perl -CSD <https://jenkins.aps.anl.gov/job/epics-base-3.16-sol/ws/bin/solaris-sparc/makeTestfile.pl> epicsAlgorithmTest.t epicsAlgorithmTest
perl -CSD <https://jenkins.aps.anl.gov/job/epics-base-3.16-sol/ws/bin/solaris-sparc/makeTestfile.pl> epicsMathTest.t epicsMathTest
perl -CSD <https://jenkins.aps.anl.gov/job/epics-base-3.16-sol/ws/bin/solaris-sparc/makeTestfile.pl> epicsMMIOTest.t epicsMMIOTest
perl -CSD <https://jenkins.aps.anl.gov/job/epics-base-3.16-sol/ws/bin/solaris-sparc/makeTestfile.pl> epicsEllTest.t epicsEllTest
perl -CSD <https://jenkins.aps.anl.gov/job/epics-base-3.16-sol/ws/bin/solaris-sparc/makeTestfile.pl> epicsEnvTest.t epicsEnvTest
perl -CSD <https://jenkins.aps.anl.gov/job/epics-base-3.16-sol/ws/bin/solaris-sparc/makeTestfile.pl> epicsErrlogTest.t epicsErrlogTest
perl -CSD <https://jenkins.aps.anl.gov/job/epics-base-3.16-sol/ws/bin/solaris-sparc/makeTestfile.pl> epicsStdioTest.t epicsStdioTest
perl -CSD <https://jenkins.aps.anl.gov/job/epics-base-3.16-sol/ws/bin/solaris-sparc/makeTestfile.pl> epicsStdlibTest.t epicsStdlibTest
perl -CSD <https://jenkins.aps.anl.gov/job/epics-base-3.16-sol/ws/bin/solaris-sparc/makeTestfile.pl> epicsSockResolveTest.t epicsSockResolveTest
perl -CSD <https://jenkins.aps.anl.gov/job/epics-base-3.16-sol/ws/bin/solaris-sparc/makeTestfile.pl> epicsStringTest.t epicsStringTest
perl -CSD <https://jenkins.aps.anl.gov/job/epics-base-3.16-sol/ws/bin/solaris-sparc/makeTestfile.pl> epicsTimeTest.t epicsTimeTest
perl -CSD <https://jenkins.aps.anl.gov/job/epics-base-3.16-sol/ws/bin/solaris-sparc/makeTestfile.pl> epicsTimeZoneTest.t epicsTimeZoneTest
perl -CSD <https://jenkins.aps.anl.gov/job/epics-base-3.16-sol/ws/bin/solaris-sparc/makeTestfile.pl> epicsThreadTest.t epicsThreadTest
perl -CSD <https://jenkins.aps.anl.gov/job/epics-base-3.16-sol/ws/bin/solaris-sparc/makeTestfile.pl> epicsThreadOnceTest.t epicsThreadOnceTest
perl -CSD <https://jenkins.aps.anl.gov/job/epics-base-3.16-sol/ws/bin/solaris-sparc/makeTestfile.pl> epicsThreadPriorityTest.t epicsThreadPriorityTest
perl -CSD <https://jenkins.aps.anl.gov/job/epics-base-3.16-sol/ws/bin/solaris-sparc/makeTestfile.pl> epicsThreadPrivateTest.t epicsThreadPrivateTest
perl -CSD <https://jenkins.aps.anl.gov/job/epics-base-3.16-sol/ws/bin/solaris-sparc/makeTestfile.pl> epicsThreadHooksTest.t epicsThreadHooksTest
perl -CSD <https://jenkins.aps.anl.gov/job/epics-base-3.16-sol/ws/bin/solaris-sparc/makeTestfile.pl> epicsThreadPoolTest.t epicsThreadPoolTest
perl -CSD <https://jenkins.aps.anl.gov/job/epics-base-3.16-sol/ws/bin/solaris-sparc/makeTestfile.pl> epicsExitTest.t epicsExitTest
perl -CSD <https://jenkins.aps.anl.gov/job/epics-base-3.16-sol/ws/bin/solaris-sparc/makeTestfile.pl> epicsTimerTest.t epicsTimerTest
perl -CSD <https://jenkins.aps.anl.gov/job/epics-base-3.16-sol/ws/bin/solaris-sparc/makeTestfile.pl> ringPointerTest.t ringPointerTest
perl -CSD <https://jenkins.aps.anl.gov/job/epics-base-3.16-sol/ws/bin/solaris-sparc/makeTestfile.pl> ringBytesTest.t ringBytesTest
perl -CSD <https://jenkins.aps.anl.gov/job/epics-base-3.16-sol/ws/bin/solaris-sparc/makeTestfile.pl> epicsEventTest.t epicsEventTest
perl -CSD <https://jenkins.aps.anl.gov/job/epics-base-3.16-sol/ws/bin/solaris-sparc/makeTestfile.pl> epicsMutexTest.t epicsMutexTest
perl -CSD <https://jenkins.aps.anl.gov/job/epics-base-3.16-sol/ws/bin/solaris-sparc/makeTestfile.pl> epicsSpinTest.t epicsSpinTest
perl -CSD <https://jenkins.aps.anl.gov/job/epics-base-3.16-sol/ws/bin/solaris-sparc/makeTestfile.pl> epicsAtomicTest.t epicsAtomicTest
perl -CSD <https://jenkins.aps.anl.gov/job/epics-base-3.16-sol/ws/bin/solaris-sparc/makeTestfile.pl> epicsExceptionTest.t epicsExceptionTest
perl -CSD <https://jenkins.aps.anl.gov/job/epics-base-3.16-sol/ws/bin/solaris-sparc/makeTestfile.pl> macDefExpandTest.t macDefExpandTest
perl -CSD <https://jenkins.aps.anl.gov/job/epics-base-3.16-sol/ws/bin/solaris-sparc/makeTestfile.pl> macLibTest.t macLibTest
perl -CSD <https://jenkins.aps.anl.gov/job/epics-base-3.16-sol/ws/bin/solaris-sparc/makeTestfile.pl> taskwdTest.t taskwdTest
perl -CSD <https://jenkins.aps.anl.gov/job/epics-base-3.16-sol/ws/bin/solaris-sparc/makeTestfile.pl> blockingSockTest.t blockingSockTest
perl -CSD <https://jenkins.aps.anl.gov/job/epics-base-3.16-sol/ws/bin/solaris-sparc/makeTestfile.pl> epicsMessageQueueTest.t epicsMessageQueueTest
perl -CSD <https://jenkins.aps.anl.gov/job/epics-base-3.16-sol/ws/bin/solaris-sparc/makeTestfile.pl> epicsStackTraceTest.t epicsStackTraceTest
make[3]: Leaving directory '<https://jenkins.aps.anl.gov/job/epics-base-3.16-sol/ws/src/libCom/test/O.solaris-sparc'>
make[2]: Leaving directory '<https://jenkins.aps.anl.gov/job/epics-base-3.16-sol/ws/src/libCom/test'>
make -C ca/client install.solaris-sparc 
make[2]: Entering directory '<https://jenkins.aps.anl.gov/job/epics-base-3.16-sol/ws/src/ca/client'>
perl -CSD <https://jenkins.aps.anl.gov/job/epics-base-3.16-sol/ws/bin/solaris-sparc/makeMakefile.pl> O.solaris-sparc ../../../..
mkdir -p O.Common
make -C O.solaris-sparc -f ../Makefile TOP=../../../.. \
    T_A=solaris-sparc install
make[3]: Entering directory '<https://jenkins.aps.anl.gov/job/epics-base-3.16-sol/ws/src/ca/client/O.solaris-sparc'>
/opt/SUNWspro/bin/cc              -DUNIX  -DSOLARIS=10 -mt  -D__EXTENSIONS__  -xc99 -D_POSIX_C_SOURCE=200112L -xO4                -I. -I../O.Common -I. -I. -I.. -I../../../../src/ca/client/test -I../../../../include/compiler/solStudio -I../../../../include/os/solaris -I../../../../include         -xM1 > ca_test.d  ../../../../src/ca/client/test/ca_test.c
/opt/SUNWspro/bin/cc              -DUNIX  -DSOLARIS=10 -mt  -D__EXTENSIONS__  -xc99 -D_POSIX_C_SOURCE=200112L -xO4                -I. -I../O.Common -I. -I. -I.. -I../../../../src/ca/client/test -I../../../../include/compiler/solStudio -I../../../../include/os/solaris -I../../../../include         -xM1 > ca_test_main.d  ../../../../src/ca/client/test/ca_test_main.c
/opt/SUNWspro/bin/CC              -DUNIX  -DSOLARIS=10 -mt  -D__EXTENSIONS__   -O   +w             -I. -I../O.Common -I. -I. -I.. -I../../../../src/ca/client/test -I../../../../include/compiler/solStudio -I../../../../include/os/solaris -I../../../../include         -xM1 > caEventRate.d  ../caEventRate.cpp
/opt/SUNWspro/bin/CC              -DUNIX  -DSOLARIS=10 -mt  -D__EXTENSIONS__   -O   +w             -I. -I../O.Common -I. -I. -I.. -I../../../../src/ca/client/test -I../../../../include/compiler/solStudio -I../../../../include/os/solaris -I../../../../include         -xM1 > caEventRateMain.d  ../caEventRateMain.cpp
/opt/SUNWspro/bin/CC              -DUNIX  -DSOLARIS=10 -mt  -D__EXTENSIONS__   -O   +w             -I. -I../O.Common -I. -I. -I.. -I../../../../src/ca/client/test -I../../../../include/compiler/solStudio -I../../../../include/os/solaris -I../../../../include         -xM1 > casw.d  ../casw.cpp
/opt/SUNWspro/bin/CC              -DUNIX  -DSOLARIS=10 -mt  -D__EXTENSIONS__   -O   +w             -I. -I../O.Common -I. -I. -I.. -I../../../../src/ca/client/test -I../../../../include/compiler/solStudio -I../../../../include/os/solaris -I../../../../include         -xM1 > caConnTest.d  ../caConnTest.cpp
/opt/SUNWspro/bin/CC              -DUNIX  -DSOLARIS=10 -mt  -D__EXTENSIONS__   -O   +w             -I. -I../O.Common -I. -I. -I.. -I../../../../src/ca/client/test -I../../../../include/compiler/solStudio -I../../../../include/os/solaris -I../../../../include         -xM1 > caConnTestMain.d  ../caConnTestMain.cpp
/opt/SUNWspro/bin/cc              -DUNIX  -DSOLARIS=10 -mt  -D__EXTENSIONS__  -xc99 -D_POSIX_C_SOURCE=200112L -xO4                -I. -I../O.Common -I. -I. -I.. -I../../../../src/ca/client/test -I../../../../include/compiler/solStudio -I../../../../include/os/solaris -I../../../../include         -xM1 > acctst.d  ../acctst.c
/opt/SUNWspro/bin/cc              -DUNIX  -DSOLARIS=10 -mt  -D__EXTENSIONS__  -xc99 -D_POSIX_C_SOURCE=200112L -xO4                -I. -I../O.Common -I. -I. -I.. -I../../../../src/ca/client/test -I../../../../include/compiler/solStudio -I../../../../include/os/solaris -I../../../../include         -xM1 > acctstMain.d  ../acctstMain.c
/opt/SUNWspro/bin/cc              -DUNIX  -DSOLARIS=10 -mt  -D__EXTENSIONS__  -xc99 -D_POSIX_C_SOURCE=200112L -xO4                -I. -I../O.Common -I. -I. -I.. -I../../../../src/ca/client/test -I../../../../include/compiler/solStudio -I../../../../include/os/solaris -I../../../../include         -xM1 > catime.d  ../catime.c
/opt/SUNWspro/bin/cc              -DUNIX  -DSOLARIS=10 -mt  -D__EXTENSIONS__  -xc99 -D_POSIX_C_SOURCE=200112L -xO4                -I. -I../O.Common -I. -I. -I.. -I../../../../src/ca/client/test -I../../../../include/compiler/solStudio -I../../../../include/os/solaris -I../../../../include         -xM1 > catimeMain.d  ../catimeMain.c
/opt/SUNWspro/bin/CC              -DUNIX  -DSOLARIS=10 -mt  -D__EXTENSIONS__   -O   +w             -I. -I../O.Common -I. -I. -I.. -I../../../../src/ca/client/test -I../../../../include/compiler/solStudio -I../../../../include/os/solaris -I../../../../include         -xM1 > caRepeater.d  ../caRepeater.cpp
/opt/SUNWspro/bin/CC              -DUNIX  -DSOLARIS=10 -mt  -D__EXTENSIONS__   -O   +w            -xcode=pic32 -I. -I../O.Common -I. -I. -I.. -I../../../../src/ca/client/test -I../../../../include/compiler/solStudio -I../../../../include/os/solaris -I../../../../include         -xM1 > msgForMultiplyDefinedPV.d  ../msgForMultiplyDefinedPV.cpp
/opt/SUNWspro/bin/CC              -DUNIX  -DSOLARIS=10 -mt  -D__EXTENSIONS__   -O   +w            -xcode=pic32 -I. -I../O.Common -I. -I. -I.. -I../../../../src/ca/client/test -I../../../../include/compiler/solStudio -I../../../../include/os/solaris -I../../../../include         -xM1 > hostNameCache.d  ../hostNameCache.cpp
/opt/SUNWspro/bin/CC              -DUNIX  -DSOLARIS=10 -mt  -D__EXTENSIONS__   -O   +w            -xcode=pic32 -I. -I../O.Common -I. -I. -I.. -I../../../../src/ca/client/test -I../../../../include/compiler/solStudio -I../../../../include/os/solaris -I../../../../include         -xM1 > comBuf.d  ../comBuf.cpp
/opt/SUNWspro/bin/CC              -DUNIX  -DSOLARIS=10 -mt  -D__EXTENSIONS__   -O   +w            -xcode=pic32 -I. -I../O.Common -I. -I. -I.. -I../../../../src/ca/client/test -I../../../../include/compiler/solStudio -I../../../../include/os/solaris -I../../../../include         -xM1 > comQueSend.d  ../comQueSend.cpp
/opt/SUNWspro/bin/CC              -DUNIX  -DSOLARIS=10 -mt  -D__EXTENSIONS__   -O   +w            -xcode=pic32 -I. -I../O.Common -I. -I. -I.. -I../../../../src/ca/client/test -I../../../../include/compiler/solStudio -I../../../../include/os/solaris -I../../../../include         -xM1 > comQueRecv.d  ../comQueRecv.cpp
/opt/SUNWspro/bin/CC              -DUNIX  -DSOLARIS=10 -mt  -D__EXTENSIONS__   -O   +w            -xcode=pic32 -I. -I../O.Common -I. -I. -I.. -I../../../../src/ca/client/test -I../../../../include/compiler/solStudio -I../../../../include/os/solaris -I../../../../include         -xM1 > localHostName.d  ../localHostName.cpp
/opt/SUNWspro/bin/CC              -DUNIX  -DSOLARIS=10 -mt  -D__EXTENSIONS__   -O   +w            -xcode=pic32 -I. -I../O.Common -I. -I. -I.. -I../../../../src/ca/client/test -I../../../../include/compiler/solStudio -I../../../../include/os/solaris -I../../../../include         -xM1 > syncGroupWriteNotify.d  ../syncGroupWriteNotify.cpp
/opt/SUNWspro/bin/CC              -DUNIX  -DSOLARIS=10 -mt  -D__EXTENSIONS__   -O   +w            -xcode=pic32 -I. -I../O.Common -I. -I. -I.. -I../../../../src/ca/client/test -I../../../../include/compiler/solStudio -I../../../../include/os/solaris -I../../../../include         -xM1 > syncGroupReadNotify.d  ../syncGroupReadNotify.cpp
/opt/SUNWspro/bin/CC              -DUNIX  -DSOLARIS=10 -mt  -D__EXTENSIONS__   -O   +w            -xcode=pic32 -I. -I../O.Common -I. -I. -I.. -I../../../../src/ca/client/test -I../../../../include/compiler/solStudio -I../../../../include/os/solaris -I../../../../include         -xM1 > syncGroupNotify.d  ../syncGroupNotify.cpp
/opt/SUNWspro/bin/CC              -DUNIX  -DSOLARIS=10 -mt  -D__EXTENSIONS__   -O   +w            -xcode=pic32 -I. -I../O.Common -I. -I. -I.. -I../../../../src/ca/client/test -I../../../../include/compiler/solStudio -I../../../../include/os/solaris -I../../../../include         -xM1 > CASG.d  ../CASG.cpp
/opt/SUNWspro/bin/CC              -DUNIX  -DSOLARIS=10 -mt  -D__EXTENSIONS__   -O   +w            -xcode=pic32 -I. -I../O.Common -I. -I. -I.. -I../../../../src/ca/client/test -I../../../../include/compiler/solStudio -I../../../../include/os/solaris -I../../../../include         -xM1 > syncgrp.d  ../syncgrp.cpp
/opt/SUNWspro/bin/CC              -DUNIX  -DSOLARIS=10 -mt  -D__EXTENSIONS__   -O   +w            -xcode=pic32 -I. -I../O.Common -I. -I. -I.. -I../../../../src/ca/client/test -I../../../../include/compiler/solStudio -I../../../../include/os/solaris -I../../../../include         -xM1 > putCallback.d  ../putCallback.cpp
/opt/SUNWspro/bin/CC              -DUNIX  -DSOLARIS=10 -mt  -D__EXTENSIONS__   -O   +w            -xcode=pic32 -I. -I../O.Common -I. -I. -I.. -I../../../../src/ca/client/test -I../../../../include/compiler/solStudio -I../../../../include/os/solaris -I../../../../include         -xM1 > getCopy.d  ../getCopy.cpp
/opt/SUNWspro/bin/CC              -DUNIX  -DSOLARIS=10 -mt  -D__EXTENSIONS__   -O   +w            -xcode=pic32 -I. -I../O.Common -I. -I. -I.. -I../../../../src/ca/client/test -I../../../../include/compiler/solStudio -I../../../../include/os/solaris -I../../../../include         -xM1 > getCallback.d  ../getCallback.cpp
/opt/SUNWspro/bin/CC              -DUNIX  -DSOLARIS=10 -mt  -D__EXTENSIONS__   -O   +w            -xcode=pic32 -I. -I../O.Common -I. -I. -I.. -I../../../../src/ca/client/test -I../../../../include/compiler/solStudio -I../../../../include/os/solaris -I../../../../include         -xM1 > oldSubscription.d  ../oldSubscription.cpp
/opt/SUNWspro/bin/CC              -DUNIX  -DSOLARIS=10 -mt  -D__EXTENSIONS__   -O   +w            -xcode=pic32 -I. -I../O.Common -I. -I. -I.. -I../../../../src/ca/client/test -I../../../../include/compiler/solStudio -I../../../../include/os/solaris -I../../../../include         -xM1 > oldChannelNotify.d  ../oldChannelNotify.cpp
/opt/SUNWspro/bin/CC              -DUNIX  -DSOLARIS=10 -mt  -D__EXTENSIONS__   -O   +w            -xcode=pic32 -I. -I../O.Common -I. -I. -I.. -I../../../../src/ca/client/test -I../../../../include/compiler/solStudio -I../../../../include/os/solaris -I../../../../include         -xM1 > ca_client_context.d  ../ca_client_context.cpp
/opt/SUNWspro/bin/CC              -DUNIX  -DSOLARIS=10 -mt  -D__EXTENSIONS__   -O   +w            -xcode=pic32 -I. -I../O.Common -I. -I. -I.. -I../../../../src/ca/client/test -I../../../../include/compiler/solStudio -I../../../../include/os/solaris -I../../../../include         -xM1 > bhe.d  ../bhe.cpp
/opt/SUNWspro/bin/CC              -DUNIX  -DSOLARIS=10 -mt  -D__EXTENSIONS__   -O   +w            -xcode=pic32 -I. -I../O.Common -I. -I. -I.. -I../../../../src/ca/client/test -I../../../../include/compiler/solStudio -I../../../../include/os/solaris -I../../../../include         -xM1 > tcpRecvWatchdog.d  ../tcpRecvWatchdog.cpp
/opt/SUNWspro/bin/CC              -DUNIX  -DSOLARIS=10 -mt  -D__EXTENSIONS__   -O   +w            -xcode=pic32 -I. -I../O.Common -I. -I. -I.. -I../../../../src/ca/client/test -I../../../../include/compiler/solStudio -I../../../../include/os/solaris -I../../../../include         -xM1 > tcpSendWatchdog.d  ../tcpSendWatchdog.cpp
/opt/SUNWspro/bin/CC              -DUNIX  -DSOLARIS=10 -mt  -D__EXTENSIONS__   -O   +w            -xcode=pic32 -I. -I../O.Common -I. -I. -I.. -I../../../../src/ca/client/test -I../../../../include/compiler/solStudio -I../../../../include/os/solaris -I../../../../include         -xM1 > netSubscription.d  ../netSubscription.cpp
/opt/SUNWspro/bin/CC              -DUNIX  -DSOLARIS=10 -mt  -D__EXTENSIONS__   -O   +w            -xcode=pic32 -I. -I../O.Common -I. -I. -I.. -I../../../../src/ca/client/test -I../../../../include/compiler/solStudio -I../../../../include/os/solaris -I../../../../include         -xM1 > netWriteNotifyIO.d  ../netWriteNotifyIO.cpp
/opt/SUNWspro/bin/CC              -DUNIX  -DSOLARIS=10 -mt  -D__EXTENSIONS__   -O   +w            -xcode=pic32 -I. -I../O.Common -I. -I. -I.. -I../../../../src/ca/client/test -I../../../../include/compiler/solStudio -I../../../../include/os/solaris -I../../../../include         -xM1 > netReadNotifyIO.d  ../netReadNotifyIO.cpp
/opt/SUNWspro/bin/CC              -DUNIX  -DSOLARIS=10 -mt  -D__EXTENSIONS__   -O   +w            -xcode=pic32 -I. -I../O.Common -I. -I. -I.. -I../../../../src/ca/client/test -I../../../../include/compiler/solStudio -I../../../../include/os/solaris -I../../../../include         -xM1 > noopiiu.d  ../noopiiu.cpp
/opt/SUNWspro/bin/CC              -DUNIX  -DSOLARIS=10 -mt  -D__EXTENSIONS__   -O   +w            -xcode=pic32 -I. -I../O.Common -I. -I. -I.. -I../../../../src/ca/client/test -I../../../../include/compiler/solStudio -I../../../../include/os/solaris -I../../../../include         -xM1 > tcpiiu.d  ../tcpiiu.cpp
/opt/SUNWspro/bin/CC              -DUNIX  -DSOLARIS=10 -mt  -D__EXTENSIONS__   -O   +w            -xcode=pic32 -I. -I../O.Common -I. -I. -I.. -I../../../../src/ca/client/test -I../../../../include/compiler/solStudio -I../../../../include/os/solaris -I../../../../include         -xM1 > udpiiu.d  ../udpiiu.cpp
/opt/SUNWspro/bin/CC              -DUNIX  -DSOLARIS=10 -mt  -D__EXTENSIONS__   -O   +w            -xcode=pic32 -I. -I../O.Common -I. -I. -I.. -I../../../../src/ca/client/test -I../../../../include/compiler/solStudio -I../../../../include/os/solaris -I../../../../include         -xM1 > netiiu.d  ../netiiu.cpp
/opt/SUNWspro/bin/CC              -DUNIX  -DSOLARIS=10 -mt  -D__EXTENSIONS__   -O   +w            -xcode=pic32 -I. -I../O.Common -I. -I. -I.. -I../../../../src/ca/client/test -I../../../../include/compiler/solStudio -I../../../../include/os/solaris -I../../../../include         -xM1 > nciu.d  ../nciu.cpp
/opt/SUNWspro/bin/CC              -DUNIX  -DSOLARIS=10 -mt  -D__EXTENSIONS__   -O   +w            -xcode=pic32 -I. -I../O.Common -I. -I. -I.. -I../../../../src/ca/client/test -I../../../../include/compiler/solStudio -I../../../../include/os/solaris -I../../../../include         -xM1 > baseNMIU.d  ../baseNMIU.cpp
/opt/SUNWspro/bin/CC              -DUNIX  -DSOLARIS=10 -mt  -D__EXTENSIONS__   -O   +w            -xcode=pic32 -I. -I../O.Common -I. -I. -I.. -I../../../../src/ca/client/test -I../../../../include/compiler/solStudio -I../../../../include/os/solaris -I../../../../include         -xM1 > repeaterSubscribeTimer.d  ../repeaterSubscribeTimer.cpp
/opt/SUNWspro/bin/CC              -DUNIX  -DSOLARIS=10 -mt  -D__EXTENSIONS__   -O   +w            -xcode=pic32 -I. -I../O.Common -I. -I. -I.. -I../../../../src/ca/client/test -I../../../../include/compiler/solStudio -I../../../../include/os/solaris -I../../../../include         -xM1 > disconnectGovernorTimer.d  ../disconnectGovernorTimer.cpp
/opt/SUNWspro/bin/CC              -DUNIX  -DSOLARIS=10 -mt  -D__EXTENSIONS__   -O   +w            -xcode=pic32 -I. -I../O.Common -I. -I. -I.. -I../../../../src/ca/client/test -I../../../../include/compiler/solStudio -I../../../../include/os/solaris -I../../../../include         -xM1 > searchTimer.d  ../searchTimer.cpp
/opt/SUNWspro/bin/CC              -DUNIX  -DSOLARIS=10 -mt  -D__EXTENSIONS__   -O   +w            -xcode=pic32 -I. -I../O.Common -I. -I. -I.. -I../../../../src/ca/client/test -I../../../../include/compiler/solStudio -I../../../../include/os/solaris -I../../../../include         -xM1 > repeater.d  ../repeater.cpp
/opt/SUNWspro/bin/CC              -DUNIX  -DSOLARIS=10 -mt  -D__EXTENSIONS__   -O   +w            -xcode=pic32 -I. -I../O.Common -I. -I. -I.. -I../../../../src/ca/client/test -I../../../../include/compiler/solStudio -I../../../../include/os/solaris -I../../../../include         -xM1 > test_event.d  ../test_event.cpp
/opt/SUNWspro/bin/CC              -DUNIX  -DSOLARIS=10 -mt  -D__EXTENSIONS__   -O   +w            -xcode=pic32 -I. -I../O.Common -I. -I. -I.. -I../../../../src/ca/client/test -I../../../../include/compiler/solStudio -I../../../../include/os/solaris -I../../../../include         -xM1 > convert.d  ../convert.cpp
/opt/SUNWspro/bin/CC              -DUNIX  -DSOLARIS=10 -mt  -D__EXTENSIONS__   -O   +w            -xcode=pic32 -I. -I../O.Common -I. -I. -I.. -I../../../../src/ca/client/test -I../../../../include/compiler/solStudio -I../../../../include/os/solaris -I../../../../include         -xM1 > iocinf.d  ../iocinf.cpp
/opt/SUNWspro/bin/CC              -DUNIX  -DSOLARIS=10 -mt  -D__EXTENSIONS__   -O   +w            -xcode=pic32 -I. -I../O.Common -I. -I. -I.. -I../../../../src/ca/client/test -I../../../../include/compiler/solStudio -I../../../../include/os/solaris -I../../../../include         -xM1 > access.d  ../access.cpp
/opt/SUNWspro/bin/CC              -DUNIX  -DSOLARIS=10 -mt  -D__EXTENSIONS__   -O   +w            -xcode=pic32 -I. -I../O.Common -I. -I. -I.. -I../../../../src/ca/client/test -I../../../../include/compiler/solStudio -I../../../../include/os/solaris -I../../../../include         -xM1 > cacStateNotify.d  ../cacStateNotify.cpp
/opt/SUNWspro/bin/CC              -DUNIX  -DSOLARIS=10 -mt  -D__EXTENSIONS__   -O   +w            -xcode=pic32 -I. -I../O.Common -I. -I. -I.. -I../../../../src/ca/client/test -I../../../../include/compiler/solStudio -I../../../../include/os/solaris -I../../../../include         -xM1 > cacWriteNotify.d  ../cacWriteNotify.cpp
/opt/SUNWspro/bin/CC              -DUNIX  -DSOLARIS=10 -mt  -D__EXTENSIONS__   -O   +w            -xcode=pic32 -I. -I../O.Common -I. -I. -I.. -I../../../../src/ca/client/test -I../../../../include/compiler/solStudio -I../../../../include/os/solaris -I../../../../include         -xM1 > cacReadNotify.d  ../cacReadNotify.cpp
/opt/SUNWspro/bin/CC              -DUNIX  -DSOLARIS=10 -mt  -D__EXTENSIONS__   -O   +w            -xcode=pic32 -I. -I../O.Common -I. -I. -I.. -I../../../../src/ca/client/test -I../../../../include/compiler/solStudio -I../../../../include/os/solaris -I../../../../include         -xM1 > cacContextNotify.d  ../cacContextNotify.cpp
/opt/SUNWspro/bin/CC              -DUNIX  -DSOLARIS=10 -mt  -D__EXTENSIONS__   -O   +w            -xcode=pic32 -I. -I../O.Common -I. -I. -I.. -I../../../../src/ca/client/test -I../../../../include/compiler/solStudio -I../../../../include/os/solaris -I../../../../include         -xM1 > cacChannelNotify.d  ../cacChannelNotify.cpp
/opt/SUNWspro/bin/CC              -DUNIX  -DSOLARIS=10 -mt  -D__EXTENSIONS__   -O   +w            -xcode=pic32 -I. -I../O.Common -I. -I. -I.. -I../../../../src/ca/client/test -I../../../../include/compiler/solStudio -I../../../../include/os/solaris -I../../../../include         -xM1 > cacChannel.d  ../cacChannel.cpp
/opt/SUNWspro/bin/CC              -DUNIX  -DSOLARIS=10 -mt  -D__EXTENSIONS__   -O   +w            -xcode=pic32 -I. -I../O.Common -I. -I. -I.. -I../../../../src/ca/client/test -I../../../../include/compiler/solStudio -I../../../../include/os/solaris -I../../../../include         -xM1 > cac.d  ../cac.cpp
Installing generic include file ../../../../include/cadef.h
Installing generic include file ../../../../include/caerr.h
Installing generic include file ../../../../include/caeventmask.h
Installing generic include file ../../../../include/caProto.h
Installing generic include file ../../../../include/db_access.h
Installing generic include file ../../../../include/addrList.h
Installing generic include file ../../../../include/cacIO.h
Installing generic include file ../../../../include/caDiagnostics.h
/opt/SUNWspro/bin/CC              -DUNIX  -DSOLARIS=10 -mt  -D__EXTENSIONS__   -O   +w            -xcode=pic32 -I. -I../O.Common -I. -I. -I.. -I../../../../src/ca/client/test -I../../../../include/compiler/solStudio -I../../../../include/os/solaris -I../../../../include         -c ../cac.cpp
/opt/SUNWspro/bin/CC              -DUNIX  -DSOLARIS=10 -mt  -D__EXTENSIONS__   -O   +w            -xcode=pic32 -I. -I../O.Common -I. -I. -I.. -I../../../../src/ca/client/test -I../../../../include/compiler/solStudio -I../../../../include/os/solaris -I../../../../include         -c ../cacChannel.cpp
/opt/SUNWspro/bin/CC              -DUNIX  -DSOLARIS=10 -mt  -D__EXTENSIONS__   -O   +w            -xcode=pic32 -I. -I../O.Common -I. -I. -I.. -I../../../../src/ca/client/test -I../../../../include/compiler/solStudio -I../../../../include/os/solaris -I../../../../include         -c ../cacChannelNotify.cpp
/opt/SUNWspro/bin/CC              -DUNIX  -DSOLARIS=10 -mt  -D__EXTENSIONS__   -O   +w            -xcode=pic32 -I. -I../O.Common -I. -I. -I.. -I../../../../src/ca/client/test -I../../../../include/compiler/solStudio -I../../../../include/os/solaris -I../../../../include         -c ../cacContextNotify.cpp
/opt/SUNWspro/bin/CC              -DUNIX  -DSOLARIS=10 -mt  -D__EXTENSIONS__   -O   +w            -xcode=pic32 -I. -I../O.Common -I. -I. -I.. -I../../../../src/ca/client/test -I../../../../include/compiler/solStudio -I../../../../include/os/solaris -I../../../../include         -c ../cacReadNotify.cpp
/opt/SUNWspro/bin/CC              -DUNIX  -DSOLARIS=10 -mt  -D__EXTENSIONS__   -O   +w            -xcode=pic32 -I. -I../O.Common -I. -I. -I.. -I../../../../src/ca/client/test -I../../../../include/compiler/solStudio -I../../../../include/os/solaris -I../../../../include         -c ../cacWriteNotify.cpp
/opt/SUNWspro/bin/CC              -DUNIX  -DSOLARIS=10 -mt  -D__EXTENSIONS__   -O   +w            -xcode=pic32 -I. -I../O.Common -I. -I. -I.. -I../../../../src/ca/client/test -I../../../../include/compiler/solStudio -I../../../../include/os/solaris -I../../../../include         -c ../cacStateNotify.cpp
/opt/SUNWspro/bin/CC              -DUNIX  -DSOLARIS=10 -mt  -D__EXTENSIONS__   -O   +w            -xcode=pic32 -I. -I../O.Common -I. -I. -I.. -I../../../../src/ca/client/test -I../../../../include/compiler/solStudio -I../../../../include/os/solaris -I../../../../include         -c ../access.cpp
/opt/SUNWspro/bin/CC              -DUNIX  -DSOLARIS=10 -mt  -D__EXTENSIONS__   -O   +w            -xcode=pic32 -I. -I../O.Common -I. -I. -I.. -I../../../../src/ca/client/test -I../../../../include/compiler/solStudio -I../../../../include/os/solaris -I../../../../include         -c ../iocinf.cpp
/opt/SUNWspro/bin/CC              -DUNIX  -DSOLARIS=10 -mt  -D__EXTENSIONS__   -O   +w            -xcode=pic32 -I. -I../O.Common -I. -I. -I.. -I../../../../src/ca/client/test -I../../../../include/compiler/solStudio -I../../../../include/os/solaris -I../../../../include         -c ../convert.cpp
/opt/SUNWspro/bin/CC              -DUNIX  -DSOLARIS=10 -mt  -D__EXTENSIONS__   -O   +w            -xcode=pic32 -I. -I../O.Common -I. -I. -I.. -I../../../../src/ca/client/test -I../../../../include/compiler/solStudio -I../../../../include/os/solaris -I../../../../include         -c ../test_event.cpp
/opt/SUNWspro/bin/CC              -DUNIX  -DSOLARIS=10 -mt  -D__EXTENSIONS__   -O   +w            -xcode=pic32 -I. -I../O.Common -I. -I. -I.. -I../../../../src/ca/client/test -I../../../../include/compiler/solStudio -I../../../../include/os/solaris -I../../../../include         -c ../repeater.cpp
/opt/SUNWspro/bin/CC              -DUNIX  -DSOLARIS=10 -mt  -D__EXTENSIONS__   -O   +w            -xcode=pic32 -I. -I../O.Common -I. -I. -I.. -I../../../../src/ca/client/test -I../../../../include/compiler/solStudio -I../../../../include/os/solaris -I../../../../include         -c ../searchTimer.cpp
/opt/SUNWspro/bin/CC              -DUNIX  -DSOLARIS=10 -mt  -D__EXTENSIONS__   -O   +w            -xcode=pic32 -I. -I../O.Common -I. -I. -I.. -I../../../../src/ca/client/test -I../../../../include/compiler/solStudio -I../../../../include/os/solaris -I../../../../include         -c ../disconnectGovernorTimer.cpp
/opt/SUNWspro/bin/CC              -DUNIX  -DSOLARIS=10 -mt  -D__EXTENSIONS__   -O   +w            -xcode=pic32 -I. -I../O.Common -I. -I. -I.. -I../../../../src/ca/client/test -I../../../../include/compiler/solStudio -I../../../../include/os/solaris -I../../../../include         -c ../repeaterSubscribeTimer.cpp
/opt/SUNWspro/bin/CC              -DUNIX  -DSOLARIS=10 -mt  -D__EXTENSIONS__   -O   +w            -xcode=pic32 -I. -I../O.Common -I. -I. -I.. -I../../../../src/ca/client/test -I../../../../include/compiler/solStudio -I../../../../include/os/solaris -I../../../../include         -c ../baseNMIU.cpp
/opt/SUNWspro/bin/CC              -DUNIX  -DSOLARIS=10 -mt  -D__EXTENSIONS__   -O   +w            -xcode=pic32 -I. -I../O.Common -I. -I. -I.. -I../../../../src/ca/client/test -I../../../../include/compiler/solStudio -I../../../../include/os/solaris -I../../../../include         -c ../nciu.cpp
/opt/SUNWspro/bin/CC              -DUNIX  -DSOLARIS=10 -mt  -D__EXTENSIONS__   -O   +w            -xcode=pic32 -I. -I../O.Common -I. -I. -I.. -I../../../../src/ca/client/test -I../../../../include/compiler/solStudio -I../../../../include/os/solaris -I../../../../include         -c ../netiiu.cpp
/opt/SUNWspro/bin/CC              -DUNIX  -DSOLARIS=10 -mt  -D__EXTENSIONS__   -O   +w            -xcode=pic32 -I. -I../O.Common -I. -I. -I.. -I../../../../src/ca/client/test -I../../../../include/compiler/solStudio -I../../../../include/os/solaris -I../../../../include         -c ../udpiiu.cpp
/opt/SUNWspro/bin/CC              -DUNIX  -DSOLARIS=10 -mt  -D__EXTENSIONS__   -O   +w            -xcode=pic32 -I. -I../O.Common -I. -I. -I.. -I../../../../src/ca/client/test -I../../../../include/compiler/solStudio -I../../../../include/os/solaris -I../../../../include         -c ../tcpiiu.cpp
/opt/SUNWspro/bin/CC              -DUNIX  -DSOLARIS=10 -mt  -D__EXTENSIONS__   -O   +w            -xcode=pic32 -I. -I../O.Common -I. -I. -I.. -I../../../../src/ca/client/test -I../../../../include/compiler/solStudio -I../../../../include/os/solaris -I../../../../include         -c ../noopiiu.cpp
/opt/SUNWspro/bin/CC              -DUNIX  -DSOLARIS=10 -mt  -D__EXTENSIONS__   -O   +w            -xcode=pic32 -I. -I../O.Common -I. -I. -I.. -I../../../../src/ca/client/test -I../../../../include/compiler/solStudio -I../../../../include/os/solaris -I../../../../include         -c ../netReadNotifyIO.cpp
/opt/SUNWspro/bin/CC              -DUNIX  -DSOLARIS=10 -mt  -D__EXTENSIONS__   -O   +w            -xcode=pic32 -I. -I../O.Common -I. -I. -I.. -I../../../../src/ca/client/test -I../../../../include/compiler/solStudio -I../../../../include/os/solaris -I../../../../include         -c ../netWriteNotifyIO.cpp
/opt/SUNWspro/bin/CC              -DUNIX  -DSOLARIS=10 -mt  -D__EXTENSIONS__   -O   +w            -xcode=pic32 -I. -I../O.Common -I. -I. -I.. -I../../../../src/ca/client/test -I../../../../include/compiler/solStudio -I../../../../include/os/solaris -I../../../../include         -c ../netSubscription.cpp
/opt/SUNWspro/bin/CC              -DUNIX  -DSOLARIS=10 -mt  -D__EXTENSIONS__   -O   +w            -xcode=pic32 -I. -I../O.Common -I. -I. -I.. -I../../../../src/ca/client/test -I../../../../include/compiler/solStudio -I../../../../include/os/solaris -I../../../../include         -c ../tcpSendWatchdog.cpp
/opt/SUNWspro/bin/CC              -DUNIX  -DSOLARIS=10 -mt  -D__EXTENSIONS__   -O   +w            -xcode=pic32 -I. -I../O.Common -I. -I. -I.. -I../../../../src/ca/client/test -I../../../../include/compiler/solStudio -I../../../../include/os/solaris -I../../../../include         -c ../tcpRecvWatchdog.cpp
/opt/SUNWspro/bin/CC              -DUNIX  -DSOLARIS=10 -mt  -D__EXTENSIONS__   -O   +w            -xcode=pic32 -I. -I../O.Common -I. -I. -I.. -I../../../../src/ca/client/test -I../../../../include/compiler/solStudio -I../../../../include/os/solaris -I../../../../include         -c ../bhe.cpp
/opt/SUNWspro/bin/CC              -DUNIX  -DSOLARIS=10 -mt  -D__EXTENSIONS__   -O   +w            -xcode=pic32 -I. -I../O.Common -I. -I. -I.. -I../../../../src/ca/client/test -I../../../../include/compiler/solStudio -I../../../../include/os/solaris -I../../../../include         -c ../ca_client_context.cpp
"../ca_client_context.cpp", line 168: Error: Could not find a match for std::swap<std::_charT, std::_Traits, std::_Allocator>(std::auto_ptr<CallbackGuard>, std::auto_ptr<CallbackGuard>) needed in ca_client_context::ca_client_context(bool).
1 Error(s) detected.
../../../../configure/RULES_BUILD:228: recipe for target 'ca_client_context.o' failed
make[3]: *** [ca_client_context.o] Error 1
make[3]: Leaving directory '<https://jenkins.aps.anl.gov/job/epics-base-3.16-sol/ws/src/ca/client/O.solaris-sparc'>
../../../configure/RULES_ARCHS:61: recipe for target 'install.solaris-sparc' failed
make[2]: *** [install.solaris-sparc] Error 2
make[2]: Leaving directory '<https://jenkins.aps.anl.gov/job/epics-base-3.16-sol/ws/src/ca/client'>
../configure/RULES_DIRS:88: recipe for target 'ca/client.install.solaris-sparc' failed
make[1]: *** [ca/client.install.solaris-sparc] Error 2
make[1]: Leaving directory '<https://jenkins.aps.anl.gov/job/epics-base-3.16-sol/ws/src'>
configure/RULES_DIRS:88: recipe for target 'src.install.solaris-sparc' failed
make: *** [src.install.solaris-sparc] Error 2
Build step 'Execute shell' marked build as failure
[WARNINGS] Skipping publisher since build result is FAILURE

Replies:
Build failed in Jenkins: epics-base-3.16-sol #49 APS Jenkins

Navigate by Date:
Prev: Jenkins build is back to stable : epics-base-3.14-win32s #115 APS Jenkins
Next: Re: RFC: New DBD keyword? Andrew Johnson
Index: 2002  2003  2004  2005  2006  2007  2008  2009  2010  2011  2012  2013  2014  2015  <20162017  2018 
Navigate by Thread:
Prev: Re: RFC: New DBD keyword? Andrew Johnson
Next: Build failed in Jenkins: epics-base-3.16-sol #49 APS Jenkins
Index: 2002  2003  2004  2005  2006  2007  2008  2009  2010  2011  2012  2013  2014  2015  <20162017  2018 
ANJ, 16 May 2016 Valid HTML 4.01! · Home · News · About · Base · Modules · Extensions · Distributions · Download ·
· Search · EPICS V4 · IRMIS · Talk · Bugs · Documents · Links · Licensing ·