Argonne National Laboratory

Experimental Physics and
Industrial Control System

2002  2003  2004  2005  2006  2007  2008  2009  2010  2011  2012  2013  2014  2015  <20162017  2018  2019  2020  Index 2002  2003  2004  2005  2006  2007  2008  2009  2010  2011  2012  2013  2014  2015  <20162017  2018  2019  2020 
<== Date ==> <== Thread ==>

Subject: Build failed in Jenkins: epics-base-3.14-rtems #135
From: APS Jenkins <aps-jenkins@anl.gov>
To: core-talk@aps.anl.gov
Date: Wed, 6 Jul 2016 13:34:31 -0500 (CDT)
See <https://jenkins.aps.anl.gov/job/epics-base-3.14-rtems/135/>

------------------------------------------
[...truncated 721 lines...]
make[2]: Leaving directory `/Jenkins/jenkins/jobs/epics-base-3.14/workspace/src/misc'
make -C ./dev RTEMS-uC5282 
make[2]: Entering directory `/Jenkins/jenkins/jobs/epics-base-3.14/workspace/src/dev'
make -C ./softDev RTEMS-uC5282 
make[3]: Entering directory `/Jenkins/jenkins/jobs/epics-base-3.14/workspace/src/dev/softDev'
perl ../../../bin/linux-x86_64/makeMakefile.pl O.RTEMS-uC5282 ../../../..
make -C O.linux-x86_64 -f ../Makefile TOP=../../../.. T_A=linux-x86_64
make[4]: Entering directory `/Jenkins/jenkins/jobs/epics-base-3.14/workspace/src/dev/softDev/O.linux-x86_64'
make[4]: Nothing to be done for `all'.
make[4]: Leaving directory `/Jenkins/jenkins/jobs/epics-base-3.14/workspace/src/dev/softDev/O.linux-x86_64'
make -C O.RTEMS-uC5282 -f ../Makefile TOP=../../../.. T_A=RTEMS-uC5282
make[4]: Entering directory `/Jenkins/jenkins/jobs/epics-base-3.14/workspace/src/dev/softDev/O.RTEMS-uC5282'

/usr/local/vw/rtems/rtems-4.10.2/bin/m68k-rtems4.10.2-gcc --pipe -B/usr/local/rtems/rtems-4.10.2/m68k-rtems4.10.2/uC5282/lib/ -specs bsp_specs -qrtems   -fasm -c   -mcpu=5282                  -DUNIX      -O2 -g -g   -Wall       -DMY_DO_BOOTP=NULL     -MMD -I. -I../O.Common -I. -I.. -I../../../../include/os/RTEMS -I../../../../include         ../devAaiSoft.c 
../devAaiSoft.c: In function 'read_aai':
../devAaiSoft.c:76: warning: the address of 'nRequest' will never be NULL

/usr/local/vw/rtems/rtems-4.10.2/bin/m68k-rtems4.10.2-gcc --pipe -B/usr/local/rtems/rtems-4.10.2/m68k-rtems4.10.2/uC5282/lib/ -specs bsp_specs -qrtems   -fasm -c   -mcpu=5282                  -DUNIX      -O2 -g -g   -Wall       -DMY_DO_BOOTP=NULL     -MMD -I. -I../O.Common -I. -I.. -I../../../../include/os/RTEMS -I../../../../include         ../devAaoSoft.c 

/usr/local/vw/rtems/rtems-4.10.2/bin/m68k-rtems4.10.2-gcc --pipe -B/usr/local/rtems/rtems-4.10.2/m68k-rtems4.10.2/uC5282/lib/ -specs bsp_specs -qrtems   -fasm -c   -mcpu=5282                  -DUNIX      -O2 -g -g   -Wall       -DMY_DO_BOOTP=NULL     -MMD -I. -I../O.Common -I. -I.. -I../../../../include/os/RTEMS -I../../../../include         ../devAiSoft.c 

/usr/local/vw/rtems/rtems-4.10.2/bin/m68k-rtems4.10.2-gcc --pipe -B/usr/local/rtems/rtems-4.10.2/m68k-rtems4.10.2/uC5282/lib/ -specs bsp_specs -qrtems   -fasm -c   -mcpu=5282                  -DUNIX      -O2 -g -g   -Wall       -DMY_DO_BOOTP=NULL     -MMD -I. -I../O.Common -I. -I.. -I../../../../include/os/RTEMS -I../../../../include         ../devAiSoftRaw.c 

/usr/local/vw/rtems/rtems-4.10.2/bin/m68k-rtems4.10.2-gcc --pipe -B/usr/local/rtems/rtems-4.10.2/m68k-rtems4.10.2/uC5282/lib/ -specs bsp_specs -qrtems   -fasm -c   -mcpu=5282                  -DUNIX      -O2 -g -g   -Wall       -DMY_DO_BOOTP=NULL     -MMD -I. -I../O.Common -I. -I.. -I../../../../include/os/RTEMS -I../../../../include         ../devAoSoft.c 

/usr/local/vw/rtems/rtems-4.10.2/bin/m68k-rtems4.10.2-gcc --pipe -B/usr/local/rtems/rtems-4.10.2/m68k-rtems4.10.2/uC5282/lib/ -specs bsp_specs -qrtems   -fasm -c   -mcpu=5282                  -DUNIX      -O2 -g -g   -Wall       -DMY_DO_BOOTP=NULL     -MMD -I. -I../O.Common -I. -I.. -I../../../../include/os/RTEMS -I../../../../include         ../devAoSoftRaw.c 

/usr/local/vw/rtems/rtems-4.10.2/bin/m68k-rtems4.10.2-gcc --pipe -B/usr/local/rtems/rtems-4.10.2/m68k-rtems4.10.2/uC5282/lib/ -specs bsp_specs -qrtems   -fasm -c   -mcpu=5282                  -DUNIX      -O2 -g -g   -Wall       -DMY_DO_BOOTP=NULL     -MMD -I. -I../O.Common -I. -I.. -I../../../../include/os/RTEMS -I../../../../include         ../devBiSoft.c 

/usr/local/vw/rtems/rtems-4.10.2/bin/m68k-rtems4.10.2-gcc --pipe -B/usr/local/rtems/rtems-4.10.2/m68k-rtems4.10.2/uC5282/lib/ -specs bsp_specs -qrtems   -fasm -c   -mcpu=5282                  -DUNIX      -O2 -g -g   -Wall       -DMY_DO_BOOTP=NULL     -MMD -I. -I../O.Common -I. -I.. -I../../../../include/os/RTEMS -I../../../../include         ../devBiSoftRaw.c 

/usr/local/vw/rtems/rtems-4.10.2/bin/m68k-rtems4.10.2-gcc --pipe -B/usr/local/rtems/rtems-4.10.2/m68k-rtems4.10.2/uC5282/lib/ -specs bsp_specs -qrtems   -fasm -c   -mcpu=5282                  -DUNIX      -O2 -g -g   -Wall       -DMY_DO_BOOTP=NULL     -MMD -I. -I../O.Common -I. -I.. -I../../../../include/os/RTEMS -I../../../../include         ../devBoSoft.c 

/usr/local/vw/rtems/rtems-4.10.2/bin/m68k-rtems4.10.2-gcc --pipe -B/usr/local/rtems/rtems-4.10.2/m68k-rtems4.10.2/uC5282/lib/ -specs bsp_specs -qrtems   -fasm -c   -mcpu=5282                  -DUNIX      -O2 -g -g   -Wall       -DMY_DO_BOOTP=NULL     -MMD -I. -I../O.Common -I. -I.. -I../../../../include/os/RTEMS -I../../../../include         ../devBoSoftRaw.c 

/usr/local/vw/rtems/rtems-4.10.2/bin/m68k-rtems4.10.2-gcc --pipe -B/usr/local/rtems/rtems-4.10.2/m68k-rtems4.10.2/uC5282/lib/ -specs bsp_specs -qrtems   -fasm -c   -mcpu=5282                  -DUNIX      -O2 -g -g   -Wall       -DMY_DO_BOOTP=NULL     -MMD -I. -I../O.Common -I. -I.. -I../../../../include/os/RTEMS -I../../../../include         ../devCalcoutSoft.c 

/usr/local/vw/rtems/rtems-4.10.2/bin/m68k-rtems4.10.2-gcc --pipe -B/usr/local/rtems/rtems-4.10.2/m68k-rtems4.10.2/uC5282/lib/ -specs bsp_specs -qrtems   -fasm -c   -mcpu=5282                  -DUNIX      -O2 -g -g   -Wall       -DMY_DO_BOOTP=NULL     -MMD -I. -I../O.Common -I. -I.. -I../../../../include/os/RTEMS -I../../../../include         ../devEventSoft.c 

/usr/local/vw/rtems/rtems-4.10.2/bin/m68k-rtems4.10.2-gcc --pipe -B/usr/local/rtems/rtems-4.10.2/m68k-rtems4.10.2/uC5282/lib/ -specs bsp_specs -qrtems   -fasm -c   -mcpu=5282                  -DUNIX      -O2 -g -g   -Wall       -DMY_DO_BOOTP=NULL     -MMD -I. -I../O.Common -I. -I.. -I../../../../include/os/RTEMS -I../../../../include         ../devHistogramSoft.c 

/usr/local/vw/rtems/rtems-4.10.2/bin/m68k-rtems4.10.2-gcc --pipe -B/usr/local/rtems/rtems-4.10.2/m68k-rtems4.10.2/uC5282/lib/ -specs bsp_specs -qrtems   -fasm -c   -mcpu=5282                  -DUNIX      -O2 -g -g   -Wall       -DMY_DO_BOOTP=NULL     -MMD -I. -I../O.Common -I. -I.. -I../../../../include/os/RTEMS -I../../../../include         ../devLiSoft.c 

/usr/local/vw/rtems/rtems-4.10.2/bin/m68k-rtems4.10.2-gcc --pipe -B/usr/local/rtems/rtems-4.10.2/m68k-rtems4.10.2/uC5282/lib/ -specs bsp_specs -qrtems   -fasm -c   -mcpu=5282                  -DUNIX      -O2 -g -g   -Wall       -DMY_DO_BOOTP=NULL     -MMD -I. -I../O.Common -I. -I.. -I../../../../include/os/RTEMS -I../../../../include         ../devLoSoft.c 

/usr/local/vw/rtems/rtems-4.10.2/bin/m68k-rtems4.10.2-gcc --pipe -B/usr/local/rtems/rtems-4.10.2/m68k-rtems4.10.2/uC5282/lib/ -specs bsp_specs -qrtems   -fasm -c   -mcpu=5282                  -DUNIX      -O2 -g -g   -Wall       -DMY_DO_BOOTP=NULL     -MMD -I. -I../O.Common -I. -I.. -I../../../../include/os/RTEMS -I../../../../include         ../devMbbiDirectSoft.c 

/usr/local/vw/rtems/rtems-4.10.2/bin/m68k-rtems4.10.2-gcc --pipe -B/usr/local/rtems/rtems-4.10.2/m68k-rtems4.10.2/uC5282/lib/ -specs bsp_specs -qrtems   -fasm -c   -mcpu=5282                  -DUNIX      -O2 -g -g   -Wall       -DMY_DO_BOOTP=NULL     -MMD -I. -I../O.Common -I. -I.. -I../../../../include/os/RTEMS -I../../../../include         ../devMbbiDirectSoftRaw.c 

/usr/local/vw/rtems/rtems-4.10.2/bin/m68k-rtems4.10.2-gcc --pipe -B/usr/local/rtems/rtems-4.10.2/m68k-rtems4.10.2/uC5282/lib/ -specs bsp_specs -qrtems   -fasm -c   -mcpu=5282                  -DUNIX      -O2 -g -g   -Wall       -DMY_DO_BOOTP=NULL     -MMD -I. -I../O.Common -I. -I.. -I../../../../include/os/RTEMS -I../../../../include         ../devMbbiSoft.c 

/usr/local/vw/rtems/rtems-4.10.2/bin/m68k-rtems4.10.2-gcc --pipe -B/usr/local/rtems/rtems-4.10.2/m68k-rtems4.10.2/uC5282/lib/ -specs bsp_specs -qrtems   -fasm -c   -mcpu=5282                  -DUNIX      -O2 -g -g   -Wall       -DMY_DO_BOOTP=NULL     -MMD -I. -I../O.Common -I. -I.. -I../../../../include/os/RTEMS -I../../../../include         ../devMbbiSoftRaw.c 

/usr/local/vw/rtems/rtems-4.10.2/bin/m68k-rtems4.10.2-gcc --pipe -B/usr/local/rtems/rtems-4.10.2/m68k-rtems4.10.2/uC5282/lib/ -specs bsp_specs -qrtems   -fasm -c   -mcpu=5282                  -DUNIX      -O2 -g -g   -Wall       -DMY_DO_BOOTP=NULL     -MMD -I. -I../O.Common -I. -I.. -I../../../../include/os/RTEMS -I../../../../include         ../devMbboDirectSoft.c 

/usr/local/vw/rtems/rtems-4.10.2/bin/m68k-rtems4.10.2-gcc --pipe -B/usr/local/rtems/rtems-4.10.2/m68k-rtems4.10.2/uC5282/lib/ -specs bsp_specs -qrtems   -fasm -c   -mcpu=5282                  -DUNIX      -O2 -g -g   -Wall       -DMY_DO_BOOTP=NULL     -MMD -I. -I../O.Common -I. -I.. -I../../../../include/os/RTEMS -I../../../../include         ../devMbboDirectSoftRaw.c 

/usr/local/vw/rtems/rtems-4.10.2/bin/m68k-rtems4.10.2-gcc --pipe -B/usr/local/rtems/rtems-4.10.2/m68k-rtems4.10.2/uC5282/lib/ -specs bsp_specs -qrtems   -fasm -c   -mcpu=5282                  -DUNIX      -O2 -g -g   -Wall       -DMY_DO_BOOTP=NULL     -MMD -I. -I../O.Common -I. -I.. -I../../../../include/os/RTEMS -I../../../../include         ../devMbboSoft.c 

/usr/local/vw/rtems/rtems-4.10.2/bin/m68k-rtems4.10.2-gcc --pipe -B/usr/local/rtems/rtems-4.10.2/m68k-rtems4.10.2/uC5282/lib/ -specs bsp_specs -qrtems   -fasm -c   -mcpu=5282                  -DUNIX      -O2 -g -g   -Wall       -DMY_DO_BOOTP=NULL     -MMD -I. -I../O.Common -I. -I.. -I../../../../include/os/RTEMS -I../../../../include         ../devMbboSoftRaw.c 

/usr/local/vw/rtems/rtems-4.10.2/bin/m68k-rtems4.10.2-gcc --pipe -B/usr/local/rtems/rtems-4.10.2/m68k-rtems4.10.2/uC5282/lib/ -specs bsp_specs -qrtems   -fasm -c   -mcpu=5282                  -DUNIX      -O2 -g -g   -Wall       -DMY_DO_BOOTP=NULL     -MMD -I. -I../O.Common -I. -I.. -I../../../../include/os/RTEMS -I../../../../include         ../devSASoft.c 
../devSASoft.c: In function 'read_sa':
../devSASoft.c:79: warning: the address of 'nRequest' will never be NULL

/usr/local/vw/rtems/rtems-4.10.2/bin/m68k-rtems4.10.2-gcc --pipe -B/usr/local/rtems/rtems-4.10.2/m68k-rtems4.10.2/uC5282/lib/ -specs bsp_specs -qrtems   -fasm -c   -mcpu=5282                  -DUNIX      -O2 -g -g   -Wall       -DMY_DO_BOOTP=NULL     -MMD -I. -I../O.Common -I. -I.. -I../../../../include/os/RTEMS -I../../../../include         ../devSiSoft.c 

/usr/local/vw/rtems/rtems-4.10.2/bin/m68k-rtems4.10.2-gcc --pipe -B/usr/local/rtems/rtems-4.10.2/m68k-rtems4.10.2/uC5282/lib/ -specs bsp_specs -qrtems   -fasm -c   -mcpu=5282                  -DUNIX      -O2 -g -g   -Wall       -DMY_DO_BOOTP=NULL     -MMD -I. -I../O.Common -I. -I.. -I../../../../include/os/RTEMS -I../../../../include         ../devSoSoft.c 

/usr/local/vw/rtems/rtems-4.10.2/bin/m68k-rtems4.10.2-gcc --pipe -B/usr/local/rtems/rtems-4.10.2/m68k-rtems4.10.2/uC5282/lib/ -specs bsp_specs -qrtems   -fasm -c   -mcpu=5282                  -DUNIX      -O2 -g -g   -Wall       -DMY_DO_BOOTP=NULL     -MMD -I. -I../O.Common -I. -I.. -I../../../../include/os/RTEMS -I../../../../include         ../devWfSoft.c 
../devWfSoft.c: In function 'read_wf':
../devWfSoft.c:72: warning: the address of 'nRequest' will never be NULL

/usr/local/vw/rtems/rtems-4.10.2/bin/m68k-rtems4.10.2-gcc --pipe -B/usr/local/rtems/rtems-4.10.2/m68k-rtems4.10.2/uC5282/lib/ -specs bsp_specs -qrtems   -fasm -c   -mcpu=5282                  -DUNIX      -O2 -g -g   -Wall       -DMY_DO_BOOTP=NULL     -MMD -I. -I../O.Common -I. -I.. -I../../../../include/os/RTEMS -I../../../../include         ../devGeneralTime.c 

/usr/local/vw/rtems/rtems-4.10.2/bin/m68k-rtems4.10.2-gcc --pipe -B/usr/local/rtems/rtems-4.10.2/m68k-rtems4.10.2/uC5282/lib/ -specs bsp_specs -qrtems   -fasm -c   -mcpu=5282                  -DUNIX      -O2 -g -g   -Wall       -DMY_DO_BOOTP=NULL     -MMD -I. -I../O.Common -I. -I.. -I../../../../include/os/RTEMS -I../../../../include         ../devAoSoftCallback.c 

/usr/local/vw/rtems/rtems-4.10.2/bin/m68k-rtems4.10.2-gcc --pipe -B/usr/local/rtems/rtems-4.10.2/m68k-rtems4.10.2/uC5282/lib/ -specs bsp_specs -qrtems   -fasm -c   -mcpu=5282                  -DUNIX      -O2 -g -g   -Wall       -DMY_DO_BOOTP=NULL     -MMD -I. -I../O.Common -I. -I.. -I../../../../include/os/RTEMS -I../../../../include         ../devBoSoftCallback.c 

/usr/local/vw/rtems/rtems-4.10.2/bin/m68k-rtems4.10.2-gcc --pipe -B/usr/local/rtems/rtems-4.10.2/m68k-rtems4.10.2/uC5282/lib/ -specs bsp_specs -qrtems   -fasm -c   -mcpu=5282                  -DUNIX      -O2 -g -g   -Wall       -DMY_DO_BOOTP=NULL     -MMD -I. -I../O.Common -I. -I.. -I../../../../include/os/RTEMS -I../../../../include         ../devCalcoutSoftCallback.c 

/usr/local/vw/rtems/rtems-4.10.2/bin/m68k-rtems4.10.2-gcc --pipe -B/usr/local/rtems/rtems-4.10.2/m68k-rtems4.10.2/uC5282/lib/ -specs bsp_specs -qrtems   -fasm -c   -mcpu=5282                  -DUNIX      -O2 -g -g   -Wall       -DMY_DO_BOOTP=NULL     -MMD -I. -I../O.Common -I. -I.. -I../../../../include/os/RTEMS -I../../../../include         ../devLoSoftCallback.c 

/usr/local/vw/rtems/rtems-4.10.2/bin/m68k-rtems4.10.2-gcc --pipe -B/usr/local/rtems/rtems-4.10.2/m68k-rtems4.10.2/uC5282/lib/ -specs bsp_specs -qrtems   -fasm -c   -mcpu=5282                  -DUNIX      -O2 -g -g   -Wall       -DMY_DO_BOOTP=NULL     -MMD -I. -I../O.Common -I. -I.. -I../../../../include/os/RTEMS -I../../../../include         ../devMbboSoftCallback.c 

/usr/local/vw/rtems/rtems-4.10.2/bin/m68k-rtems4.10.2-gcc --pipe -B/usr/local/rtems/rtems-4.10.2/m68k-rtems4.10.2/uC5282/lib/ -specs bsp_specs -qrtems   -fasm -c   -mcpu=5282                  -DUNIX      -O2 -g -g   -Wall       -DMY_DO_BOOTP=NULL     -MMD -I. -I../O.Common -I. -I.. -I../../../../include/os/RTEMS -I../../../../include         ../devMbboDirectSoftCallback.c 

/usr/local/vw/rtems/rtems-4.10.2/bin/m68k-rtems4.10.2-gcc --pipe -B/usr/local/rtems/rtems-4.10.2/m68k-rtems4.10.2/uC5282/lib/ -specs bsp_specs -qrtems   -fasm -c   -mcpu=5282                  -DUNIX      -O2 -g -g   -Wall       -DMY_DO_BOOTP=NULL     -MMD -I. -I../O.Common -I. -I.. -I../../../../include/os/RTEMS -I../../../../include         ../devSoSoftCallback.c 

/usr/local/vw/rtems/rtems-4.10.2/bin/m68k-rtems4.10.2-gcc --pipe -B/usr/local/rtems/rtems-4.10.2/m68k-rtems4.10.2/uC5282/lib/ -specs bsp_specs -qrtems   -fasm -c   -mcpu=5282                  -DUNIX      -O2 -g -g   -Wall       -DMY_DO_BOOTP=NULL     -MMD -I. -I../O.Common -I. -I.. -I../../../../include/os/RTEMS -I../../../../include         ../devTimestamp.c 

/usr/local/vw/rtems/rtems-4.10.2/bin/m68k-rtems4.10.2-gcc --pipe -B/usr/local/rtems/rtems-4.10.2/m68k-rtems4.10.2/uC5282/lib/ -specs bsp_specs -qrtems   -fasm -c   -mcpu=5282                  -DUNIX      -O2 -g -g   -Wall       -DMY_DO_BOOTP=NULL     -MMD -I. -I../O.Common -I. -I.. -I../../../../include/os/RTEMS -I../../../../include         ../devSoStdio.c 
/usr/local/vw/rtems/rtems-4.10.2/bin/m68k-rtems4.10.2-ar rc   libsoftDevIoc.a         devAaiSoft.o devAaoSoft.o devAiSoft.o devAiSoftRaw.o devAoSoft.o devAoSoftRaw.o devBiSoft.o devBiSoftRaw.o devBoSoft.o devBoSoftRaw.o devCalcoutSoft.o devEventSoft.o devHistogramSoft.o devLiSoft.o devLoSoft.o devMbbiDirectSoft.o devMbbiDirectSoftRaw.o devMbbiSoft.o devMbbiSoftRaw.o devMbboDirectSoft.o devMbboDirectSoftRaw.o devMbboSoft.o devMbboSoftRaw.o devSASoft.o devSiSoft.o devSoSoft.o devWfSoft.o devGeneralTime.o devAoSoftCallback.o devBoSoftCallback.o devCalcoutSoftCallback.o devLoSoftCallback.o devMbboSoftCallback.o devMbboDirectSoftCallback.o devSoSoftCallback.o devTimestamp.o devSoStdio.o
/usr/local/vw/rtems/rtems-4.10.2/bin/m68k-rtems4.10.2-ranlib libsoftDevIoc.a
Installing library ../../../../lib/RTEMS-uC5282/libsoftDevIoc.a
make[4]: Leaving directory `/Jenkins/jenkins/jobs/epics-base-3.14/workspace/src/dev/softDev/O.RTEMS-uC5282'
make[3]: Leaving directory `/Jenkins/jenkins/jobs/epics-base-3.14/workspace/src/dev/softDev'
make -C ./testDev RTEMS-uC5282 
make[3]: Entering directory `/Jenkins/jenkins/jobs/epics-base-3.14/workspace/src/dev/testDev'
perl ../../../bin/linux-x86_64/makeMakefile.pl O.RTEMS-uC5282 ../../../..
make -C O.linux-x86_64 -f ../Makefile TOP=../../../.. T_A=linux-x86_64
make[4]: Entering directory `/Jenkins/jenkins/jobs/epics-base-3.14/workspace/src/dev/testDev/O.linux-x86_64'
make[4]: Nothing to be done for `all'.
make[4]: Leaving directory `/Jenkins/jenkins/jobs/epics-base-3.14/workspace/src/dev/testDev/O.linux-x86_64'
make -C O.RTEMS-uC5282 -f ../Makefile TOP=../../../.. T_A=RTEMS-uC5282
make[4]: Entering directory `/Jenkins/jenkins/jobs/epics-base-3.14/workspace/src/dev/testDev/O.RTEMS-uC5282'

/usr/local/vw/rtems/rtems-4.10.2/bin/m68k-rtems4.10.2-gcc --pipe -B/usr/local/rtems/rtems-4.10.2/m68k-rtems4.10.2/uC5282/lib/ -specs bsp_specs -qrtems   -fasm -c   -mcpu=5282                  -DUNIX      -O2 -g -g   -Wall       -DMY_DO_BOOTP=NULL     -MMD -I. -I../O.Common -I. -I.. -I../../../../include/os/RTEMS -I../../../../include         ../devHistogramTestAsyn.c 

/usr/local/vw/rtems/rtems-4.10.2/bin/m68k-rtems4.10.2-gcc --pipe -B/usr/local/rtems/rtems-4.10.2/m68k-rtems4.10.2/uC5282/lib/ -specs bsp_specs -qrtems   -fasm -c   -mcpu=5282                  -DUNIX      -O2 -g -g   -Wall       -DMY_DO_BOOTP=NULL     -MMD -I. -I../O.Common -I. -I.. -I../../../../include/os/RTEMS -I../../../../include         ../devTestAsyn.c 
/usr/local/vw/rtems/rtems-4.10.2/bin/m68k-rtems4.10.2-ar rc   libtestDevIoc.a         devHistogramTestAsyn.o devTestAsyn.o
/usr/local/vw/rtems/rtems-4.10.2/bin/m68k-rtems4.10.2-ranlib libtestDevIoc.a
Installing library ../../../../lib/RTEMS-uC5282/libtestDevIoc.a
make[4]: Leaving directory `/Jenkins/jenkins/jobs/epics-base-3.14/workspace/src/dev/testDev/O.RTEMS-uC5282'
make[3]: Leaving directory `/Jenkins/jenkins/jobs/epics-base-3.14/workspace/src/dev/testDev'
make[2]: Leaving directory `/Jenkins/jenkins/jobs/epics-base-3.14/workspace/src/dev'
make -C ./vxWorks RTEMS-uC5282 
make[2]: Entering directory `/Jenkins/jenkins/jobs/epics-base-3.14/workspace/src/vxWorks'
perl ../../bin/linux-x86_64/makeMakefile.pl O.RTEMS-uC5282 ../../..
make -C O.linux-x86_64 -f ../Makefile TOP=../../.. T_A=linux-x86_64
make[3]: Entering directory `/Jenkins/jenkins/jobs/epics-base-3.14/workspace/src/vxWorks/O.linux-x86_64'
make[3]: Nothing to be done for `all'.
make[3]: Leaving directory `/Jenkins/jenkins/jobs/epics-base-3.14/workspace/src/vxWorks/O.linux-x86_64'
make -C O.RTEMS-uC5282 -f ../Makefile TOP=../../.. T_A=RTEMS-uC5282
make[3]: Entering directory `/Jenkins/jenkins/jobs/epics-base-3.14/workspace/src/vxWorks/O.RTEMS-uC5282'
make[3]: Nothing to be done for `default_target'.
make[3]: Leaving directory `/Jenkins/jenkins/jobs/epics-base-3.14/workspace/src/vxWorks/O.RTEMS-uC5282'
make[2]: Leaving directory `/Jenkins/jenkins/jobs/epics-base-3.14/workspace/src/vxWorks'
make -C ./RTEMS RTEMS-uC5282 
make[2]: Entering directory `/Jenkins/jenkins/jobs/epics-base-3.14/workspace/src/RTEMS'
make -C ./base RTEMS-uC5282 
make[3]: Entering directory `/Jenkins/jenkins/jobs/epics-base-3.14/workspace/src/RTEMS/base'
perl ../../../bin/linux-x86_64/makeMakefile.pl O.RTEMS-uC5282 ../../../..
make -C O.linux-x86_64 -f ../Makefile TOP=../../../.. T_A=linux-x86_64
make[4]: Entering directory `/Jenkins/jenkins/jobs/epics-base-3.14/workspace/src/RTEMS/base/O.linux-x86_64'
make[4]: Nothing to be done for `all'.
make[4]: Leaving directory `/Jenkins/jenkins/jobs/epics-base-3.14/workspace/src/RTEMS/base/O.linux-x86_64'
make -C O.RTEMS-uC5282 -f ../Makefile TOP=../../../.. T_A=RTEMS-uC5282
make[4]: Entering directory `/Jenkins/jenkins/jobs/epics-base-3.14/workspace/src/RTEMS/base/O.RTEMS-uC5282'

/usr/local/vw/rtems/rtems-4.10.2/bin/m68k-rtems4.10.2-gcc --pipe -B/usr/local/rtems/rtems-4.10.2/m68k-rtems4.10.2/uC5282/lib/ -specs bsp_specs -qrtems   -fasm -c   -mcpu=5282                  -DUNIX      -O2 -g -g   -Wall       -DMY_DO_BOOTP=NULL     -MMD -I. -I../O.Common -I. -I.. -I../../../../include/os/RTEMS -I../../../../include         ../rtems_init.c 

/usr/local/vw/rtems/rtems-4.10.2/bin/m68k-rtems4.10.2-gcc --pipe -B/usr/local/rtems/rtems-4.10.2/m68k-rtems4.10.2/uC5282/lib/ -specs bsp_specs -qrtems   -fasm -c   -mcpu=5282                  -DUNIX      -O2 -g -g   -Wall       -DMY_DO_BOOTP=NULL     -MMD -I. -I../O.Common -I. -I.. -I../../../../include/os/RTEMS -I../../../../include         ../rtems_config.c 

/usr/local/vw/rtems/rtems-4.10.2/bin/m68k-rtems4.10.2-gcc --pipe -B/usr/local/rtems/rtems-4.10.2/m68k-rtems4.10.2/uC5282/lib/ -specs bsp_specs -qrtems   -fasm -c   -mcpu=5282                  -DUNIX      -O2 -g -g   -Wall       -DMY_DO_BOOTP=NULL     -MMD -I. -I../O.Common -I. -I.. -I../../../../include/os/RTEMS -I../../../../include         ../rtems_netconfig.c 

/usr/local/vw/rtems/rtems-4.10.2/bin/m68k-rtems4.10.2-gcc --pipe -B/usr/local/rtems/rtems-4.10.2/m68k-rtems4.10.2/uC5282/lib/ -specs bsp_specs -qrtems   -fasm -c   -mcpu=5282                  -DUNIX      -O2 -g -g   -Wall       -DMY_DO_BOOTP=NULL     -MMD -I. -I../O.Common -I. -I.. -I../../../../include/os/RTEMS -I../../../../include         ../rtems_util.c 

/usr/local/vw/rtems/rtems-4.10.2/bin/m68k-rtems4.10.2-gcc --pipe -B/usr/local/rtems/rtems-4.10.2/m68k-rtems4.10.2/uC5282/lib/ -specs bsp_specs -qrtems   -fasm -c   -mcpu=5282                  -DUNIX      -O2 -g -g   -Wall       -DMY_DO_BOOTP=NULL     -MMD -I. -I../O.Common -I. -I.. -I../../../../include/os/RTEMS -I../../../../include         ../setBootConfigFromNVRAM.c 
../setBootConfigFromNVRAM.c: In function 'setBootConfigFromNVRAM':
../setBootConfigFromNVRAM.c:350: warning: assignment discards qualifiers from pointer target type
../setBootConfigFromNVRAM.c: At top level:
../setBootConfigFromNVRAM.c:42: warning: 'splitRtemsBsdnetBootpCmdline' defined but not used

/usr/local/vw/rtems/rtems-4.10.2/bin/m68k-rtems4.10.2-gcc --pipe -B/usr/local/rtems/rtems-4.10.2/m68k-rtems4.10.2/uC5282/lib/ -specs bsp_specs -qrtems   -fasm -c   -mcpu=5282                  -DUNIX      -O2 -g -g   -Wall       -DMY_DO_BOOTP=NULL     -MMD -I. -I../O.Common -I. -I.. -I../../../../include/os/RTEMS -I../../../../include         ../epicsRtemsInitHookPre.c 

/usr/local/vw/rtems/rtems-4.10.2/bin/m68k-rtems4.10.2-gcc --pipe -B/usr/local/rtems/rtems-4.10.2/m68k-rtems4.10.2/uC5282/lib/ -specs bsp_specs -qrtems   -fasm -c   -mcpu=5282                  -DUNIX      -O2 -g -g   -Wall       -DMY_DO_BOOTP=NULL     -MMD -I. -I../O.Common -I. -I.. -I../../../../include/os/RTEMS -I../../../../include         ../epicsRtemsInitHookPost.c 
/usr/local/vw/rtems/rtems-4.10.2/bin/m68k-rtems4.10.2-ar rc   librtemsCom.a        rtems_init.o rtems_config.o rtems_netconfig.o rtems_util.o setBootConfigFromNVRAM.o epicsRtemsInitHookPre.o epicsRtemsInitHookPost.o 
/usr/local/vw/rtems/rtems-4.10.2/bin/m68k-rtems4.10.2-ranlib librtemsCom.a
Installing library ../../../../lib/RTEMS-uC5282/librtemsCom.a
make[4]: Leaving directory `/Jenkins/jenkins/jobs/epics-base-3.14/workspace/src/RTEMS/base/O.RTEMS-uC5282'
make[3]: Leaving directory `/Jenkins/jenkins/jobs/epics-base-3.14/workspace/src/RTEMS/base'
make[2]: Leaving directory `/Jenkins/jenkins/jobs/epics-base-3.14/workspace/src/RTEMS'
make -C libCom/test RTEMS-uC5282 
make[2]: Entering directory `/Jenkins/jenkins/jobs/epics-base-3.14/workspace/src/libCom/test'
perl ../../../bin/linux-x86_64/makeMakefile.pl O.RTEMS-uC5282 ../../../..
make -C O.linux-x86_64 -f ../Makefile TOP=../../../.. T_A=linux-x86_64
make[3]: Entering directory `/Jenkins/jenkins/jobs/epics-base-3.14/workspace/src/libCom/test/O.linux-x86_64'
make[3]: Nothing to be done for `all'.
make[3]: Leaving directory `/Jenkins/jenkins/jobs/epics-base-3.14/workspace/src/libCom/test/O.linux-x86_64'
make -C O.RTEMS-uC5282 -f ../Makefile TOP=../../../.. T_A=RTEMS-uC5282
make[3]: Entering directory `/Jenkins/jenkins/jobs/epics-base-3.14/workspace/src/libCom/test/O.RTEMS-uC5282'

/usr/local/vw/rtems/rtems-4.10.2/bin/m68k-rtems4.10.2-gcc --pipe -B/usr/local/rtems/rtems-4.10.2/m68k-rtems4.10.2/uC5282/lib/ -specs bsp_specs -qrtems   -fasm -c   -mcpu=5282                  -DUNIX      -O2 -g -g   -Wall       -DMY_DO_BOOTP=NULL     -MMD -I. -I../O.Common -I. -I.. -I../../../../include/os/RTEMS -I../../../../include         ../epicsTimeZoneTest.c 

/usr/local/vw/rtems/rtems-4.10.2/bin/m68k-rtems4.10.2-gcc --pipe -B/usr/local/rtems/rtems-4.10.2/m68k-rtems4.10.2/uC5282/lib/ -specs bsp_specs -qrtems   -fasm -c   -mcpu=5282                  -DUNIX      -O2 -g -g   -Wall       -DMY_DO_BOOTP=NULL     -MMD -I. -I../O.Common -I. -I.. -I../../../../include/os/RTEMS -I../../../../include         ../rtemsTestHarness.c 

/usr/local/vw/rtems/rtems-4.10.2/bin/m68k-rtems4.10.2-g++ -B/usr/local/rtems/rtems-4.10.2/m68k-rtems4.10.2/uC5282/lib/ -specs bsp_specs -qrtems   -c   -mcpu=5282                  -DUNIX      -O2 -g -g   -Wall       -DMY_DO_BOOTP=NULL     -MMD -I. -I../O.Common -I. -I.. -I../../../../include/os/RTEMS -I../../../../include         ../epicsCalcTest.cpp 

/usr/local/vw/rtems/rtems-4.10.2/bin/m68k-rtems4.10.2-g++ -B/usr/local/rtems/rtems-4.10.2/m68k-rtems4.10.2/uC5282/lib/ -specs bsp_specs -qrtems   -c   -mcpu=5282                  -DUNIX      -O2 -g -g   -Wall       -DMY_DO_BOOTP=NULL     -MMD -I. -I../O.Common -I. -I.. -I../../../../include/os/RTEMS -I../../../../include         ../epicsAlgorithmTest.cpp 

/usr/local/vw/rtems/rtems-4.10.2/bin/m68k-rtems4.10.2-gcc --pipe -B/usr/local/rtems/rtems-4.10.2/m68k-rtems4.10.2/uC5282/lib/ -specs bsp_specs -qrtems   -fasm -c   -mcpu=5282                  -DUNIX      -O2 -g -g   -Wall       -DMY_DO_BOOTP=NULL     -MMD -I. -I../O.Common -I. -I.. -I../../../../include/os/RTEMS -I../../../../include         ../epicsMathTest.c 

/usr/local/vw/rtems/rtems-4.10.2/bin/m68k-rtems4.10.2-gcc --pipe -B/usr/local/rtems/rtems-4.10.2/m68k-rtems4.10.2/uC5282/lib/ -specs bsp_specs -qrtems   -fasm -c   -mcpu=5282                  -DUNIX      -O2 -g -g   -Wall       -DMY_DO_BOOTP=NULL     -MMD -I. -I../O.Common -I. -I.. -I../../../../include/os/RTEMS -I../../../../include         ../epicsEllTest.c 

/usr/local/vw/rtems/rtems-4.10.2/bin/m68k-rtems4.10.2-gcc --pipe -B/usr/local/rtems/rtems-4.10.2/m68k-rtems4.10.2/uC5282/lib/ -specs bsp_specs -qrtems   -fasm -c   -mcpu=5282                  -DUNIX      -O2 -g -g   -Wall       -DMY_DO_BOOTP=NULL     -MMD -I. -I../O.Common -I. -I.. -I../../../../include/os/RTEMS -I../../../../include         ../epicsEnvTest.c 

/usr/local/vw/rtems/rtems-4.10.2/bin/m68k-rtems4.10.2-gcc --pipe -B/usr/local/rtems/rtems-4.10.2/m68k-rtems4.10.2/uC5282/lib/ -specs bsp_specs -qrtems   -fasm -c   -mcpu=5282                  -DUNIX      -O2 -g -g   -Wall       -DMY_DO_BOOTP=NULL     -MMD -I. -I../O.Common -I. -I.. -I../../../../include/os/RTEMS -I../../../../include         ../epicsErrlogTest.c 

/usr/local/vw/rtems/rtems-4.10.2/bin/m68k-rtems4.10.2-gcc --pipe -B/usr/local/rtems/rtems-4.10.2/m68k-rtems4.10.2/uC5282/lib/ -specs bsp_specs -qrtems   -fasm -c   -mcpu=5282                  -DUNIX      -O2 -g -g   -Wall       -DMY_DO_BOOTP=NULL     -MMD -I. -I../O.Common -I. -I.. -I../../../../include/os/RTEMS -I../../../../include         ../epicsStdioTest.c 

/usr/local/vw/rtems/rtems-4.10.2/bin/m68k-rtems4.10.2-gcc --pipe -B/usr/local/rtems/rtems-4.10.2/m68k-rtems4.10.2/uC5282/lib/ -specs bsp_specs -qrtems   -fasm -c   -mcpu=5282                  -DUNIX      -O2 -g -g   -Wall       -DMY_DO_BOOTP=NULL     -MMD -I. -I../O.Common -I. -I.. -I../../../../include/os/RTEMS -I../../../../include         ../epicsSockResolveTest.c 

/usr/local/vw/rtems/rtems-4.10.2/bin/m68k-rtems4.10.2-gcc --pipe -B/usr/local/rtems/rtems-4.10.2/m68k-rtems4.10.2/uC5282/lib/ -specs bsp_specs -qrtems   -fasm -c   -mcpu=5282                  -DUNIX      -O2 -g -g   -Wall       -DMY_DO_BOOTP=NULL     -MMD -I. -I../O.Common -I. -I.. -I../../../../include/os/RTEMS -I../../../../include         ../epicsStringTest.c 

/usr/local/vw/rtems/rtems-4.10.2/bin/m68k-rtems4.10.2-g++ -B/usr/local/rtems/rtems-4.10.2/m68k-rtems4.10.2/uC5282/lib/ -specs bsp_specs -qrtems   -c   -mcpu=5282                  -DUNIX      -O2 -g -g   -Wall       -DMY_DO_BOOTP=NULL     -MMD -I. -I../O.Common -I. -I.. -I../../../../include/os/RTEMS -I../../../../include         ../epicsTimeTest.cpp 

/usr/local/vw/rtems/rtems-4.10.2/bin/m68k-rtems4.10.2-g++ -B/usr/local/rtems/rtems-4.10.2/m68k-rtems4.10.2/uC5282/lib/ -specs bsp_specs -qrtems   -c   -mcpu=5282                  -DUNIX      -O2 -g -g   -Wall       -DMY_DO_BOOTP=NULL     -MMD -I. -I../O.Common -I. -I.. -I../../../../include/os/RTEMS -I../../../../include         ../epicsThreadTest.cpp 

/usr/local/vw/rtems/rtems-4.10.2/bin/m68k-rtems4.10.2-gcc --pipe -B/usr/local/rtems/rtems-4.10.2/m68k-rtems4.10.2/uC5282/lib/ -specs bsp_specs -qrtems   -fasm -c   -mcpu=5282                  -DUNIX      -O2 -g -g   -Wall       -DMY_DO_BOOTP=NULL     -MMD -I. -I../O.Common -I. -I.. -I../../../../include/os/RTEMS -I../../../../include         ../epicsThreadOnceTest.c 

/usr/local/vw/rtems/rtems-4.10.2/bin/m68k-rtems4.10.2-g++ -B/usr/local/rtems/rtems-4.10.2/m68k-rtems4.10.2/uC5282/lib/ -specs bsp_specs -qrtems   -c   -mcpu=5282                  -DUNIX      -O2 -g -g   -Wall       -DMY_DO_BOOTP=NULL     -MMD -I. -I../O.Common -I. -I.. -I../../../../include/os/RTEMS -I../../../../include         ../epicsThreadPriorityTest.cpp 

/usr/local/vw/rtems/rtems-4.10.2/bin/m68k-rtems4.10.2-g++ -B/usr/local/rtems/rtems-4.10.2/m68k-rtems4.10.2/uC5282/lib/ -specs bsp_specs -qrtems   -c   -mcpu=5282                  -DUNIX      -O2 -g -g   -Wall       -DMY_DO_BOOTP=NULL     -MMD -I. -I../O.Common -I. -I.. -I../../../../include/os/RTEMS -I../../../../include         ../epicsThreadPrivateTest.cpp 

/usr/local/vw/rtems/rtems-4.10.2/bin/m68k-rtems4.10.2-gcc --pipe -B/usr/local/rtems/rtems-4.10.2/m68k-rtems4.10.2/uC5282/lib/ -specs bsp_specs -qrtems   -fasm -c   -mcpu=5282                  -DUNIX      -O2 -g -g   -Wall       -DMY_DO_BOOTP=NULL     -MMD -I. -I../O.Common -I. -I.. -I../../../../include/os/RTEMS -I../../../../include         ../epicsExitTest.c 

/usr/local/vw/rtems/rtems-4.10.2/bin/m68k-rtems4.10.2-g++ -B/usr/local/rtems/rtems-4.10.2/m68k-rtems4.10.2/uC5282/lib/ -specs bsp_specs -qrtems   -c   -mcpu=5282                  -DUNIX      -O2 -g -g   -Wall       -DMY_DO_BOOTP=NULL     -MMD -I. -I../O.Common -I. -I.. -I../../../../include/os/RTEMS -I../../../../include         ../epicsTimerTest.cpp 

/usr/local/vw/rtems/rtems-4.10.2/bin/m68k-rtems4.10.2-gcc --pipe -B/usr/local/rtems/rtems-4.10.2/m68k-rtems4.10.2/uC5282/lib/ -specs bsp_specs -qrtems   -fasm -c   -mcpu=5282                  -DUNIX      -O2 -g -g   -Wall       -DMY_DO_BOOTP=NULL     -MMD -I. -I../O.Common -I. -I.. -I../../../../include/os/RTEMS -I../../../../include         ../ringPointerTest.c 

/usr/local/vw/rtems/rtems-4.10.2/bin/m68k-rtems4.10.2-gcc --pipe -B/usr/local/rtems/rtems-4.10.2/m68k-rtems4.10.2/uC5282/lib/ -specs bsp_specs -qrtems   -fasm -c   -mcpu=5282                  -DUNIX      -O2 -g -g   -Wall       -DMY_DO_BOOTP=NULL     -MMD -I. -I../O.Common -I. -I.. -I../../../../include/os/RTEMS -I../../../../include         ../ringBytesTest.c 

/usr/local/vw/rtems/rtems-4.10.2/bin/m68k-rtems4.10.2-g++ -B/usr/local/rtems/rtems-4.10.2/m68k-rtems4.10.2/uC5282/lib/ -specs bsp_specs -qrtems   -c   -mcpu=5282                  -DUNIX      -O2 -g -g   -Wall       -DMY_DO_BOOTP=NULL     -MMD -I. -I../O.Common -I. -I.. -I../../../../include/os/RTEMS -I../../../../include         ../epicsEventTest.cpp 

/usr/local/vw/rtems/rtems-4.10.2/bin/m68k-rtems4.10.2-g++ -B/usr/local/rtems/rtems-4.10.2/m68k-rtems4.10.2/uC5282/lib/ -specs bsp_specs -qrtems   -c   -mcpu=5282                  -DUNIX      -O2 -g -g   -Wall       -DMY_DO_BOOTP=NULL     -MMD -I. -I../O.Common -I. -I.. -I../../../../include/os/RTEMS -I../../../../include         ../epicsMutexTest.cpp 

/usr/local/vw/rtems/rtems-4.10.2/bin/m68k-rtems4.10.2-gcc --pipe -B/usr/local/rtems/rtems-4.10.2/m68k-rtems4.10.2/uC5282/lib/ -specs bsp_specs -qrtems   -fasm -c   -mcpu=5282                  -DUNIX      -O2 -g -g   -Wall       -DMY_DO_BOOTP=NULL     -MMD -I. -I../O.Common -I. -I.. -I../../../../include/os/RTEMS -I../../../../include         ../macEnvExpandTest.c 

/usr/local/vw/rtems/rtems-4.10.2/bin/m68k-rtems4.10.2-gcc --pipe -B/usr/local/rtems/rtems-4.10.2/m68k-rtems4.10.2/uC5282/lib/ -specs bsp_specs -qrtems   -fasm -c   -mcpu=5282                  -DUNIX      -O2 -g -g   -Wall       -DMY_DO_BOOTP=NULL     -MMD -I. -I../O.Common -I. -I.. -I../../../../include/os/RTEMS -I../../../../include         ../macLibTest.c 

/usr/local/vw/rtems/rtems-4.10.2/bin/m68k-rtems4.10.2-gcc --pipe -B/usr/local/rtems/rtems-4.10.2/m68k-rtems4.10.2/uC5282/lib/ -specs bsp_specs -qrtems   -fasm -c   -mcpu=5282                  -DUNIX      -O2 -g -g   -Wall       -DMY_DO_BOOTP=NULL     -MMD -I. -I../O.Common -I. -I.. -I../../../../include/os/RTEMS -I../../../../include         ../taskwdTest.c 

/usr/local/vw/rtems/rtems-4.10.2/bin/m68k-rtems4.10.2-g++ -B/usr/local/rtems/rtems-4.10.2/m68k-rtems4.10.2/uC5282/lib/ -specs bsp_specs -qrtems   -c   -mcpu=5282                  -DUNIX      -O2 -g -g   -Wall       -DMY_DO_BOOTP=NULL     -MMD -I. -I../O.Common -I. -I.. -I../../../../include/os/RTEMS -I../../../../include         ../blockingSockTest.cpp 

/usr/local/vw/rtems/rtems-4.10.2/bin/m68k-rtems4.10.2-g++ -B/usr/local/rtems/rtems-4.10.2/m68k-rtems4.10.2/uC5282/lib/ -specs bsp_specs -qrtems   -c   -mcpu=5282                  -DUNIX      -O2 -g -g   -Wall       -DMY_DO_BOOTP=NULL     -MMD -I. -I../O.Common -I. -I.. -I../../../../include/os/RTEMS -I../../../../include         ../epicsMessageQueueTest.cpp 

/usr/local/vw/rtems/rtems-4.10.2/bin/m68k-rtems4.10.2-gcc --pipe -B/usr/local/rtems/rtems-4.10.2/m68k-rtems4.10.2/uC5282/lib/ -specs bsp_specs -qrtems   -fasm -c   -mcpu=5282                  -DUNIX      -O2 -g -g   -Wall       -DMY_DO_BOOTP=NULL     -MMD -I. -I../O.Common -I. -I.. -I../../../../include/os/RTEMS -I../../../../include         ../epicsRunLibComTests.c 

/usr/local/vw/rtems/rtems-4.10.2/bin/m68k-rtems4.10.2-g++ -B/usr/local/rtems/rtems-4.10.2/m68k-rtems4.10.2/uC5282/lib/ -specs bsp_specs -qrtems   -c   -mcpu=5282                  -DUNIX      -O2 -g -g   -Wall       -DMY_DO_BOOTP=NULL     -MMD -I. -I../O.Common -I. -I.. -I../../../../include/os/RTEMS -I../../../../include         ../epicsThreadPerform.cpp 

/usr/local/vw/rtems/rtems-4.10.2/bin/m68k-rtems4.10.2-gcc --pipe -B/usr/local/rtems/rtems-4.10.2/m68k-rtems4.10.2/uC5282/lib/ -specs bsp_specs -qrtems   -fasm -c   -mcpu=5282                  -DUNIX      -O2 -g -g   -Wall       -DMY_DO_BOOTP=NULL     -MMD -I. -I../O.Common -I. -I.. -I../../../../include/os/RTEMS -I../../../../include         ../epicsMaxThreads.c 

/usr/local/vw/rtems/rtems-4.10.2/bin/m68k-rtems4.10.2-gcc --pipe -B/usr/local/rtems/rtems-4.10.2/m68k-rtems4.10.2/uC5282/lib/ -specs bsp_specs -qrtems   -fasm -c   -mcpu=5282                  -DUNIX      -O2 -g -g   -Wall       -DMY_DO_BOOTP=NULL     -MMD -I. -I../O.Common -I. -I.. -I../../../../include/os/RTEMS -I../../../../include         ../buckTest.c 

/usr/local/vw/rtems/rtems-4.10.2/bin/m68k-rtems4.10.2-g++ -B/usr/local/rtems/rtems-4.10.2/m68k-rtems4.10.2/uC5282/lib/ -specs bsp_specs -qrtems   -c   -mcpu=5282                  -DUNIX      -O2 -g -g   -Wall       -DMY_DO_BOOTP=NULL     -MMD -I. -I../O.Common -I. -I.. -I../../../../include/os/RTEMS -I../../../../include         ../cvtFastPerform.cpp 
/usr/local/vw/rtems/rtems-4.10.2/bin/m68k-rtems4.10.2-g++ -B/usr/local/rtems/rtems-4.10.2/m68k-rtems4.10.2/uC5282/lib/ -specs bsp_specs -qrtems   -o rtemsTestHarness -static -L/Jenkins/jenkins/jobs/epics-base-3.14/workspace/lib/RTEMS-uC5282           -mcpu=5282 -u Init /usr/local/rtems/rtems-4.10.2/m68k-rtems4.10.2/uC5282/lib/no-dpmem.rel /usr/local/rtems/rtems-4.10.2/m68k-rtems4.10.2/uC5282/lib/no-mp.rel /usr/local/rtems/rtems-4.10.2/m68k-rtems4.10.2/uC5282/lib/no-part.rel /usr/local/rtems/rtems-4.10.2/m68k-rtems4.10.2/uC5282/lib/no-signal.rel /usr/local/rtems/rtems-4.10.2/m68k-rtems4.10.2/uC5282/lib/no-rtmon.rel            epicsTimeZoneTest.o rtemsTestHarness.o epicsCalcTest.o epicsAlgorithmTest.o epicsMathTest.o epicsEllTest.o epicsEnvTest.o epicsErrlogTest.o epicsStdioTest.o epicsSockResolveTest.o epicsStringTest.o epicsTimeTest.o epicsThreadTest.o epicsThreadOnceTest.o epicsThreadPriorityTest.o epicsThreadPrivateTest.o epicsExitTest.o epicsTimerTest.o ringPointerTest.o !
 ringBytesTest.o epicsEventTest.o epicsMutexTest.o macEnvExpandTest.o macLibTest.o taskwdTest.o blockingSockTest.o epicsMessageQueueTest.o epicsRunLibComTests.o epicsThreadPerform.o epicsMaxThreads.o buckTest.o cvtFastPerform.o    -lCom      -lreadline -lncurses -lm -lrtemsCom -lc -lrtemscpu -lCom -lnfs -lm -lgcc
epicsRunLibComTests.o: In function `epicsRunLibComTests':
/Jenkins/jenkins/jobs/epics-base-3.14/workspace/src/libCom/test/O.RTEMS-uC5282/../epicsRunLibComTests.c:75: undefined reference to `epicsExceptionTest'
collect2: ld returned 1 exit status
make[3]: *** [rtemsTestHarness] Error 1
make[3]: Leaving directory `/Jenkins/jenkins/jobs/epics-base-3.14/workspace/src/libCom/test/O.RTEMS-uC5282'
make[2]: *** [RTEMS-uC5282] Error 2
make[2]: Leaving directory `/Jenkins/jenkins/jobs/epics-base-3.14/workspace/src/libCom/test'
make[1]: *** [libCom/test.RTEMS-uC5282] Error 2
make[1]: Leaving directory `/Jenkins/jenkins/jobs/epics-base-3.14/workspace/src'
make: *** [src.RTEMS-uC5282] Error 2
Build step 'Execute shell' marked build as failure
[WARNINGS] Skipping publisher since build result is FAILURE


Replies:
Jenkins build is back to normal : epics-base-3.14-rtems #136 APS Jenkins

Navigate by Date:
Prev: RE: FW: EPICS Mark Rivers
Next: Jenkins build is back to normal : epics-base-3.14-rtems #136 APS Jenkins
Index: 2002  2003  2004  2005  2006  2007  2008  2009  2010  2011  2012  2013  2014  2015  <20162017  2018  2019  2020 
Navigate by Thread:
Prev: RE: FW: EPICS Mark Rivers
Next: Jenkins build is back to normal : epics-base-3.14-rtems #136 APS Jenkins
Index: 2002  2003  2004  2005  2006  2007  2008  2009  2010  2011  2012  2013  2014  2015  <20162017  2018  2019  2020 
ANJ, 06 Jul 2016 Valid HTML 4.01! · Home · News · About · Base · Modules · Extensions · Distributions · Download ·
· Search · EPICS V4 · IRMIS · Talk · Bugs · Documents · Links · Licensing ·