Argonne National Laboratory

Experimental Physics and
Industrial Control System

2002  2003  2004  2005  2006  2007  2008  2009  2010  2011  2012  2013  2014  2015  2016  2017  <20182019  2020  2021  Index 2002  2003  2004  2005  2006  2007  2008  2009  2010  2011  2012  2013  2014  2015  2016  2017  <20182019  2020  2021 
<== Date ==> <== Thread ==>

Subject: Build failed in Jenkins: epics-base-3.14-test #40
From: APS Jenkins <aps-jenkins@anl.gov>
To: core-talk@aps.anl.gov
Date: Wed, 23 May 2018 02:29:54 -0500 (CDT)
See <https://jenkins.aps.anl.gov/job/epics-base-3.14-test/40/display/redirect>

------------------------------------------
[...truncated 862 B...]
+ make -j4 --no-print-directory junitfiles CROSS_COMPILER_TARGET_ARCHS=
make -C ./configure junitfiles 
make -C O.linux-x86_64 -f ../Makefile TOP=../.. \
    T_A=linux-x86_64 junitfiles
make[2]: Nothing to be done for 'junitfiles'.
make -C ./src junitfiles 
make -C ./tools junitfiles 
make -C O.linux-x86_64 -f ../Makefile TOP=../../.. \
    T_A=linux-x86_64 junitfiles
make[3]: Nothing to be done for 'junitfiles'.
make -C ./makeBaseApp junitfiles 
make -C ./makeBaseExt junitfiles 
make -C ./libCom junitfiles 
make -C O.linux-x86_64 -f ../Makefile TOP=../../.. \
    T_A=linux-x86_64 junitfiles
make -C O.linux-x86_64 -f ../Makefile TOP=../../.. \
    T_A=linux-x86_64 junitfiles
make -C O.linux-x86_64 -f ../Makefile TOP=../../.. \
    T_A=linux-x86_64 junitfiles
make[3]: Nothing to be done for 'junitfiles'.
make[3]: Nothing to be done for 'junitfiles'.
make[3]: Nothing to be done for 'junitfiles'.
make -C ./toolsComm junitfiles 
make -C ./ca junitfiles 
make -C ./RTEMS junitfiles 
make -C O.linux-x86_64 -f ../Makefile TOP=../../.. \
    T_A=linux-x86_64 junitfiles
make -C ./antelope junitfiles 
make -C O.linux-x86_64 -f ../Makefile TOP=../../../.. \
    T_A=linux-x86_64 junitfiles
make -C ./base junitfiles 
make -C O.linux-x86_64 -f ../Makefile TOP=../../../.. \
    T_A=linux-x86_64 junitfiles
make[3]: Nothing to be done for 'junitfiles'.
make -C ./util junitfiles 
make -C ./gdd junitfiles 
make[4]: Nothing to be done for 'junitfiles'.
make -C ./flex junitfiles 
make -C O.linux-x86_64 -f ../Makefile TOP=../../.. \
    T_A=linux-x86_64 junitfiles
make[4]: Nothing to be done for 'junitfiles'.
make -C libCom/test junitfiles 
make -C O.linux-x86_64 -f ../Makefile TOP=../../.. \
    T_A=linux-x86_64 junitfiles
make -C O.linux-x86_64 -f ../Makefile TOP=../../../.. \
    T_A=linux-x86_64 junitfiles
make -C O.linux-x86_64 -f ../Makefile TOP=../../../.. \
    T_A=linux-x86_64 junitfiles
make[3]: Nothing to be done for 'junitfiles'.
make[4]: Nothing to be done for 'junitfiles'.
make -C ./dbStatic junitfiles 
make[3]: Nothing to be done for 'junitfiles'.
perl epicsUnitTestTest.t -tap > epicsUnitTestTest.tap
perl epicsCalcTest.t -tap > epicsCalcTest.tap
perl epicsAlgorithmTest.t -tap > epicsAlgorithmTest.tap
perl epicsMathTest.t -tap > epicsMathTest.tap
make -C O.linux-x86_64 -f ../Makefile TOP=../../.. \
    T_A=linux-x86_64 junitfiles
perl epicsEllTest.t -tap > epicsEllTest.tap
perl epicsEnvTest.t -tap > epicsEnvTest.tap
perl epicsErrlogTest.t -tap > epicsErrlogTest.tap
perl epicsStdioTest.t -tap > epicsStdioTest.tap
perl epicsSockResolveTest.t -tap > epicsSockResolveTest.tap
make[3]: Nothing to be done for 'junitfiles'.
perl epicsStringTest.t -tap > epicsStringTest.tap
make -C ./registry junitfiles 
perl epicsTimeTest.t -tap > epicsTimeTest.tap
make -C O.linux-x86_64 -f ../Makefile TOP=../../.. \
    T_A=linux-x86_64 junitfiles
make[3]: Nothing to be done for 'junitfiles'.
make -C ./bpt junitfiles 
make -C O.linux-x86_64 -f ../Makefile TOP=../../.. \
    T_A=linux-x86_64 junitfiles
perl epicsTimeZoneTest.t -tap > epicsTimeZoneTest.tap
perl epicsThreadTest.t -tap > epicsThreadTest.tap
perl epicsThreadOnceTest.t -tap > epicsThreadOnceTest.tap
make[3]: Nothing to be done for 'junitfiles'.
make -C ./catools junitfiles 
make -C O.linux-x86_64 -f ../Makefile TOP=../../.. \
    T_A=linux-x86_64 junitfiles
Recursive epicsThreadOnce() initialization
Thread recurse (0xac2840) can't proceed, suspending.
make[3]: Nothing to be done for 'junitfiles'.
make -C ./cas junitfiles 
make -C ./build junitfiles 
make -C O.linux-x86_64 -f ../Makefile TOP=../../../.. \
    T_A=linux-x86_64 junitfiles
make[4]: Nothing to be done for 'junitfiles'.
make -C ./example junitfiles 
make -C ./directoryService junitfiles 
make -C O.linux-x86_64 -f ../Makefile TOP=../../../../.. \
    T_A=linux-x86_64 junitfiles
make[5]: Nothing to be done for 'junitfiles'.
make -C ./cap5 junitfiles 
make -C O.linux-x86_64 -f ../Makefile TOP=../../.. \
    T_A=linux-x86_64 junitfiles
make[3]: Nothing to be done for 'junitfiles'.
make -C ./db junitfiles 
make -C O.linux-x86_64 -f ../Makefile TOP=../../.. \
    T_A=linux-x86_64 junitfiles
make[3]: Nothing to be done for 'junitfiles'.
make -C ./as junitfiles 
make -C O.linux-x86_64 -f ../Makefile TOP=../../.. \
    T_A=linux-x86_64 junitfiles
perl epicsThreadPriorityTest.t -tap > epicsThreadPriorityTest.tap
make[3]: Nothing to be done for 'junitfiles'.
make -C ./dbtools junitfiles 
make -C O.linux-x86_64 -f ../Makefile TOP=../../.. \
    T_A=linux-x86_64 junitfiles
make[3]: Nothing to be done for 'junitfiles'.
make -C ./rsrv junitfiles 
make -C O.linux-x86_64 -f ../Makefile TOP=../../.. \
    T_A=linux-x86_64 junitfiles
make[3]: Nothing to be done for 'junitfiles'.
make -C ./rec junitfiles 
make -C O.linux-x86_64 -f ../Makefile TOP=../../.. \
    T_A=linux-x86_64 junitfiles
make[3]: Nothing to be done for 'junitfiles'.
make -C db/test junitfiles 
make -C O.linux-x86_64 -f ../Makefile TOP=../../../.. \
    T_A=linux-x86_64 junitfiles
perl callbackTest.t -tap > callbackTest.tap
perl epicsThreadPrivateTest.t -tap > epicsThreadPrivateTest.tap
perl epicsExitTest.t -tap > epicsExitTest.tap
perl epicsTimerTest.t -tap > epicsTimerTest.tap
perl ringPointerTest.t -tap > ringPointerTest.tap
perl ringBytesTest.t -tap > ringBytesTest.tap
perl epicsEventTest.t -tap > epicsEventTest.tap
perl epicsMutexTest.t -tap > epicsMutexTest.tap
perl macEnvExpandTest.t -tap > macEnvExpandTest.tap
macLib: macro FOO is undefined (expanding string ${FOO})
macLib: macro FOO is undefined (expanding string ${FOO,BAR})
macLib: macro FOO is undefined (expanding string ${FOO,BAR=baz})
macLib: macro FOO is undefined (expanding string ${FOO,BAR=$(FOO)})
macLib: macro FOO is undefined (expanding string ${FOO,FOO})
macLib: string ${FOO,FOO=$(FOO)} is recursive (expanding macro FOO)
macLib: macro FOO is undefined (expanding string ${FOO,BAR=baz,FUM})
macLib: macro BAZ is undefined (expanding string ${FOO})
macLib: string ${FOO} is recursive (expanding environment variable FOO)
macLib: string ${FOO,FOO=$(FOO)} is recursive (expanding environment variable FOO)
perl macLibTest.t -tap > macLibTest.tap
perl taskwdTest.t -tap > taskwdTest.tap
perl ../../../../bin/linux-x86_64/tap-to-junit-xml.pl --puretap --output callbackTest.xml --input callbackTest.tap callbackTest
make -C ./excas junitfiles 
make -C O.linux-x86_64 -f ../Makefile TOP=../../.. \
    T_A=linux-x86_64 junitfiles
make[3]: Nothing to be done for 'junitfiles'.
make -C ./misc junitfiles 
perl blockingSockTest.t -tap > blockingSockTest.tap
make -C O.linux-x86_64 -f ../Makefile TOP=../../.. \
    T_A=linux-x86_64 junitfiles
make[3]: Nothing to be done for 'junitfiles'.
make -C ./dev junitfiles 
make -C ./softDev junitfiles 
make -C O.linux-x86_64 -f ../Makefile TOP=../../../.. \
    T_A=linux-x86_64 junitfiles
make[4]: Nothing to be done for 'junitfiles'.
make -C ./testDev junitfiles 
make -C O.linux-x86_64 -f ../Makefile TOP=../../../.. \
    T_A=linux-x86_64 junitfiles
make[4]: Nothing to be done for 'junitfiles'.
perl epicsMessageQueueTest.t -tap > epicsMessageQueueTest.tap
Thread testTask2 (0xdd2690) suspended
perl ipAddrToAsciiTest.t -tap > ipAddrToAsciiTest.tap
make -C ./vxWorks junitfiles 
make -C O.linux-x86_64 -f ../Makefile TOP=../../.. \
    T_A=linux-x86_64 junitfiles
make[3]: Nothing to be done for 'junitfiles'.
make -C ./softIoc junitfiles 
make -C O.linux-x86_64 -f ../Makefile TOP=../../.. \
    T_A=linux-x86_64 junitfiles
make[3]: Nothing to be done for 'junitfiles'.
perl ../../../../bin/linux-x86_64/tap-to-junit-xml.pl --puretap --output epicsUnitTestTest.xml --input epicsUnitTestTest.tap epicsUnitTestTest
perl ../../../../bin/linux-x86_64/tap-to-junit-xml.pl --puretap --output epicsCalcTest.xml --input epicsCalcTest.tap epicsCalcTest
perl ../../../../bin/linux-x86_64/tap-to-junit-xml.pl --puretap --output epicsAlgorithmTest.xml --input epicsAlgorithmTest.tap epicsAlgorithmTest
perl ../../../../bin/linux-x86_64/tap-to-junit-xml.pl --puretap --output epicsMathTest.xml --input epicsMathTest.tap epicsMathTest
perl ../../../../bin/linux-x86_64/tap-to-junit-xml.pl --puretap --output epicsEllTest.xml --input epicsEllTest.tap epicsEllTest
perl ../../../../bin/linux-x86_64/tap-to-junit-xml.pl --puretap --output epicsEnvTest.xml --input epicsEnvTest.tap epicsEnvTest
perl ../../../../bin/linux-x86_64/tap-to-junit-xml.pl --puretap --output epicsErrlogTest.xml --input epicsErrlogTest.tap epicsErrlogTest
perl ../../../../bin/linux-x86_64/tap-to-junit-xml.pl --puretap --output epicsStdioTest.xml --input epicsStdioTest.tap epicsStdioTest
perl ../../../../bin/linux-x86_64/tap-to-junit-xml.pl --puretap --output epicsSockResolveTest.xml --input epicsSockResolveTest.tap epicsSockResolveTest
perl ../../../../bin/linux-x86_64/tap-to-junit-xml.pl --puretap --output epicsStringTest.xml --input epicsStringTest.tap epicsStringTest
perl ../../../../bin/linux-x86_64/tap-to-junit-xml.pl --puretap --output epicsTimeTest.xml --input epicsTimeTest.tap epicsTimeTest
perl ../../../../bin/linux-x86_64/tap-to-junit-xml.pl --puretap --output epicsTimeZoneTest.xml --input epicsTimeZoneTest.tap epicsTimeZoneTest
perl ../../../../bin/linux-x86_64/tap-to-junit-xml.pl --puretap --output epicsThreadTest.xml --input epicsThreadTest.tap epicsThreadTest
perl ../../../../bin/linux-x86_64/tap-to-junit-xml.pl --puretap --output epicsThreadOnceTest.xml --input epicsThreadOnceTest.tap epicsThreadOnceTest
perl ../../../../bin/linux-x86_64/tap-to-junit-xml.pl --puretap --output epicsThreadPriorityTest.xml --input epicsThreadPriorityTest.tap epicsThreadPriorityTest
perl ../../../../bin/linux-x86_64/tap-to-junit-xml.pl --puretap --output epicsThreadPrivateTest.xml --input epicsThreadPrivateTest.tap epicsThreadPrivateTest
perl ../../../../bin/linux-x86_64/tap-to-junit-xml.pl --puretap --output epicsExitTest.xml --input epicsExitTest.tap epicsExitTest
perl ../../../../bin/linux-x86_64/tap-to-junit-xml.pl --puretap --output epicsTimerTest.xml --input epicsTimerTest.tap epicsTimerTest
perl ../../../../bin/linux-x86_64/tap-to-junit-xml.pl --puretap --output ringPointerTest.xml --input ringPointerTest.tap ringPointerTest
perl ../../../../bin/linux-x86_64/tap-to-junit-xml.pl --puretap --output ringBytesTest.xml --input ringBytesTest.tap ringBytesTest
perl ../../../../bin/linux-x86_64/tap-to-junit-xml.pl --puretap --output epicsEventTest.xml --input epicsEventTest.tap epicsEventTest
perl ../../../../bin/linux-x86_64/tap-to-junit-xml.pl --puretap --output epicsMutexTest.xml --input epicsMutexTest.tap epicsMutexTest
perl ../../../../bin/linux-x86_64/tap-to-junit-xml.pl --puretap --output macEnvExpandTest.xml --input macEnvExpandTest.tap macEnvExpandTest
perl ../../../../bin/linux-x86_64/tap-to-junit-xml.pl --puretap --output macLibTest.xml --input macLibTest.tap macLibTest
perl ../../../../bin/linux-x86_64/tap-to-junit-xml.pl --puretap --output blockingSockTest.xml --input blockingSockTest.tap blockingSockTest
perl ../../../../bin/linux-x86_64/tap-to-junit-xml.pl --puretap --output ipAddrToAsciiTest.xml --input ipAddrToAsciiTest.tap ipAddrToAsciiTest
perl ../../../../bin/linux-x86_64/tap-to-junit-xml.pl --puretap --output taskwdTest.xml --input taskwdTest.tap taskwdTest
perl ../../../../bin/linux-x86_64/tap-to-junit-xml.pl --puretap --output epicsMessageQueueTest.xml --input epicsMessageQueueTest.tap epicsMessageQueueTest
+ make -s test-results CROSS_COMPILER_TARGET_ARCHS=
epicsUnitTestTest.tap ........ ok
epicsCalcTest.tap ............ ok
epicsAlgorithmTest.tap ....... ok
epicsMathTest.tap ............ ok
epicsEllTest.tap ............. ok
epicsEnvTest.tap ............. ok
epicsErrlogTest.tap .......... 
not ok  6 - pvt.count (1) == 2 (2)
not ok  7 - pvt2.count (0) == 1 (1)
Failed 2/25 subtests 
epicsStdioTest.tap ........... ok
epicsSockResolveTest.tap ..... ok
epicsStringTest.tap .......... ok
epicsTimeTest.tap ............ ok
epicsTimeZoneTest.tap ........ ok
epicsThreadTest.tap .......... ok
epicsThreadOnceTest.tap ...... ok
epicsThreadPriorityTest.tap .. ok
epicsThreadPrivateTest.tap ... ok
epicsExitTest.tap ............ ok
epicsTimerTest.tap ........... ok
ringPointerTest.tap .......... ok
ringBytesTest.tap ............ ok
epicsEventTest.tap ........... ok
epicsMutexTest.tap ........... ok
macEnvExpandTest.tap ......... ok
macLibTest.tap ............... ok
taskwdTest.tap ............... ok
blockingSockTest.tap ......... ok
epicsMessageQueueTest.tap .... ok
ipAddrToAsciiTest.tap ........ ok

Test Summary Report
-------------------
epicsErrlogTest.tap        (Wstat: 0 Tests: 25 Failed: 2)
  Failed tests:  6-7
Files=28, Tests=2298,  0 wallclock secs ( 0.20 usr  0.02 sys +  0.01 cusr  0.02 csys =  0.25 CPU)
Result: FAIL
../../../../configure/RULES_BUILD:360: recipe for target 'test-results' failed
make[3]: *** [test-results] Error 1
../../../configure/RULES_ARCHS:61: recipe for target 'test-results.linux-x86_64' failed
make[2]: *** [test-results.linux-x86_64] Error 2
../configure/RULES_DIRS:83: recipe for target 'libCom/test.test-results' failed
make[1]: *** [libCom/test.test-results] Error 2
configure/RULES_DIRS:83: recipe for target 'src.test-results' failed
make: *** [src.test-results] Error 2
Build step 'Execute shell' marked build as failure
Recording test results

Replies:
Jenkins build is back to normal : epics-base-3.14-test #41 APS Jenkins

Navigate by Date:
Prev: Jenkins build is back to normal : epics-base-3.14-win64s #245 APS Jenkins
Next: Jenkins build is back to normal : epics-base-3.14-test #41 APS Jenkins
Index: 2002  2003  2004  2005  2006  2007  2008  2009  2010  2011  2012  2013  2014  2015  2016  2017  <20182019  2020  2021 
Navigate by Thread:
Prev: Jenkins build is back to normal : epics-base-3.14-win32 #279 APS Jenkins
Next: Jenkins build is back to normal : epics-base-3.14-test #41 APS Jenkins
Index: 2002  2003  2004  2005  2006  2007  2008  2009  2010  2011  2012  2013  2014  2015  2016  2017  <20182019  2020  2021 
ANJ, 24 May 2018 Valid HTML 4.01! · Home · News · About · Base · Modules · Extensions · Distributions · Download ·
· Search · EPICS V4 · IRMIS · Talk · Bugs · Documents · Links · Licensing ·