Argonne National Laboratory

Experimental Physics and
Industrial Control System

2002  2003  2004  2005  2006  2007  2008  2009  2010  2011  2012  2013  2014  2015  2016  2017  <20182019  2020  2021  Index 2002  2003  2004  2005  2006  2007  2008  2009  2010  2011  2012  2013  2014  2015  2016  2017  <20182019  2020  2021 
<== Date ==> <== Thread ==>

Subject: Build failed in Jenkins: epics-7.0-windows » STATIC,win64 #45
From: APS Jenkins <aps-jenkins@anl.gov>
To: core-talk@aps.anl.gov
Date: Thu, 21 Jun 2018 01:05:12 -0500 (CDT)
See <https://jenkins.aps.anl.gov/job/epics-7.0-windows/LIBRARIES=STATIC,OS=win64/45/display/redirect>

------------------------------------------
[...truncated 2.34 MB...]
Appending configparse.obj
Appending pdbgroup.obj
Appending imagedemo.obj
Appending demo.obj
Appending pdbsingle.obj
Appending pdb.obj
Appending qsrv.obj
Appending pvif.obj
make[4]: Leaving directory '<https://jenkins.aps.anl.gov/job/epics-7.0-windows/LIBRARIES=STATIC,OS=win64/ws/modules/pva2pva/pdbApp/O.windows-x64-static'>
make[4]: Entering directory '<https://jenkins.aps.anl.gov/job/epics-7.0-windows/LIBRARIES=STATIC,OS=win64/ws/modules/pvaClient/src/O.windows-x64-static'>
cl -EHsc -GR               -nologo -FC -D__STDC__=0 -D_CRT_SECURE_NO_DEPRECATE -D_CRT_NONSTDC_NO_DEPRECATE   -Ox -Oy-   -W3 -w44355 -w44344 -w44251        -MT  -TP  -I. -I../O.Common -I. -I. -I.. -I<https://jenkins.aps.anl.gov/job/epics-7.0-windows/LIBRARIES=STATIC,OS=win64/ws/include/compiler/msvc> -I<https://jenkins.aps.anl.gov/job/epics-7.0-windows/LIBRARIES=STATIC,OS=win64/ws/include/os/WIN32> -I<https://jenkins.aps.anl.gov/job/epics-7.0-windows/LIBRARIES=STATIC,OS=win64/ws/include> -I<https://jenkins.aps.anl.gov/job/epics-7.0-windows/LIBRARIES=STATIC,OS=win64/ws/include/compiler/msvc> -I<https://jenkins.aps.anl.gov/job/epics-7.0-windows/LIBRARIES=STATIC,OS=win64/ws/include/os/WIN32> -I<https://jenkins.aps.anl.gov/job/epics-7.0-windows/LIBRARIES=STATIC,OS=win64/ws/include>        -c ../pvaClientNTMultiMonitor.cpp
pvaClientNTMultiMonitor.cpp
c:\jenkins\win64-1\workspace\epics-7.0-windows\libraries\static\os\win64\include\pv\pvdata.h(508): warning C4800: 'char': forcing value to bool 'true' or 'false' (performance warning)
c:\jenkins\win64-1\workspace\epics-7.0-windows\libraries\static\os\win64\include\pv\pvdata.h(558): warning C4250: 'epics::pvData::PVString': inherits 'epics::pvData::PVScalarValue<std::string>::epics::pvData::PVScalarValue<std::string>::deserialize' via dominance
c:\jenkins\win64-1\workspace\epics-7.0-windows\libraries\static\os\win64\include\pv\pvdata.h(461): note: see declaration of 'epics::pvData::PVScalarValue<std::string>::deserialize'
make[4]: Leaving directory '<https://jenkins.aps.anl.gov/job/epics-7.0-windows/LIBRARIES=STATIC,OS=win64/ws/modules/pvaClient/src/O.windows-x64-static'>
make[4]: Entering directory '<https://jenkins.aps.anl.gov/job/epics-7.0-windows/LIBRARIES=STATIC,OS=win64/ws/modules/pvaClient/src/O.windows-x64-static'>
cl -EHsc -GR               -nologo -FC -D__STDC__=0 -D_CRT_SECURE_NO_DEPRECATE -D_CRT_NONSTDC_NO_DEPRECATE   -Ox -Oy-   -W3 -w44355 -w44344 -w44251        -MT  -TP  -I. -I../O.Common -I. -I. -I.. -I<https://jenkins.aps.anl.gov/job/epics-7.0-windows/LIBRARIES=STATIC,OS=win64/ws/include/compiler/msvc> -I<https://jenkins.aps.anl.gov/job/epics-7.0-windows/LIBRARIES=STATIC,OS=win64/ws/include/os/WIN32> -I<https://jenkins.aps.anl.gov/job/epics-7.0-windows/LIBRARIES=STATIC,OS=win64/ws/include> -I<https://jenkins.aps.anl.gov/job/epics-7.0-windows/LIBRARIES=STATIC,OS=win64/ws/include/compiler/msvc> -I<https://jenkins.aps.anl.gov/job/epics-7.0-windows/LIBRARIES=STATIC,OS=win64/ws/include/os/WIN32> -I<https://jenkins.aps.anl.gov/job/epics-7.0-windows/LIBRARIES=STATIC,OS=win64/ws/include>        -c ../pvaClientRPC.cpp
pvaClientRPC.cpp
c:\jenkins\win64-1\workspace\epics-7.0-windows\libraries\static\os\win64\include\pv\pvdata.h(508): warning C4800: 'char': forcing value to bool 'true' or 'false' (performance warning)
c:\jenkins\win64-1\workspace\epics-7.0-windows\libraries\static\os\win64\include\pv\pvdata.h(558): warning C4250: 'epics::pvData::PVString': inherits 'epics::pvData::PVScalarValue<std::string>::epics::pvData::PVScalarValue<std::string>::deserialize' via dominance
c:\jenkins\win64-1\workspace\epics-7.0-windows\libraries\static\os\win64\include\pv\pvdata.h(461): note: see declaration of 'epics::pvData::PVScalarValue<std::string>::deserialize'
make[4]: Leaving directory '<https://jenkins.aps.anl.gov/job/epics-7.0-windows/LIBRARIES=STATIC,OS=win64/ws/modules/pvaClient/src/O.windows-x64-static'>
make[4]: Entering directory '<https://jenkins.aps.anl.gov/job/epics-7.0-windows/LIBRARIES=STATIC,OS=win64/ws/modules/pva2pva/pdbApp/O.windows-x64-static'>
link -nologo   -incremental:no -opt:ref -release  -MACHINE:X64              -out:softIocPVA.exe       softMain.obj softIocPVA_registerRecordDeviceDriver.obj     <https://jenkins.aps.anl.gov/job/epics-7.0-windows/LIBRARIES=STATIC,OS=win64/ws/lib/windows-x64-static/qsrv.lib>  <https://jenkins.aps.anl.gov/job/epics-7.0-windows/LIBRARIES=STATIC,OS=win64/ws/lib/windows-x64-static/pvAccessIOC.lib>  <https://jenkins.aps.anl.gov/job/epics-7.0-windows/LIBRARIES=STATIC,OS=win64/ws/lib/windows-x64-static/pvAccessCA.lib>  <https://jenkins.aps.anl.gov/job/epics-7.0-windows/LIBRARIES=STATIC,OS=win64/ws/lib/windows-x64-static/pvAccess.lib>  <https://jenkins.aps.anl.gov/job/epics-7.0-windows/LIBRARIES=STATIC,OS=win64/ws/lib/windows-x64-static/pvData.lib>  <https://jenkins.aps.anl.gov/job/epics-7.0-windows/LIBRARIES=STATIC,OS=win64/ws/lib/windows-x64-static/dbRecStd.lib>  <https://jenkins.aps.anl.gov/job/epics-7.0-windows/LIBRARIES=STATIC,OS=win64/ws/lib/windows-x64-static/dbCore.lib>  <https://jenkins.aps.anl.gov/job/epics-7.0-windows/LIBRARIES=STATIC,OS=win64/ws/lib/windows-x64-static/ca.lib>  <https://jenkins.aps.anl.gov/job/epics-7.0-windows/LIBRARIES=STATIC,OS=win64/ws/lib/windows-x64-static/Com.lib>   ws2_32.lib advapi32.lib user32.lib kernel32.lib winmm.lib     
make[4]: Leaving directory '<https://jenkins.aps.anl.gov/job/epics-7.0-windows/LIBRARIES=STATIC,OS=win64/ws/modules/pva2pva/pdbApp/O.windows-x64-static'>
make[4]: Entering directory '<https://jenkins.aps.anl.gov/job/epics-7.0-windows/LIBRARIES=STATIC,OS=win64/ws/modules/pvaClient/src/O.windows-x64-static'>
lib -nologo -verbose -out:pvaClient.lib         pvaClient.obj pvaClientPutData.obj pvaClientGetData.obj pvaClientMonitorData.obj pvaClientChannel.obj pvaClientProcess.obj pvaClientGet.obj pvaClientPut.obj pvaClientMonitor.obj pvaClientPutGet.obj pvaClientMultiChannel.obj pvaClientMultiGetDouble.obj pvaClientMultiPutDouble.obj pvaClientMultiMonitorDouble.obj pvaClientNTMultiPut.obj pvaClientNTMultiData.obj pvaClientNTMultiGet.obj pvaClientNTMultiMonitor.obj pvaClientRPC.obj
Appending pvaClientRPC.obj
Appending pvaClientNTMultiMonitor.obj
Appending pvaClientNTMultiGet.obj
Appending pvaClientNTMultiData.obj
Appending pvaClientNTMultiPut.obj
Appending pvaClientMultiMonitorDouble.obj
Appending pvaClientMultiPutDouble.obj
Appending pvaClientMultiGetDouble.obj
Appending pvaClientMultiChannel.obj
Appending pvaClientPutGet.obj
Appending pvaClientMonitor.obj
Appending pvaClientPut.obj
Appending pvaClientGet.obj
Appending pvaClientProcess.obj
Appending pvaClientChannel.obj
Appending pvaClientMonitorData.obj
Appending pvaClientGetData.obj
Appending pvaClientPutData.obj
Appending pvaClient.obj
make[4]: Leaving directory '<https://jenkins.aps.anl.gov/job/epics-7.0-windows/LIBRARIES=STATIC,OS=win64/ws/modules/pvaClient/src/O.windows-x64-static'>
make -C ./testApp install 
make[3]: Entering directory '<https://jenkins.aps.anl.gov/job/epics-7.0-windows/LIBRARIES=STATIC,OS=win64/ws/modules/pva2pva/testApp'>
perl -CSD <https://jenkins.aps.anl.gov/job/epics-7.0-windows/LIBRARIES=STATIC,OS=win64/ws/bin/windows-x64-static/makeMakefile.pl> O.windows-x64-static ../..
make[3]: Leaving directory '<https://jenkins.aps.anl.gov/job/epics-7.0-windows/LIBRARIES=STATIC,OS=win64/ws/modules/pva2pva/testApp'>
make[3]: Entering directory '<https://jenkins.aps.anl.gov/job/epics-7.0-windows/LIBRARIES=STATIC,OS=win64/ws/modules/pva2pva/testApp'>
perl -CSD -MExtUtils::Command -e mkpath O.Common
make[3]: Leaving directory '<https://jenkins.aps.anl.gov/job/epics-7.0-windows/LIBRARIES=STATIC,OS=win64/ws/modules/pva2pva/testApp'>
make -C O.windows-x64-static -f ../Makefile TOP=../.. \
    T_A=windows-x64-static install
make[4]: Entering directory '<https://jenkins.aps.anl.gov/job/epics-7.0-windows/LIBRARIES=STATIC,OS=win64/ws/modules/pva2pva/testApp/O.windows-x64-static'>
perl -CSD <https://jenkins.aps.anl.gov/job/epics-7.0-windows/LIBRARIES=STATIC,OS=win64/ws/bin/windows-x64-static/mkmf.pl>  -m check_consist.d -I. -I../O.Common -I. -I. -I.. -I<https://jenkins.aps.anl.gov/job/epics-7.0-windows/LIBRARIES=STATIC,OS=win64/ws/include/compiler/msvc> -I<https://jenkins.aps.anl.gov/job/epics-7.0-windows/LIBRARIES=STATIC,OS=win64/ws/include/os/WIN32> -I<https://jenkins.aps.anl.gov/job/epics-7.0-windows/LIBRARIES=STATIC,OS=win64/ws/include> -I<https://jenkins.aps.anl.gov/job/epics-7.0-windows/LIBRARIES=STATIC,OS=win64/ws/include/compiler/msvc> -I<https://jenkins.aps.anl.gov/job/epics-7.0-windows/LIBRARIES=STATIC,OS=win64/ws/include/os/WIN32> -I<https://jenkins.aps.anl.gov/job/epics-7.0-windows/LIBRARIES=STATIC,OS=win64/ws/include>        check_consist.obj ../check_consist.cpp
make[4]: Leaving directory '<https://jenkins.aps.anl.gov/job/epics-7.0-windows/LIBRARIES=STATIC,OS=win64/ws/modules/pva2pva/testApp/O.windows-x64-static'>
make[4]: Entering directory '<https://jenkins.aps.anl.gov/job/epics-7.0-windows/LIBRARIES=STATIC,OS=win64/ws/modules/pva2pva/testApp/O.windows-x64-static'>
perl -CSD <https://jenkins.aps.anl.gov/job/epics-7.0-windows/LIBRARIES=STATIC,OS=win64/ws/bin/windows-x64-static/mkmf.pl>  -m testgroupconfig.d -I. -I../O.Common -I. -I. -I.. -I<https://jenkins.aps.anl.gov/job/epics-7.0-windows/LIBRARIES=STATIC,OS=win64/ws/include/compiler/msvc> -I<https://jenkins.aps.anl.gov/job/epics-7.0-windows/LIBRARIES=STATIC,OS=win64/ws/include/os/WIN32> -I<https://jenkins.aps.anl.gov/job/epics-7.0-windows/LIBRARIES=STATIC,OS=win64/ws/include> -I<https://jenkins.aps.anl.gov/job/epics-7.0-windows/LIBRARIES=STATIC,OS=win64/ws/include/compiler/msvc> -I<https://jenkins.aps.anl.gov/job/epics-7.0-windows/LIBRARIES=STATIC,OS=win64/ws/include/os/WIN32> -I<https://jenkins.aps.anl.gov/job/epics-7.0-windows/LIBRARIES=STATIC,OS=win64/ws/include>        testgroupconfig.obj ../testgroupconfig.cpp
make[4]: Leaving directory '<https://jenkins.aps.anl.gov/job/epics-7.0-windows/LIBRARIES=STATIC,OS=win64/ws/modules/pva2pva/testApp/O.windows-x64-static'>
make[4]: Entering directory '<https://jenkins.aps.anl.gov/job/epics-7.0-windows/LIBRARIES=STATIC,OS=win64/ws/modules/pva2pva/testApp/O.windows-x64-static'>
perl -CSD <https://jenkins.aps.anl.gov/job/epics-7.0-windows/LIBRARIES=STATIC,OS=win64/ws/bin/windows-x64-static/mkmf.pl>  -m testdbf_copy.d -I. -I../O.Common -I. -I. -I.. -I<https://jenkins.aps.anl.gov/job/epics-7.0-windows/LIBRARIES=STATIC,OS=win64/ws/include/compiler/msvc> -I<https://jenkins.aps.anl.gov/job/epics-7.0-windows/LIBRARIES=STATIC,OS=win64/ws/include/os/WIN32> -I<https://jenkins.aps.anl.gov/job/epics-7.0-windows/LIBRARIES=STATIC,OS=win64/ws/include> -I<https://jenkins.aps.anl.gov/job/epics-7.0-windows/LIBRARIES=STATIC,OS=win64/ws/include/compiler/msvc> -I<https://jenkins.aps.anl.gov/job/epics-7.0-windows/LIBRARIES=STATIC,OS=win64/ws/include/os/WIN32> -I<https://jenkins.aps.anl.gov/job/epics-7.0-windows/LIBRARIES=STATIC,OS=win64/ws/include>        testdbf_copy.obj ../testdbf_copy.cpp
make[4]: Leaving directory '<https://jenkins.aps.anl.gov/job/epics-7.0-windows/LIBRARIES=STATIC,OS=win64/ws/modules/pva2pva/testApp/O.windows-x64-static'>
make[4]: Entering directory '<https://jenkins.aps.anl.gov/job/epics-7.0-windows/LIBRARIES=STATIC,OS=win64/ws/modules/pva2pva/testApp/O.windows-x64-static'>
perl -CSD <https://jenkins.aps.anl.gov/job/epics-7.0-windows/LIBRARIES=STATIC,OS=win64/ws/bin/windows-x64-static/mkmf.pl>  -m testpvalink.d -I. -I../O.Common -I. -I. -I.. -I<https://jenkins.aps.anl.gov/job/epics-7.0-windows/LIBRARIES=STATIC,OS=win64/ws/include/compiler/msvc> -I<https://jenkins.aps.anl.gov/job/epics-7.0-windows/LIBRARIES=STATIC,OS=win64/ws/include/os/WIN32> -I<https://jenkins.aps.anl.gov/job/epics-7.0-windows/LIBRARIES=STATIC,OS=win64/ws/include> -I<https://jenkins.aps.anl.gov/job/epics-7.0-windows/LIBRARIES=STATIC,OS=win64/ws/include/compiler/msvc> -I<https://jenkins.aps.anl.gov/job/epics-7.0-windows/LIBRARIES=STATIC,OS=win64/ws/include/os/WIN32> -I<https://jenkins.aps.anl.gov/job/epics-7.0-windows/LIBRARIES=STATIC,OS=win64/ws/include>        testpvalink.obj ../testpvalink.cpp
make[4]: Leaving directory '<https://jenkins.aps.anl.gov/job/epics-7.0-windows/LIBRARIES=STATIC,OS=win64/ws/modules/pva2pva/testApp/O.windows-x64-static'>
make[4]: Entering directory '<https://jenkins.aps.anl.gov/job/epics-7.0-windows/LIBRARIES=STATIC,OS=win64/ws/modules/pva2pva/testApp/O.windows-x64-static'>
perl -CSD <https://jenkins.aps.anl.gov/job/epics-7.0-windows/LIBRARIES=STATIC,OS=win64/ws/bin/windows-x64-static/dbdExpand.pl>   -I. -I.. -I../O.Common -I<https://jenkins.aps.anl.gov/job/epics-7.0-windows/LIBRARIES=STATIC,OS=win64/ws/dbd> -I<https://jenkins.aps.anl.gov/job/epics-7.0-windows/LIBRARIES=STATIC,OS=win64/ws/dbd> -o pvaLinkTestIoc.dbd base.dbd qsrv.dbd
make[4]: Leaving directory '<https://jenkins.aps.anl.gov/job/epics-7.0-windows/LIBRARIES=STATIC,OS=win64/ws/modules/pva2pva/testApp/O.windows-x64-static'>
make[4]: Entering directory '<https://jenkins.aps.anl.gov/job/epics-7.0-windows/LIBRARIES=STATIC,OS=win64/ws/modules/pva2pva/testApp/O.windows-x64-static'>
perl -CSD <https://jenkins.aps.anl.gov/job/epics-7.0-windows/LIBRARIES=STATIC,OS=win64/ws/bin/windows-x64-static/mkmf.pl>  -m testpvif.d -I. -I../O.Common -I. -I. -I.. -I<https://jenkins.aps.anl.gov/job/epics-7.0-windows/LIBRARIES=STATIC,OS=win64/ws/include/compiler/msvc> -I<https://jenkins.aps.anl.gov/job/epics-7.0-windows/LIBRARIES=STATIC,OS=win64/ws/include/os/WIN32> -I<https://jenkins.aps.anl.gov/job/epics-7.0-windows/LIBRARIES=STATIC,OS=win64/ws/include> -I<https://jenkins.aps.anl.gov/job/epics-7.0-windows/LIBRARIES=STATIC,OS=win64/ws/include/compiler/msvc> -I<https://jenkins.aps.anl.gov/job/epics-7.0-windows/LIBRARIES=STATIC,OS=win64/ws/include/os/WIN32> -I<https://jenkins.aps.anl.gov/job/epics-7.0-windows/LIBRARIES=STATIC,OS=win64/ws/include>        testpvif.obj ../testpvif.cpp
make[4]: Leaving directory '<https://jenkins.aps.anl.gov/job/epics-7.0-windows/LIBRARIES=STATIC,OS=win64/ws/modules/pva2pva/testApp/O.windows-x64-static'>
make[4]: Entering directory '<https://jenkins.aps.anl.gov/job/epics-7.0-windows/LIBRARIES=STATIC,OS=win64/ws/modules/pva2pva/testApp/O.windows-x64-static'>
perl -CSD <https://jenkins.aps.anl.gov/job/epics-7.0-windows/LIBRARIES=STATIC,OS=win64/ws/bin/windows-x64-static/mkmf.pl>  -m testpdb.d -I. -I../O.Common -I. -I. -I.. -I<https://jenkins.aps.anl.gov/job/epics-7.0-windows/LIBRARIES=STATIC,OS=win64/ws/include/compiler/msvc> -I<https://jenkins.aps.anl.gov/job/epics-7.0-windows/LIBRARIES=STATIC,OS=win64/ws/include/os/WIN32> -I<https://jenkins.aps.anl.gov/job/epics-7.0-windows/LIBRARIES=STATIC,OS=win64/ws/include> -I<https://jenkins.aps.anl.gov/job/epics-7.0-windows/LIBRARIES=STATIC,OS=win64/ws/include/compiler/msvc> -I<https://jenkins.aps.anl.gov/job/epics-7.0-windows/LIBRARIES=STATIC,OS=win64/ws/include/os/WIN32> -I<https://jenkins.aps.anl.gov/job/epics-7.0-windows/LIBRARIES=STATIC,OS=win64/ws/include>        testpdb.obj ../testpdb.cpp
make[4]: Leaving directory '<https://jenkins.aps.anl.gov/job/epics-7.0-windows/LIBRARIES=STATIC,OS=win64/ws/modules/pva2pva/testApp/O.windows-x64-static'>
make[4]: Entering directory '<https://jenkins.aps.anl.gov/job/epics-7.0-windows/LIBRARIES=STATIC,OS=win64/ws/modules/pva2pva/testApp/O.windows-x64-static'>
perl -CSD <https://jenkins.aps.anl.gov/job/epics-7.0-windows/LIBRARIES=STATIC,OS=win64/ws/bin/windows-x64-static/mkmf.pl>  -m testtest.d -I. -I../O.Common -I. -I. -I.. -I<https://jenkins.aps.anl.gov/job/epics-7.0-windows/LIBRARIES=STATIC,OS=win64/ws/include/compiler/msvc> -I<https://jenkins.aps.anl.gov/job/epics-7.0-windows/LIBRARIES=STATIC,OS=win64/ws/include/os/WIN32> -I<https://jenkins.aps.anl.gov/job/epics-7.0-windows/LIBRARIES=STATIC,OS=win64/ws/include> -I<https://jenkins.aps.anl.gov/job/epics-7.0-windows/LIBRARIES=STATIC,OS=win64/ws/include/compiler/msvc> -I<https://jenkins.aps.anl.gov/job/epics-7.0-windows/LIBRARIES=STATIC,OS=win64/ws/include/os/WIN32> -I<https://jenkins.aps.anl.gov/job/epics-7.0-windows/LIBRARIES=STATIC,OS=win64/ws/include>        testtest.obj ../testtest.cpp
make[4]: Leaving directory '<https://jenkins.aps.anl.gov/job/epics-7.0-windows/LIBRARIES=STATIC,OS=win64/ws/modules/pva2pva/testApp/O.windows-x64-static'>
make[4]: Entering directory '<https://jenkins.aps.anl.gov/job/epics-7.0-windows/LIBRARIES=STATIC,OS=win64/ws/modules/pva2pva/testApp/O.windows-x64-static'>
perl -CSD <https://jenkins.aps.anl.gov/job/epics-7.0-windows/LIBRARIES=STATIC,OS=win64/ws/bin/windows-x64-static/mkmf.pl>  -m testweak.d -I. -I../O.Common -I. -I. -I.. -I<https://jenkins.aps.anl.gov/job/epics-7.0-windows/LIBRARIES=STATIC,OS=win64/ws/include/compiler/msvc> -I<https://jenkins.aps.anl.gov/job/epics-7.0-windows/LIBRARIES=STATIC,OS=win64/ws/include/os/WIN32> -I<https://jenkins.aps.anl.gov/job/epics-7.0-windows/LIBRARIES=STATIC,OS=win64/ws/include> -I<https://jenkins.aps.anl.gov/job/epics-7.0-windows/LIBRARIES=STATIC,OS=win64/ws/include/compiler/msvc> -I<https://jenkins.aps.anl.gov/job/epics-7.0-windows/LIBRARIES=STATIC,OS=win64/ws/include/os/WIN32> -I<https://jenkins.aps.anl.gov/job/epics-7.0-windows/LIBRARIES=STATIC,OS=win64/ws/include>        testweak.obj ../testweak.cpp
make[4]: Leaving directory '<https://jenkins.aps.anl.gov/job/epics-7.0-windows/LIBRARIES=STATIC,OS=win64/ws/modules/pva2pva/testApp/O.windows-x64-static'>
make[4]: Entering directory '<https://jenkins.aps.anl.gov/job/epics-7.0-windows/LIBRARIES=STATIC,OS=win64/ws/modules/pva2pva/testApp/O.windows-x64-static'>
perl -CSD <https://jenkins.aps.anl.gov/job/epics-7.0-windows/LIBRARIES=STATIC,OS=win64/ws/bin/windows-x64-static/dbdExpand.pl>   -I. -I.. -I../O.Common -I<https://jenkins.aps.anl.gov/job/epics-7.0-windows/LIBRARIES=STATIC,OS=win64/ws/dbd> -I<https://jenkins.aps.anl.gov/job/epics-7.0-windows/LIBRARIES=STATIC,OS=win64/ws/dbd> -o p2pTestIoc.dbd base.dbd
make[4]: Leaving directory '<https://jenkins.aps.anl.gov/job/epics-7.0-windows/LIBRARIES=STATIC,OS=win64/ws/modules/pva2pva/testApp/O.windows-x64-static'>
make[4]: Entering directory '<https://jenkins.aps.anl.gov/job/epics-7.0-windows/LIBRARIES=STATIC,OS=win64/ws/modules/pva2pva/testApp/O.windows-x64-static'>
perl -CSD <https://jenkins.aps.anl.gov/job/epics-7.0-windows/LIBRARIES=STATIC,OS=win64/ws/bin/windows-x64-static/mkmf.pl>  -m utilitiesx.d -I. -I../O.Common -I. -I. -I.. -I<https://jenkins.aps.anl.gov/job/epics-7.0-windows/LIBRARIES=STATIC,OS=win64/ws/include/compiler/msvc> -I<https://jenkins.aps.anl.gov/job/epics-7.0-windows/LIBRARIES=STATIC,OS=win64/ws/include/os/WIN32> -I<https://jenkins.aps.anl.gov/job/epics-7.0-windows/LIBRARIES=STATIC,OS=win64/ws/include> -I<https://jenkins.aps.anl.gov/job/epics-7.0-windows/LIBRARIES=STATIC,OS=win64/ws/include/compiler/msvc> -I<https://jenkins.aps.anl.gov/job/epics-7.0-windows/LIBRARIES=STATIC,OS=win64/ws/include/os/WIN32> -I<https://jenkins.aps.anl.gov/job/epics-7.0-windows/LIBRARIES=STATIC,OS=win64/ws/include>        utilitiesx.obj ../utilitiesx.cpp
make[4]: Leaving directory '<https://jenkins.aps.anl.gov/job/epics-7.0-windows/LIBRARIES=STATIC,OS=win64/ws/modules/pva2pva/testApp/O.windows-x64-static'>
make[4]: Entering directory '<https://jenkins.aps.anl.gov/job/epics-7.0-windows/LIBRARIES=STATIC,OS=win64/ws/modules/pva2pva/testApp/O.windows-x64-static'>
perl -CSD <https://jenkins.aps.anl.gov/job/epics-7.0-windows/LIBRARIES=STATIC,OS=win64/ws/bin/windows-x64-static/registerRecordDeviceDriver.pl>   -I. -I.. -I../O.Common -I<https://jenkins.aps.anl.gov/job/epics-7.0-windows/LIBRARIES=STATIC,OS=win64/ws/dbd> -I<https://jenkins.aps.anl.gov/job/epics-7.0-windows/LIBRARIES=STATIC,OS=win64/ws/dbd>    -o pvaLinkTestIoc_registerRecordDeviceDriver.cpp ../O.Common/pvaLinkTestIoc.dbd pvaLinkTestIoc_registerRecordDeviceDriver <https://jenkins.aps.anl.gov/job/epics-7.0-windows/LIBRARIES=STATIC,OS=win64/ws/>
make[4]: Leaving directory '<https://jenkins.aps.anl.gov/job/epics-7.0-windows/LIBRARIES=STATIC,OS=win64/ws/modules/pva2pva/testApp/O.windows-x64-static'>
make[4]: Entering directory '<https://jenkins.aps.anl.gov/job/epics-7.0-windows/LIBRARIES=STATIC,OS=win64/ws/modules/pva2pva/testApp/O.windows-x64-static'>
perl -CSD <https://jenkins.aps.anl.gov/job/epics-7.0-windows/LIBRARIES=STATIC,OS=win64/ws/bin/windows-x64-static/registerRecordDeviceDriver.pl>   -I. -I.. -I../O.Common -I<https://jenkins.aps.anl.gov/job/epics-7.0-windows/LIBRARIES=STATIC,OS=win64/ws/dbd> -I<https://jenkins.aps.anl.gov/job/epics-7.0-windows/LIBRARIES=STATIC,OS=win64/ws/dbd>    -o p2pTestIoc_registerRecordDeviceDriver.cpp ../O.Common/p2pTestIoc.dbd p2pTestIoc_registerRecordDeviceDriver <https://jenkins.aps.anl.gov/job/epics-7.0-windows/LIBRARIES=STATIC,OS=win64/ws/>
make[4]: Leaving directory '<https://jenkins.aps.anl.gov/job/epics-7.0-windows/LIBRARIES=STATIC,OS=win64/ws/modules/pva2pva/testApp/O.windows-x64-static'>
make[4]: Entering directory '<https://jenkins.aps.anl.gov/job/epics-7.0-windows/LIBRARIES=STATIC,OS=win64/ws/modules/pva2pva/testApp/O.windows-x64-static'>
perl -CSD <https://jenkins.aps.anl.gov/job/epics-7.0-windows/LIBRARIES=STATIC,OS=win64/ws/bin/windows-x64-static/mkmf.pl>  -m pvaLinkTestIoc_registerRecordDeviceDriver.d -I. -I../O.Common -I. -I. -I.. -I<https://jenkins.aps.anl.gov/job/epics-7.0-windows/LIBRARIES=STATIC,OS=win64/ws/include/compiler/msvc> -I<https://jenkins.aps.anl.gov/job/epics-7.0-windows/LIBRARIES=STATIC,OS=win64/ws/include/os/WIN32> -I<https://jenkins.aps.anl.gov/job/epics-7.0-windows/LIBRARIES=STATIC,OS=win64/ws/include> -I<https://jenkins.aps.anl.gov/job/epics-7.0-windows/LIBRARIES=STATIC,OS=win64/ws/include/compiler/msvc> -I<https://jenkins.aps.anl.gov/job/epics-7.0-windows/LIBRARIES=STATIC,OS=win64/ws/include/os/WIN32> -I<https://jenkins.aps.anl.gov/job/epics-7.0-windows/LIBRARIES=STATIC,OS=win64/ws/include>        pvaLinkTestIoc_registerRecordDeviceDriver.obj pvaLinkTestIoc_registerRecordDeviceDriver.cpp
make[4]: Leaving directory '<https://jenkins.aps.anl.gov/job/epics-7.0-windows/LIBRARIES=STATIC,OS=win64/ws/modules/pva2pva/testApp/O.windows-x64-static'>
make[4]: Entering directory '<https://jenkins.aps.anl.gov/job/epics-7.0-windows/LIBRARIES=STATIC,OS=win64/ws/modules/pva2pva/testApp/O.windows-x64-static'>
perl -CSD <https://jenkins.aps.anl.gov/job/epics-7.0-windows/LIBRARIES=STATIC,OS=win64/ws/bin/windows-x64-static/mkmf.pl>  -m p2pTestIoc_registerRecordDeviceDriver.d -I. -I../O.Common -I. -I. -I.. -I<https://jenkins.aps.anl.gov/job/epics-7.0-windows/LIBRARIES=STATIC,OS=win64/ws/include/compiler/msvc> -I<https://jenkins.aps.anl.gov/job/epics-7.0-windows/LIBRARIES=STATIC,OS=win64/ws/include/os/WIN32> -I<https://jenkins.aps.anl.gov/job/epics-7.0-windows/LIBRARIES=STATIC,OS=win64/ws/include> -I<https://jenkins.aps.anl.gov/job/epics-7.0-windows/LIBRARIES=STATIC,OS=win64/ws/include/compiler/msvc> -I<https://jenkins.aps.anl.gov/job/epics-7.0-windows/LIBRARIES=STATIC,OS=win64/ws/include/os/WIN32> -I<https://jenkins.aps.anl.gov/job/epics-7.0-windows/LIBRARIES=STATIC,OS=win64/ws/include>        p2pTestIoc_registerRecordDeviceDriver.obj p2pTestIoc_registerRecordDeviceDriver.cpp
make[4]: Leaving directory '<https://jenkins.aps.anl.gov/job/epics-7.0-windows/LIBRARIES=STATIC,OS=win64/ws/modules/pva2pva/testApp/O.windows-x64-static'>
make[4]: Entering directory '<https://jenkins.aps.anl.gov/job/epics-7.0-windows/LIBRARIES=STATIC,OS=win64/ws/modules/pva2pva/testApp/O.windows-x64-static'>
cl -EHsc -GR           -DUSE_TYPED_RSET -I../../pdbApp -I../../p2pApp -I../../common -DNOMINMAX     -nologo -FC -D__STDC__=0 -D_CRT_SECURE_NO_DEPRECATE -D_CRT_NONSTDC_NO_DEPRECATE   -Ox -Oy-   -W3 -w44355 -w44344 -w44251        -MT  -TP  -I. -I../O.Common -I. -I. -I.. -I<https://jenkins.aps.anl.gov/job/epics-7.0-windows/LIBRARIES=STATIC,OS=win64/ws/include/compiler/msvc> -I<https://jenkins.aps.anl.gov/job/epics-7.0-windows/LIBRARIES=STATIC,OS=win64/ws/include/os/WIN32> -I<https://jenkins.aps.anl.gov/job/epics-7.0-windows/LIBRARIES=STATIC,OS=win64/ws/include> -I<https://jenkins.aps.anl.gov/job/epics-7.0-windows/LIBRARIES=STATIC,OS=win64/ws/include/compiler/msvc> -I<https://jenkins.aps.anl.gov/job/epics-7.0-windows/LIBRARIES=STATIC,OS=win64/ws/include/os/WIN32> -I<https://jenkins.aps.anl.gov/job/epics-7.0-windows/LIBRARIES=STATIC,OS=win64/ws/include>        -c ../testweak.cpp
testweak.cpp
make[4]: Leaving directory '<https://jenkins.aps.anl.gov/job/epics-7.0-windows/LIBRARIES=STATIC,OS=win64/ws/modules/pva2pva/testApp/O.windows-x64-static'>
make[4]: Entering directory '<https://jenkins.aps.anl.gov/job/epics-7.0-windows/LIBRARIES=STATIC,OS=win64/ws/modules/pva2pva/testApp/O.windows-x64-static'>
cl -EHsc -GR           -DUSE_TYPED_RSET -I../../pdbApp -I../../p2pApp -I../../common -DNOMINMAX     -nologo -FC -D__STDC__=0 -D_CRT_SECURE_NO_DEPRECATE -D_CRT_NONSTDC_NO_DEPRECATE   -Ox -Oy-   -W3 -w44355 -w44344 -w44251        -MT  -TP  -I. -I../O.Common -I. -I. -I.. -I<https://jenkins.aps.anl.gov/job/epics-7.0-windows/LIBRARIES=STATIC,OS=win64/ws/include/compiler/msvc> -I<https://jenkins.aps.anl.gov/job/epics-7.0-windows/LIBRARIES=STATIC,OS=win64/ws/include/os/WIN32> -I<https://jenkins.aps.anl.gov/job/epics-7.0-windows/LIBRARIES=STATIC,OS=win64/ws/include> -I<https://jenkins.aps.anl.gov/job/epics-7.0-windows/LIBRARIES=STATIC,OS=win64/ws/include/compiler/msvc> -I<https://jenkins.aps.anl.gov/job/epics-7.0-windows/LIBRARIES=STATIC,OS=win64/ws/include/os/WIN32> -I<https://jenkins.aps.anl.gov/job/epics-7.0-windows/LIBRARIES=STATIC,OS=win64/ws/include>        -c ../utilitiesx.cpp
utilitiesx.cpp
c:\jenkins\win64-1\workspace\epics-7.0-windows\libraries\static\os\win64\include\pv\pvdata.h(508): warning C4800: 'char': forcing value to bool 'true' or 'false' (performance warning)
c:\jenkins\win64-1\workspace\epics-7.0-windows\libraries\static\os\win64\include\pv\pvdata.h(558): warning C4250: 'epics::pvData::PVString': inherits 'epics::pvData::PVScalarValue<std::string>::epics::pvData::PVScalarValue<std::string>::deserialize' via dominance
c:\jenkins\win64-1\workspace\epics-7.0-windows\libraries\static\os\win64\include\pv\pvdata.h(461): note: see declaration of 'epics::pvData::PVScalarValue<std::string>::deserialize'
make[4]: Leaving directory '<https://jenkins.aps.anl.gov/job/epics-7.0-windows/LIBRARIES=STATIC,OS=win64/ws/modules/pva2pva/testApp/O.windows-x64-static'>
make[4]: Entering directory '<https://jenkins.aps.anl.gov/job/epics-7.0-windows/LIBRARIES=STATIC,OS=win64/ws/modules/pva2pva/testApp/O.windows-x64-static'>
cl -EHsc -GR           -DUSE_TYPED_RSET -I../../pdbApp -I../../p2pApp -I../../common -DNOMINMAX     -nologo -FC -D__STDC__=0 -D_CRT_SECURE_NO_DEPRECATE -D_CRT_NONSTDC_NO_DEPRECATE   -Ox -Oy-   -W3 -w44355 -w44344 -w44251        -MT  -TP  -I. -I../O.Common -I. -I. -I.. -I<https://jenkins.aps.anl.gov/job/epics-7.0-windows/LIBRARIES=STATIC,OS=win64/ws/include/compiler/msvc> -I<https://jenkins.aps.anl.gov/job/epics-7.0-windows/LIBRARIES=STATIC,OS=win64/ws/include/os/WIN32> -I<https://jenkins.aps.anl.gov/job/epics-7.0-windows/LIBRARIES=STATIC,OS=win64/ws/include> -I<https://jenkins.aps.anl.gov/job/epics-7.0-windows/LIBRARIES=STATIC,OS=win64/ws/include/compiler/msvc> -I<https://jenkins.aps.anl.gov/job/epics-7.0-windows/LIBRARIES=STATIC,OS=win64/ws/include/os/WIN32> -I<https://jenkins.aps.anl.gov/job/epics-7.0-windows/LIBRARIES=STATIC,OS=win64/ws/include>        -c ../check_consist.cpp
check_consist.cpp
c:\jenkins\win64-1\workspace\epics-7.0-windows\libraries\static\os\win64\include\pv\pvdata.h(508): warning C4800: 'char': forcing value to bool 'true' or 'false' (performance warning)
c:\jenkins\win64-1\workspace\epics-7.0-windows\libraries\static\os\win64\include\pv\pvdata.h(558): warning C4250: 'epics::pvData::PVString': inherits 'epics::pvData::PVScalarValue<std::string>::epics::pvData::PVScalarValue<std::string>::deserialize' via dominance
c:\jenkins\win64-1\workspace\epics-7.0-windows\libraries\static\os\win64\include\pv\pvdata.h(461): note: see declaration of 'epics::pvData::PVScalarValue<std::string>::deserialize'
make[4]: Leaving directory '<https://jenkins.aps.anl.gov/job/epics-7.0-windows/LIBRARIES=STATIC,OS=win64/ws/modules/pva2pva/testApp/O.windows-x64-static'>
make[4]: Entering directory '<https://jenkins.aps.anl.gov/job/epics-7.0-windows/LIBRARIES=STATIC,OS=win64/ws/modules/pva2pva/testApp/O.windows-x64-static'>
cl -EHsc -GR           -DUSE_TYPED_RSET -I../../pdbApp -I../../p2pApp -I../../common -DNOMINMAX     -nologo -FC -D__STDC__=0 -D_CRT_SECURE_NO_DEPRECATE -D_CRT_NONSTDC_NO_DEPRECATE   -Ox -Oy-   -W3 -w44355 -w44344 -w44251        -MT  -TP  -I. -I../O.Common -I. -I. -I.. -I<https://jenkins.aps.anl.gov/job/epics-7.0-windows/LIBRARIES=STATIC,OS=win64/ws/include/compiler/msvc> -I<https://jenkins.aps.anl.gov/job/epics-7.0-windows/LIBRARIES=STATIC,OS=win64/ws/include/os/WIN32> -I<https://jenkins.aps.anl.gov/job/epics-7.0-windows/LIBRARIES=STATIC,OS=win64/ws/include> -I<https://jenkins.aps.anl.gov/job/epics-7.0-windows/LIBRARIES=STATIC,OS=win64/ws/include/compiler/msvc> -I<https://jenkins.aps.anl.gov/job/epics-7.0-windows/LIBRARIES=STATIC,OS=win64/ws/include/os/WIN32> -I<https://jenkins.aps.anl.gov/job/epics-7.0-windows/LIBRARIES=STATIC,OS=win64/ws/include>        -c ../testtest.cpp
testtest.cpp
c:\jenkins\win64-1\workspace\epics-7.0-windows\libraries\static\os\win64\include\pv\pvdata.h(508): warning C4800: 'char': forcing value to bool 'true' or 'false' (performance warning)
c:\jenkins\win64-1\workspace\epics-7.0-windows\libraries\static\os\win64\include\pv\pvdata.h(558): warning C4250: 'epics::pvData::PVString': inherits 'epics::pvData::PVScalarValue<std::string>::epics::pvData::PVScalarValue<std::string>::deserialize' via dominance
c:\jenkins\win64-1\workspace\epics-7.0-windows\libraries\static\os\win64\include\pv\pvdata.h(461): note: see declaration of 'epics::pvData::PVScalarValue<std::string>::deserialize'
make[4]: Leaving directory '<https://jenkins.aps.anl.gov/job/epics-7.0-windows/LIBRARIES=STATIC,OS=win64/ws/modules/pva2pva/testApp/O.windows-x64-static'>
make[4]: Entering directory '<https://jenkins.aps.anl.gov/job/epics-7.0-windows/LIBRARIES=STATIC,OS=win64/ws/modules/pva2pva/testApp/O.windows-x64-static'>
cl -EHsc -GR           -DUSE_TYPED_RSET -I../../pdbApp -I../../p2pApp -I../../common -DNOMINMAX     -nologo -FC -D__STDC__=0 -D_CRT_SECURE_NO_DEPRECATE -D_CRT_NONSTDC_NO_DEPRECATE   -Ox -Oy-   -W3 -w44355 -w44344 -w44251        -MT  -TP  -I. -I../O.Common -I. -I. -I.. -I<https://jenkins.aps.anl.gov/job/epics-7.0-windows/LIBRARIES=STATIC,OS=win64/ws/include/compiler/msvc> -I<https://jenkins.aps.anl.gov/job/epics-7.0-windows/LIBRARIES=STATIC,OS=win64/ws/include/os/WIN32> -I<https://jenkins.aps.anl.gov/job/epics-7.0-windows/LIBRARIES=STATIC,OS=win64/ws/include> -I<https://jenkins.aps.anl.gov/job/epics-7.0-windows/LIBRARIES=STATIC,OS=win64/ws/include/compiler/msvc> -I<https://jenkins.aps.anl.gov/job/epics-7.0-windows/LIBRARIES=STATIC,OS=win64/ws/include/os/WIN32> -I<https://jenkins.aps.anl.gov/job/epics-7.0-windows/LIBRARIES=STATIC,OS=win64/ws/include>        -c p2pTestIoc_registerRecordDeviceDriver.cpp
p2pTestIoc_registerRecordDeviceDriver.cpp
make[4]: Leaving directory '<https://jenkins.aps.anl.gov/job/epics-7.0-windows/LIBRARIES=STATIC,OS=win64/ws/modules/pva2pva/testApp/O.windows-x64-static'>
make[4]: Entering directory '<https://jenkins.aps.anl.gov/job/epics-7.0-windows/LIBRARIES=STATIC,OS=win64/ws/modules/pva2pva/testApp/O.windows-x64-static'>
cl -EHsc -GR           -DUSE_TYPED_RSET -I../../pdbApp -I../../p2pApp -I../../common -DNOMINMAX     -nologo -FC -D__STDC__=0 -D_CRT_SECURE_NO_DEPRECATE -D_CRT_NONSTDC_NO_DEPRECATE   -Ox -Oy-   -W3 -w44355 -w44344 -w44251        -MT  -TP  -I. -I../O.Common -I. -I. -I.. -I<https://jenkins.aps.anl.gov/job/epics-7.0-windows/LIBRARIES=STATIC,OS=win64/ws/include/compiler/msvc> -I<https://jenkins.aps.anl.gov/job/epics-7.0-windows/LIBRARIES=STATIC,OS=win64/ws/include/os/WIN32> -I<https://jenkins.aps.anl.gov/job/epics-7.0-windows/LIBRARIES=STATIC,OS=win64/ws/include> -I<https://jenkins.aps.anl.gov/job/epics-7.0-windows/LIBRARIES=STATIC,OS=win64/ws/include/compiler/msvc> -I<https://jenkins.aps.anl.gov/job/epics-7.0-windows/LIBRARIES=STATIC,OS=win64/ws/include/os/WIN32> -I<https://jenkins.aps.anl.gov/job/epics-7.0-windows/LIBRARIES=STATIC,OS=win64/ws/include>        -c pvaLinkTestIoc_registerRecordDeviceDriver.cpp
pvaLinkTestIoc_registerRecordDeviceDriver.cpp
make[4]: Leaving directory '<https://jenkins.aps.anl.gov/job/epics-7.0-windows/LIBRARIES=STATIC,OS=win64/ws/modules/pva2pva/testApp/O.windows-x64-static'>
make[4]: Entering directory '<https://jenkins.aps.anl.gov/job/epics-7.0-windows/LIBRARIES=STATIC,OS=win64/ws/modules/pva2pva/testApp/O.windows-x64-static'>
cl -EHsc -GR           -DUSE_TYPED_RSET -I../../pdbApp -I../../p2pApp -I../../common -DNOMINMAX     -nologo -FC -D__STDC__=0 -D_CRT_SECURE_NO_DEPRECATE -D_CRT_NONSTDC_NO_DEPRECATE   -Ox -Oy-   -W3 -w44355 -w44344 -w44251        -MT  -TP  -I. -I../O.Common -I. -I. -I.. -I<https://jenkins.aps.anl.gov/job/epics-7.0-windows/LIBRARIES=STATIC,OS=win64/ws/include/compiler/msvc> -I<https://jenkins.aps.anl.gov/job/epics-7.0-windows/LIBRARIES=STATIC,OS=win64/ws/include/os/WIN32> -I<https://jenkins.aps.anl.gov/job/epics-7.0-windows/LIBRARIES=STATIC,OS=win64/ws/include> -I<https://jenkins.aps.anl.gov/job/epics-7.0-windows/LIBRARIES=STATIC,OS=win64/ws/include/compiler/msvc> -I<https://jenkins.aps.anl.gov/job/epics-7.0-windows/LIBRARIES=STATIC,OS=win64/ws/include/os/WIN32> -I<https://jenkins.aps.anl.gov/job/epics-7.0-windows/LIBRARIES=STATIC,OS=win64/ws/include>        -c ../testpvalink.cpp
testpvalink.cpp
c:\jenkins\win64-1\workspace\epics-7.0-windows\libraries\static\os\win64\include\pv\pvdata.h(508): warning C4800: 'char': forcing value to bool 'true' or 'false' (performance warning)
c:\jenkins\win64-1\workspace\epics-7.0-windows\libraries\static\os\win64\include\pv\pvdata.h(558): warning C4250: 'epics::pvData::PVString': inherits 'epics::pvData::PVScalarValue<std::string>::epics::pvData::PVScalarValue<std::string>::deserialize' via dominance
c:\jenkins\win64-1\workspace\epics-7.0-windows\libraries\static\os\win64\include\pv\pvdata.h(461): note: see declaration of 'epics::pvData::PVScalarValue<std::string>::deserialize'
make[4]: Leaving directory '<https://jenkins.aps.anl.gov/job/epics-7.0-windows/LIBRARIES=STATIC,OS=win64/ws/modules/pva2pva/testApp/O.windows-x64-static'>
make[4]: Entering directory '<https://jenkins.aps.anl.gov/job/epics-7.0-windows/LIBRARIES=STATIC,OS=win64/ws/modules/pva2pva/testApp/O.windows-x64-static'>
cl -EHsc -GR           -DUSE_TYPED_RSET -I../../pdbApp -I../../p2pApp -I../../common -DNOMINMAX     -nologo -FC -D__STDC__=0 -D_CRT_SECURE_NO_DEPRECATE -D_CRT_NONSTDC_NO_DEPRECATE   -Ox -Oy-   -W3 -w44355 -w44344 -w44251        -MT  -TP  -I. -I../O.Common -I. -I. -I.. -I<https://jenkins.aps.anl.gov/job/epics-7.0-windows/LIBRARIES=STATIC,OS=win64/ws/include/compiler/msvc> -I<https://jenkins.aps.anl.gov/job/epics-7.0-windows/LIBRARIES=STATIC,OS=win64/ws/include/os/WIN32> -I<https://jenkins.aps.anl.gov/job/epics-7.0-windows/LIBRARIES=STATIC,OS=win64/ws/include> -I<https://jenkins.aps.anl.gov/job/epics-7.0-windows/LIBRARIES=STATIC,OS=win64/ws/include/compiler/msvc> -I<https://jenkins.aps.anl.gov/job/epics-7.0-windows/LIBRARIES=STATIC,OS=win64/ws/include/os/WIN32> -I<https://jenkins.aps.anl.gov/job/epics-7.0-windows/LIBRARIES=STATIC,OS=win64/ws/include>        -c ../testpvif.cpp
testpvif.cpp
c:\jenkins\win64-1\workspace\epics-7.0-windows\libraries\static\os\win64\include\pv\pvdata.h(508): warning C4800: 'char': forcing value to bool 'true' or 'false' (performance warning)
c:\jenkins\win64-1\workspace\epics-7.0-windows\libraries\static\os\win64\include\pv\pvdata.h(558): warning C4250: 'epics::pvData::PVString': inherits 'epics::pvData::PVScalarValue<std::string>::epics::pvData::PVScalarValue<std::string>::deserialize' via dominance
c:\jenkins\win64-1\workspace\epics-7.0-windows\libraries\static\os\win64\include\pv\pvdata.h(461): note: see declaration of 'epics::pvData::PVScalarValue<std::string>::deserialize'
c:\jenkins\win64-1\workspace\epics-7.0-windows\libraries\static\os\win64\modules\pva2pva\testapp\testpvif.cpp(201): warning C4267: 'argument': conversion from 'size_t' to 'epics::pvData::uint32', possible loss of data
c:\jenkins\win64-1\workspace\epics-7.0-windows\libraries\static\os\win64\modules\pva2pva\testapp\testpvif.cpp(260): warning C4267: 'argument': conversion from 'size_t' to 'epics::pvData::uint32', possible loss of data
c:\jenkins\win64-1\workspace\epics-7.0-windows\libraries\static\os\win64\modules\pva2pva\testapp\testpvif.cpp(267): warning C4267: 'argument': conversion from 'size_t' to 'epics::pvData::uint32', possible loss of data
c:\jenkins\win64-1\workspace\epics-7.0-windows\libraries\static\os\win64\modules\pva2pva\testapp\testpvif.cpp(274): warning C4267: 'argument': conversion from 'size_t' to 'epics::pvData::uint32', possible loss of data
c:\jenkins\win64-1\workspace\epics-7.0-windows\libraries\static\os\win64\modules\pva2pva\testapp\testpvif.cpp(281): warning C4267: 'argument': conversion from 'size_t' to 'epics::pvData::uint32', possible loss of data
c:\jenkins\win64-1\workspace\epics-7.0-windows\libraries\static\os\win64\modules\pva2pva\testapp\testpvif.cpp(288): warning C4267: 'argument': conversion from 'size_t' to 'epics::pvData::uint32', possible loss of data
c:\jenkins\win64-1\workspace\epics-7.0-windows\libraries\static\os\win64\modules\pva2pva\testapp\testpvif.cpp(347): warning C4267: 'argument': conversion from 'size_t' to 'epics::pvData::uint32', possible loss of data
c:\jenkins\win64-1\workspace\epics-7.0-windows\libraries\static\os\win64\modules\pva2pva\testapp\testpvif.cpp(356): warning C4267: 'argument': conversion from 'size_t' to 'epics::pvData::uint32', possible loss of data
c:\jenkins\win64-1\workspace\epics-7.0-windows\libraries\static\os\win64\modules\pva2pva\testapp\testpvif.cpp(365): warning C4267: 'argument': conversion from 'size_t' to 'epics::pvData::uint32', possible loss of data
c:\jenkins\win64-1\workspace\epics-7.0-windows\libraries\static\os\win64\modules\pva2pva\testapp\testpvif.cpp(374): warning C4267: 'argument': conversion from 'size_t' to 'epics::pvData::uint32', possible loss of data
c:\jenkins\win64-1\workspace\epics-7.0-windows\libraries\static\os\win64\modules\pva2pva\testapp\testpvif.cpp(386): warning C4267: 'argument': conversion from 'size_t' to 'epics::pvData::uint32', possible loss of data
c:\jenkins\win64-1\workspace\epics-7.0-windows\libraries\static\os\win64\modules\pva2pva\testapp\testpvif.cpp(393): warning C4267: 'argument': conversion from 'size_t' to 'epics::pvData::uint32', possible loss of data
c:\jenkins\win64-1\workspace\epics-7.0-windows\libraries\static\os\win64\modules\pva2pva\testapp\testpvif.cpp(400): warning C4267: 'argument': conversion from 'size_t' to 'epics::pvData::uint32', possible loss of data
c:\jenkins\win64-1\workspace\epics-7.0-windows\libraries\static\os\win64\modules\pva2pva\testapp\testpvif.cpp(407): warning C4267: 'argument': conversion from 'size_t' to 'epics::pvData::uint32', possible loss of data
make[4]: Leaving directory '<https://jenkins.aps.anl.gov/job/epics-7.0-windows/LIBRARIES=STATIC,OS=win64/ws/modules/pva2pva/testApp/O.windows-x64-static'>
make[4]: Entering directory '<https://jenkins.aps.anl.gov/job/epics-7.0-windows/LIBRARIES=STATIC,OS=win64/ws/modules/pva2pva/testApp/O.windows-x64-static'>
cl -EHsc -GR           -DUSE_TYPED_RSET -I../../pdbApp -I../../p2pApp -I../../common -DNOMINMAX     -nologo -FC -D__STDC__=0 -D_CRT_SECURE_NO_DEPRECATE -D_CRT_NONSTDC_NO_DEPRECATE   -Ox -Oy-   -W3 -w44355 -w44344 -w44251        -MT  -TP  -I. -I../O.Common -I. -I. -I.. -I<https://jenkins.aps.anl.gov/job/epics-7.0-windows/LIBRARIES=STATIC,OS=win64/ws/include/compiler/msvc> -I<https://jenkins.aps.anl.gov/job/epics-7.0-windows/LIBRARIES=STATIC,OS=win64/ws/include/os/WIN32> -I<https://jenkins.aps.anl.gov/job/epics-7.0-windows/LIBRARIES=STATIC,OS=win64/ws/include> -I<https://jenkins.aps.anl.gov/job/epics-7.0-windows/LIBRARIES=STATIC,OS=win64/ws/include/compiler/msvc> -I<https://jenkins.aps.anl.gov/job/epics-7.0-windows/LIBRARIES=STATIC,OS=win64/ws/include/os/WIN32> -I<https://jenkins.aps.anl.gov/job/epics-7.0-windows/LIBRARIES=STATIC,OS=win64/ws/include>        -c ../testpdb.cpp
testpdb.cpp
c:\jenkins\win64-1\workspace\epics-7.0-windows\libraries\static\os\win64\include\pv\pvdata.h(508): warning C4800: 'char': forcing value to bool 'true' or 'false' (performance warning)
c:\jenkins\win64-1\workspace\epics-7.0-windows\libraries\static\os\win64\include\pv\pvdata.h(558): warning C4250: 'epics::pvData::PVString': inherits 'epics::pvData::PVScalarValue<std::string>::epics::pvData::PVScalarValue<std::string>::deserialize' via dominance
c:\jenkins\win64-1\workspace\epics-7.0-windows\libraries\static\os\win64\include\pv\pvdata.h(461): note: see declaration of 'epics::pvData::PVScalarValue<std::string>::deserialize'
c:\jenkins\win64-1\workspace\epics-7.0-windows\libraries\static\os\win64\modules\pva2pva\testapp\testpdb.cpp(153): warning C4267: 'argument': conversion from 'size_t' to 'epics::pvData::uint32', possible loss of data
c:\jenkins\win64-1\workspace\epics-7.0-windows\libraries\static\os\win64\modules\pva2pva\testapp\testpdb.cpp(168): warning C4267: 'argument': conversion from 'size_t' to 'epics::pvData::uint32', possible loss of data
c:\jenkins\win64-1\workspace\epics-7.0-windows\libraries\static\os\win64\modules\pva2pva\testapp\testpdb.cpp(169): warning C4267: 'argument': conversion from 'size_t' to 'epics::pvData::uint32', possible loss of data
c:\jenkins\win64-1\workspace\epics-7.0-windows\libraries\static\os\win64\modules\pva2pva\testapp\testpdb.cpp(223): warning C4267: 'argument': conversion from 'size_t' to 'epics::pvData::uint32', possible loss of data
c:\jenkins\win64-1\workspace\epics-7.0-windows\libraries\static\os\win64\modules\pva2pva\testapp\testpdb.cpp(282): warning C4267: 'argument': conversion from 'size_t' to 'epics::pvData::uint32', possible loss of data
make[4]: Leaving directory '<https://jenkins.aps.anl.gov/job/epics-7.0-windows/LIBRARIES=STATIC,OS=win64/ws/modules/pva2pva/testApp/O.windows-x64-static'>
make[4]: Entering directory '<https://jenkins.aps.anl.gov/job/epics-7.0-windows/LIBRARIES=STATIC,OS=win64/ws/modules/pva2pva/testApp/O.windows-x64-static'>
link -nologo   -incremental:no -opt:ref -release  -MACHINE:X64              -out:check_consist.exe       check_consist.obj utilitiesx.obj     <https://jenkins.aps.anl.gov/job/epics-7.0-windows/LIBRARIES=STATIC,OS=win64/ws/lib/windows-x64-static/pvAccess.lib>  <https://jenkins.aps.anl.gov/job/epics-7.0-windows/LIBRARIES=STATIC,OS=win64/ws/lib/windows-x64-static/pvData.lib>  <https://jenkins.aps.anl.gov/job/epics-7.0-windows/LIBRARIES=STATIC,OS=win64/ws/lib/windows-x64-static/dbRecStd.lib>  <https://jenkins.aps.anl.gov/job/epics-7.0-windows/LIBRARIES=STATIC,OS=win64/ws/lib/windows-x64-static/dbCore.lib>  <https://jenkins.aps.anl.gov/job/epics-7.0-windows/LIBRARIES=STATIC,OS=win64/ws/lib/windows-x64-static/ca.lib>  <https://jenkins.aps.anl.gov/job/epics-7.0-windows/LIBRARIES=STATIC,OS=win64/ws/lib/windows-x64-static/Com.lib>  ws2_32.lib advapi32.lib user32.lib kernel32.lib winmm.lib     
make[4]: Leaving directory '<https://jenkins.aps.anl.gov/job/epics-7.0-windows/LIBRARIES=STATIC,OS=win64/ws/modules/pva2pva/testApp/O.windows-x64-static'>
make[4]: Entering directory '<https://jenkins.aps.anl.gov/job/epics-7.0-windows/LIBRARIES=STATIC,OS=win64/ws/modules/pva2pva/testApp/O.windows-x64-static'>
cl -EHsc -GR           -DUSE_TYPED_RSET -I../../pdbApp -I../../p2pApp -I../../common -DNOMINMAX     -nologo -FC -D__STDC__=0 -D_CRT_SECURE_NO_DEPRECATE -D_CRT_NONSTDC_NO_DEPRECATE   -Ox -Oy-   -W3 -w44355 -w44344 -w44251        -MT  -TP  -I. -I../O.Common -I. -I. -I.. -I<https://jenkins.aps.anl.gov/job/epics-7.0-windows/LIBRARIES=STATIC,OS=win64/ws/include/compiler/msvc> -I<https://jenkins.aps.anl.gov/job/epics-7.0-windows/LIBRARIES=STATIC,OS=win64/ws/include/os/WIN32> -I<https://jenkins.aps.anl.gov/job/epics-7.0-windows/LIBRARIES=STATIC,OS=win64/ws/include> -I<https://jenkins.aps.anl.gov/job/epics-7.0-windows/LIBRARIES=STATIC,OS=win64/ws/include/compiler/msvc> -I<https://jenkins.aps.anl.gov/job/epics-7.0-windows/LIBRARIES=STATIC,OS=win64/ws/include/os/WIN32> -I<https://jenkins.aps.anl.gov/job/epics-7.0-windows/LIBRARIES=STATIC,OS=win64/ws/include>        -c ../testdbf_copy.cpp
testdbf_copy.cpp
c:\jenkins\win64-1\workspace\epics-7.0-windows\libraries\static\os\win64\include\pv\pvdata.h(508): warning C4800: 'char': forcing value to bool 'true' or 'false' (performance warning)
c:\jenkins\win64-1\workspace\epics-7.0-windows\libraries\static\os\win64\include\pv\pvdata.h(558): warning C4250: 'epics::pvData::PVString': inherits 'epics::pvData::PVScalarValue<std::string>::epics::pvData::PVScalarValue<std::string>::deserialize' via dominance
c:\jenkins\win64-1\workspace\epics-7.0-windows\libraries\static\os\win64\include\pv\pvdata.h(461): note: see declaration of 'epics::pvData::PVScalarValue<std::string>::deserialize'
c:\jenkins\win64-1\workspace\epics-7.0-windows\libraries\static\os\win64\modules\pva2pva\testapp\testdbf_copy.cpp(123): error C2976: 'epics::pvData::ScalarTypeTraits': too few template arguments
c:\jenkins\win64-1\workspace\epics-7.0-windows\libraries\static\os\win64\include\pv\pvintrospect.h(1260): note: see declaration of 'epics::pvData::ScalarTypeTraits'
c:\jenkins\win64-1\workspace\epics-7.0-windows\libraries\static\os\win64\modules\pva2pva\testapp\testdbf_copy.cpp(123): error C2146: syntax error: missing '>' before identifier 'type'
c:\jenkins\win64-1\workspace\epics-7.0-windows\libraries\static\os\win64\modules\pva2pva\testapp\testdbf_copy.cpp(124): error C2976: 'epics::pvData::ScalarTypeTraits': too few template arguments
c:\jenkins\win64-1\workspace\epics-7.0-windows\libraries\static\os\win64\include\pv\pvintrospect.h(1260): note: see declaration of 'epics::pvData::ScalarTypeTraits'
c:\jenkins\win64-1\workspace\epics-7.0-windows\libraries\static\os\win64\modules\pva2pva\testapp\testdbf_copy.cpp(124): error C2146: syntax error: missing '>' before identifier 'type'
c:\jenkins\win64-1\workspace\epics-7.0-windows\libraries\static\os\win64\modules\pva2pva\testapp\testdbf_copy.cpp(205): warning C4267: 'argument': conversion from 'size_t' to 'epics::pvData::uint32', possible loss of data
c:\jenkins\win64-1\workspace\epics-7.0-windows\libraries\static\os\win64\modules\pva2pva\testapp\testdbf_copy.cpp(226): warning C4267: 'argument': conversion from 'size_t' to 'epics::pvData::uint32', possible loss of data
c:\jenkins\win64-1\workspace\epics-7.0-windows\libraries\static\os\win64\modules\pva2pva\testapp\testdbf_copy.cpp(254): error C2672: '`anonymous-namespace'::testDBR2PVD_scalar': no matching overloaded function found
c:\jenkins\win64-1\workspace\epics-7.0-windows\libraries\static\os\win64\modules\pva2pva\testapp\testdbf_copy.cpp(254): error C2893: Failed to specialize function template 'void `anonymous-namespace'::testDBR2PVD_scalar(epics::pvData::meta::arg_type<int>::type,epics::pvData::meta::arg_type<int>::type)'
c:\jenkins\win64-1\workspace\epics-7.0-windows\libraries\static\os\win64\modules\pva2pva\testapp\testdbf_copy.cpp(254): note: With the following template arguments:
c:\jenkins\win64-1\workspace\epics-7.0-windows\libraries\static\os\win64\modules\pva2pva\testapp\testdbf_copy.cpp(254): note: '__formal=epics::pvData::pvDouble'
c:\jenkins\win64-1\workspace\epics-7.0-windows\libraries\static\os\win64\modules\pva2pva\testapp\testdbf_copy.cpp(254): note: '__formal=epics::pvData::pvDouble'
c:\jenkins\win64-1\workspace\epics-7.0-windows\libraries\static\os\win64\modules\pva2pva\testapp\testdbf_copy.cpp(255): error C2672: '`anonymous-namespace'::testDBR2PVD_scalar': no matching overloaded function found
c:\jenkins\win64-1\workspace\epics-7.0-windows\libraries\static\os\win64\modules\pva2pva\testapp\testdbf_copy.cpp(255): error C2893: Failed to specialize function template 'void `anonymous-namespace'::testDBR2PVD_scalar(epics::pvData::meta::arg_type<int>::type,epics::pvData::meta::arg_type<int>::type)'
c:\jenkins\win64-1\workspace\epics-7.0-windows\libraries\static\os\win64\modules\pva2pva\testapp\testdbf_copy.cpp(255): note: With the following template arguments:
c:\jenkins\win64-1\workspace\epics-7.0-windows\libraries\static\os\win64\modules\pva2pva\testapp\testdbf_copy.cpp(255): note: '__formal=epics::pvData::pvUShort'
c:\jenkins\win64-1\workspace\epics-7.0-windows\libraries\static\os\win64\modules\pva2pva\testapp\testdbf_copy.cpp(255): note: '__formal=epics::pvData::pvDouble'
c:\jenkins\win64-1\workspace\epics-7.0-windows\libraries\static\os\win64\modules\pva2pva\testapp\testdbf_copy.cpp(256): error C2672: '`anonymous-namespace'::testDBR2PVD_scalar': no matching overloaded function found
c:\jenkins\win64-1\workspace\epics-7.0-windows\libraries\static\os\win64\modules\pva2pva\testapp\testdbf_copy.cpp(256): error C2893: Failed to specialize function template 'void `anonymous-namespace'::testDBR2PVD_scalar(epics::pvData::meta::arg_type<int>::type,epics::pvData::meta::arg_type<int>::type)'
c:\jenkins\win64-1\workspace\epics-7.0-windows\libraries\static\os\win64\modules\pva2pva\testapp\testdbf_copy.cpp(256): note: With the following template arguments:
c:\jenkins\win64-1\workspace\epics-7.0-windows\libraries\static\os\win64\modules\pva2pva\testapp\testdbf_copy.cpp(256): note: '__formal=epics::pvData::pvInt'
c:\jenkins\win64-1\workspace\epics-7.0-windows\libraries\static\os\win64\modules\pva2pva\testapp\testdbf_copy.cpp(256): note: '__formal=epics::pvData::pvInt'
c:\jenkins\win64-1\workspace\epics-7.0-windows\libraries\static\os\win64\modules\pva2pva\testapp\testdbf_copy.cpp(257): error C2672: '`anonymous-namespace'::testDBR2PVD_scalar': no matching overloaded function found
c:\jenkins\win64-1\workspace\epics-7.0-windows\libraries\static\os\win64\modules\pva2pva\testapp\testdbf_copy.cpp(257): error C2893: Failed to specialize function template 'void `anonymous-namespace'::testDBR2PVD_scalar(epics::pvData::meta::arg_type<int>::type,epics::pvData::meta::arg_type<int>::type)'
c:\jenkins\win64-1\workspace\epics-7.0-windows\libraries\static\os\win64\modules\pva2pva\testapp\testdbf_copy.cpp(257): note: With the following template arguments:
c:\jenkins\win64-1\workspace\epics-7.0-windows\libraries\static\os\win64\modules\pva2pva\testapp\testdbf_copy.cpp(257): note: '__formal=epics::pvData::pvString'
c:\jenkins\win64-1\workspace\epics-7.0-windows\libraries\static\os\win64\modules\pva2pva\testapp\testdbf_copy.cpp(257): note: '__formal=epics::pvData::pvInt'
c:\jenkins\win64-1\workspace\epics-7.0-windows\libraries\static\os\win64\modules\pva2pva\testapp\testdbf_copy.cpp(258): error C2672: '`anonymous-namespace'::testDBR2PVD_scalar': no matching overloaded function found
c:\jenkins\win64-1\workspace\epics-7.0-windows\libraries\static\os\win64\modules\pva2pva\testapp\testdbf_copy.cpp(258): error C2893: Failed to specialize function template 'void `anonymous-namespace'::testDBR2PVD_scalar(epics::pvData::meta::arg_type<int>::type,epics::pvData::meta::arg_type<int>::type)'
c:\jenkins\win64-1\workspace\epics-7.0-windows\libraries\static\os\win64\modules\pva2pva\testapp\testdbf_copy.cpp(258): note: With the following template arguments:
c:\jenkins\win64-1\workspace\epics-7.0-windows\libraries\static\os\win64\modules\pva2pva\testapp\testdbf_copy.cpp(258): note: '__formal=epics::pvData::pvString'
c:\jenkins\win64-1\workspace\epics-7.0-windows\libraries\static\os\win64\modules\pva2pva\testapp\testdbf_copy.cpp(258): note: '__formal=epics::pvData::pvString'
c:\jenkins\win64-1\workspace\epics-7.0-windows\libraries\static\os\win64\modules\pva2pva\testapp\testdbf_copy.cpp(259): error C2672: '`anonymous-namespace'::testDBR2PVD_scalar': no matching overloaded function found
c:\jenkins\win64-1\workspace\epics-7.0-windows\libraries\static\os\win64\modules\pva2pva\testapp\testdbf_copy.cpp(259): error C2893: Failed to specialize function template 'void `anonymous-namespace'::testDBR2PVD_scalar(epics::pvData::meta::arg_type<int>::type,epics::pvData::meta::arg_type<int>::type)'
c:\jenkins\win64-1\workspace\epics-7.0-windows\libraries\static\os\win64\modules\pva2pva\testapp\testdbf_copy.cpp(259): note: With the following template arguments:
c:\jenkins\win64-1\workspace\epics-7.0-windows\libraries\static\os\win64\modules\pva2pva\testapp\testdbf_copy.cpp(259): note: '__formal=epics::pvData::pvInt'
c:\jenkins\win64-1\workspace\epics-7.0-windows\libraries\static\os\win64\modules\pva2pva\testapp\testdbf_copy.cpp(259): note: '__formal=epics::pvData::pvString'
<https://jenkins.aps.anl.gov/job/epics-7.0-windows/LIBRARIES=STATIC,OS=win64/ws/configure/RULES_BUILD>:239: recipe for target 'testdbf_copy.obj' failed
make[4]: *** [testdbf_copy.obj] Error 2
make[4]: Leaving directory '<https://jenkins.aps.anl.gov/job/epics-7.0-windows/LIBRARIES=STATIC,OS=win64/ws/modules/pva2pva/testApp/O.windows-x64-static'>
make[4]: *** Waiting for unfinished jobs....
make[4]: Entering directory '<https://jenkins.aps.anl.gov/job/epics-7.0-windows/LIBRARIES=STATIC,OS=win64/ws/modules/pva2pva/testApp/O.windows-x64-static'>
link -nologo   -incremental:no -opt:ref -release  -MACHINE:X64              -out:testweak.exe       testweak.obj utilitiesx.obj    <https://jenkins.aps.anl.gov/job/epics-7.0-windows/LIBRARIES=STATIC,OS=win64/ws/lib/windows-x64-static/Com.lib>  <https://jenkins.aps.anl.gov/job/epics-7.0-windows/LIBRARIES=STATIC,OS=win64/ws/lib/windows-x64-static/pvAccess.lib>  <https://jenkins.aps.anl.gov/job/epics-7.0-windows/LIBRARIES=STATIC,OS=win64/ws/lib/windows-x64-static/pvData.lib>  <https://jenkins.aps.anl.gov/job/epics-7.0-windows/LIBRARIES=STATIC,OS=win64/ws/lib/windows-x64-static/dbRecStd.lib>  <https://jenkins.aps.anl.gov/job/epics-7.0-windows/LIBRARIES=STATIC,OS=win64/ws/lib/windows-x64-static/dbCore.lib>  <https://jenkins.aps.anl.gov/job/epics-7.0-windows/LIBRARIES=STATIC,OS=win64/ws/lib/windows-x64-static/ca.lib>  <https://jenkins.aps.anl.gov/job/epics-7.0-windows/LIBRARIES=STATIC,OS=win64/ws/lib/windows-x64-static/Com.lib>  ws2_32.lib advapi32.lib user32.lib kernel32.lib winmm.lib     
make[4]: Leaving directory '<https://jenkins.aps.anl.gov/job/epics-7.0-windows/LIBRARIES=STATIC,OS=win64/ws/modules/pva2pva/testApp/O.windows-x64-static'>
make[4]: Entering directory '<https://jenkins.aps.anl.gov/job/epics-7.0-windows/LIBRARIES=STATIC,OS=win64/ws/modules/pva2pva/testApp/O.windows-x64-static'>
cl -EHsc -GR           -DUSE_TYPED_RSET -I../../pdbApp -I../../p2pApp -I../../common -DNOMINMAX     -nologo -FC -D__STDC__=0 -D_CRT_SECURE_NO_DEPRECATE -D_CRT_NONSTDC_NO_DEPRECATE   -Ox -Oy-   -W3 -w44355 -w44344 -w44251        -MT  -TP  -I. -I../O.Common -I. -I. -I.. -I<https://jenkins.aps.anl.gov/job/epics-7.0-windows/LIBRARIES=STATIC,OS=win64/ws/include/compiler/msvc> -I<https://jenkins.aps.anl.gov/job/epics-7.0-windows/LIBRARIES=STATIC,OS=win64/ws/include/os/WIN32> -I<https://jenkins.aps.anl.gov/job/epics-7.0-windows/LIBRARIES=STATIC,OS=win64/ws/include> -I<https://jenkins.aps.anl.gov/job/epics-7.0-windows/LIBRARIES=STATIC,OS=win64/ws/include/compiler/msvc> -I<https://jenkins.aps.anl.gov/job/epics-7.0-windows/LIBRARIES=STATIC,OS=win64/ws/include/os/WIN32> -I<https://jenkins.aps.anl.gov/job/epics-7.0-windows/LIBRARIES=STATIC,OS=win64/ws/include>        -c ../testgroupconfig.cpp
testgroupconfig.cpp
c:\jenkins\win64-1\workspace\epics-7.0-windows\libraries\static\os\win64\include\pv\pvdata.h(508): warning C4800: 'char': forcing value to bool 'true' or 'false' (performance warning)
c:\jenkins\win64-1\workspace\epics-7.0-windows\libraries\static\os\win64\include\pv\pvdata.h(558): warning C4250: 'epics::pvData::PVString': inherits 'epics::pvData::PVScalarValue<std::string>::epics::pvData::PVScalarValue<std::string>::deserialize' via dominance
c:\jenkins\win64-1\workspace\epics-7.0-windows\libraries\static\os\win64\include\pv\pvdata.h(461): note: see declaration of 'epics::pvData::PVScalarValue<std::string>::deserialize'
make[4]: Leaving directory '<https://jenkins.aps.anl.gov/job/epics-7.0-windows/LIBRARIES=STATIC,OS=win64/ws/modules/pva2pva/testApp/O.windows-x64-static'>
make[4]: Entering directory '<https://jenkins.aps.anl.gov/job/epics-7.0-windows/LIBRARIES=STATIC,OS=win64/ws/modules/pva2pva/testApp/O.windows-x64-static'>
link -nologo   -incremental:no -opt:ref -release  -MACHINE:X64              -out:testtest.exe       testtest.obj utilitiesx.obj     <https://jenkins.aps.anl.gov/job/epics-7.0-windows/LIBRARIES=STATIC,OS=win64/ws/lib/windows-x64-static/pvAccess.lib>  <https://jenkins.aps.anl.gov/job/epics-7.0-windows/LIBRARIES=STATIC,OS=win64/ws/lib/windows-x64-static/pvData.lib>  <https://jenkins.aps.anl.gov/job/epics-7.0-windows/LIBRARIES=STATIC,OS=win64/ws/lib/windows-x64-static/dbRecStd.lib>  <https://jenkins.aps.anl.gov/job/epics-7.0-windows/LIBRARIES=STATIC,OS=win64/ws/lib/windows-x64-static/dbCore.lib>  <https://jenkins.aps.anl.gov/job/epics-7.0-windows/LIBRARIES=STATIC,OS=win64/ws/lib/windows-x64-static/ca.lib>  <https://jenkins.aps.anl.gov/job/epics-7.0-windows/LIBRARIES=STATIC,OS=win64/ws/lib/windows-x64-static/Com.lib>  ws2_32.lib advapi32.lib user32.lib kernel32.lib winmm.lib     
make[4]: Leaving directory '<https://jenkins.aps.anl.gov/job/epics-7.0-windows/LIBRARIES=STATIC,OS=win64/ws/modules/pva2pva/testApp/O.windows-x64-static'>
<https://jenkins.aps.anl.gov/job/epics-7.0-windows/LIBRARIES=STATIC,OS=win64/ws/configure/RULES_ARCHS>:58: recipe for target 'install.windows-x64-static' failed
make[3]: *** [install.windows-x64-static] Error 2
<https://jenkins.aps.anl.gov/job/epics-7.0-windows/LIBRARIES=STATIC,OS=win64/ws/configure/RULES_DIRS>:84: recipe for target 'testApp.install' failed
make[2]: *** [testApp.install] Error 2
../configure/RULES_DIRS:84: recipe for target 'pva2pva.install' failed
make[1]: *** [pva2pva.install] Error 2
configure/RULES_DIRS:84: recipe for target 'modules.install' failed
make: *** [modules.install] Error 2
Build step 'Execute Windows batch command' marked build as failure
[WARNINGS] Skipping publisher since build result is FAILURE

Navigate by Date:
Prev: Re: Problem with INSTALL_LOCATION and "make uninstall" in 7.0.1 Dirk Zimoch
Next: Build failed in Jenkins: epics-7.0-windows » DLL, win64 #45 APS Jenkins
Index: 2002  2003  2004  2005  2006  2007  2008  2009  2010  2011  2012  2013  2014  2015  2016  2017  <20182019  2020  2021 
Navigate by Thread:
Prev: wrapped shared_ptr games Michael Davidsaver
Next: Build failed in Jenkins: epics-7.0-windows » DLL, win64 #45 APS Jenkins
Index: 2002  2003  2004  2005  2006  2007  2008  2009  2010  2011  2012  2013  2014  2015  2016  2017  <20182019  2020  2021 
ANJ, 21 Jun 2018 Valid HTML 4.01! · Home · News · About · Base · Modules · Extensions · Distributions · Download ·
· Search · EPICS V4 · IRMIS · Talk · Bugs · Documents · Links · Licensing ·