Argonne National Laboratory

Experimental Physics and
Industrial Control System

2002  2003  2004  2005  2006  2007  2008  2009  2010  2011  2012  2013  2014  2015  2016  2017  <20182019  2020  2021  Index 2002  2003  2004  2005  2006  2007  2008  2009  2010  2011  2012  2013  2014  2015  2016  2017  <20182019  2020  2021 
<== Date ==> <== Thread ==>

Subject: Build failed in Jenkins: epics-7.0-windows » STATIC,win64 #48
From: APS Jenkins <aps-jenkins@anl.gov>
To: core-talk@aps.anl.gov
Date: Thu, 21 Jun 2018 16:49:16 -0500 (CDT)
See <https://jenkins.aps.anl.gov/job/epics-7.0-windows/LIBRARIES=STATIC,OS=win64/48/display/redirect>

------------------------------------------
[...truncated 1.82 MB...]
c:\jenkins\win64-1\workspace\epics-7.0-windows\libraries\static\os\win64\modules\pva2pva\pdbapp\pdbsingle.cpp(290): warning C4267: 'argument': conversion from 'size_t' to 'epics::pvData::uint32', possible loss of data
c:\jenkins\win64-1\workspace\epics-7.0-windows\libraries\static\os\win64\modules\pva2pva\common\pvahelper.h(15): warning C4800: 'epics::pvData::boolean': forcing value to bool 'true' or 'false' (performance warning)
c:\jenkins\win64-1\workspace\epics-7.0-windows\libraries\static\os\win64\modules\pva2pva\pdbapp\pdbsingle.cpp(301): note: see reference to function template instantiation 'bool getS<epics::pvData::boolean,bool>(const epics::pvData::PVStructurePtr &,const char *,A &)' being compiled
        with
        [
            A=bool
        ]
cl -EHsc -GR           -DUSE_TYPED_RSET -I../../common -I../../p2pApp -DFINAL_LOCATION="\"<https://jenkins.aps.anl.gov/job/epics-7.0-windows/LIBRARIES=STATIC,OS=win64/ws/"";> -DNOMINMAX     -nologo -FC -D__STDC__=0 -D_CRT_SECURE_NO_DEPRECATE -D_CRT_NONSTDC_NO_DEPRECATE   -Ox -Oy-   -W3 -w44355 -w44344 -w44251        -MT  -TP  -I. -I../O.Common -I. -I. -I.. -I<https://jenkins.aps.anl.gov/job/epics-7.0-windows/LIBRARIES=STATIC,OS=win64/ws/include/compiler/msvc> -I<https://jenkins.aps.anl.gov/job/epics-7.0-windows/LIBRARIES=STATIC,OS=win64/ws/include/os/WIN32> -I<https://jenkins.aps.anl.gov/job/epics-7.0-windows/LIBRARIES=STATIC,OS=win64/ws/include> -I<https://jenkins.aps.anl.gov/job/epics-7.0-windows/LIBRARIES=STATIC,OS=win64/ws/include/compiler/msvc> -I<https://jenkins.aps.anl.gov/job/epics-7.0-windows/LIBRARIES=STATIC,OS=win64/ws/include/os/WIN32> -I<https://jenkins.aps.anl.gov/job/epics-7.0-windows/LIBRARIES=STATIC,OS=win64/ws/include>        -c ../demo.cpp
demo.cpp
cl           -DUSE_TYPED_RSET -I../../common -I../../p2pApp -DFINAL_LOCATION="\"<https://jenkins.aps.anl.gov/job/epics-7.0-windows/LIBRARIES=STATIC,OS=win64/ws/"";> -DNOMINMAX     -nologo -FC -D__STDC__=0 -D_CRT_SECURE_NO_DEPRECATE -D_CRT_NONSTDC_NO_DEPRECATE   -Ox -Oy-   -W3        -MT    -I. -I../O.Common -I. -I. -I.. -I<https://jenkins.aps.anl.gov/job/epics-7.0-windows/LIBRARIES=STATIC,OS=win64/ws/include/compiler/msvc> -I<https://jenkins.aps.anl.gov/job/epics-7.0-windows/LIBRARIES=STATIC,OS=win64/ws/include/os/WIN32> -I<https://jenkins.aps.anl.gov/job/epics-7.0-windows/LIBRARIES=STATIC,OS=win64/ws/include> -I<https://jenkins.aps.anl.gov/job/epics-7.0-windows/LIBRARIES=STATIC,OS=win64/ws/include/compiler/msvc> -I<https://jenkins.aps.anl.gov/job/epics-7.0-windows/LIBRARIES=STATIC,OS=win64/ws/include/os/WIN32> -I<https://jenkins.aps.anl.gov/job/epics-7.0-windows/LIBRARIES=STATIC,OS=win64/ws/include>        -c ../imagedemo.c
imagedemo.c
cl -EHsc -GR           -DUSE_TYPED_RSET -I../../common -I../../p2pApp -DFINAL_LOCATION="\"<https://jenkins.aps.anl.gov/job/epics-7.0-windows/LIBRARIES=STATIC,OS=win64/ws/"";> -DNOMINMAX     -nologo -FC -D__STDC__=0 -D_CRT_SECURE_NO_DEPRECATE -D_CRT_NONSTDC_NO_DEPRECATE   -Ox -Oy-   -W3 -w44355 -w44344 -w44251        -MT  -TP  -I. -I../O.Common -I. -I. -I.. -I<https://jenkins.aps.anl.gov/job/epics-7.0-windows/LIBRARIES=STATIC,OS=win64/ws/include/compiler/msvc> -I<https://jenkins.aps.anl.gov/job/epics-7.0-windows/LIBRARIES=STATIC,OS=win64/ws/include/os/WIN32> -I<https://jenkins.aps.anl.gov/job/epics-7.0-windows/LIBRARIES=STATIC,OS=win64/ws/include> -I<https://jenkins.aps.anl.gov/job/epics-7.0-windows/LIBRARIES=STATIC,OS=win64/ws/include/compiler/msvc> -I<https://jenkins.aps.anl.gov/job/epics-7.0-windows/LIBRARIES=STATIC,OS=win64/ws/include/os/WIN32> -I<https://jenkins.aps.anl.gov/job/epics-7.0-windows/LIBRARIES=STATIC,OS=win64/ws/include>        -c ../pdbgroup.cpp
pdbgroup.cpp
c:\jenkins\win64-1\workspace\epics-7.0-windows\libraries\static\os\win64\include\pv\pvdata.h(508): warning C4800: 'char': forcing value to bool 'true' or 'false' (performance warning)
c:\jenkins\win64-1\workspace\epics-7.0-windows\libraries\static\os\win64\include\pv\pvdata.h(558): warning C4250: 'epics::pvData::PVString': inherits 'epics::pvData::PVScalarValue<std::string>::epics::pvData::PVScalarValue<std::string>::deserialize' via dominance
c:\jenkins\win64-1\workspace\epics-7.0-windows\libraries\static\os\win64\include\pv\pvdata.h(461): note: see declaration of 'epics::pvData::PVScalarValue<std::string>::deserialize'
c:\jenkins\win64-1\workspace\epics-7.0-windows\libraries\static\os\win64\modules\pva2pva\pdbapp\pdbgroup.cpp(294): warning C4267: 'argument': conversion from 'size_t' to 'epics::pvData::uint32', possible loss of data
c:\jenkins\win64-1\workspace\epics-7.0-windows\libraries\static\os\win64\modules\pva2pva\common\pvahelper.h(15): warning C4800: 'epics::pvData::boolean': forcing value to bool 'true' or 'false' (performance warning)
c:\jenkins\win64-1\workspace\epics-7.0-windows\libraries\static\os\win64\modules\pva2pva\pdbapp\pdbgroup.cpp(299): note: see reference to function template instantiation 'bool getS<epics::pvData::boolean,bool>(const epics::pvData::PVStructurePtr &,const char *,A &)' being compiled
        with
        [
            A=bool
        ]
cl -EHsc -GR           -DUSE_TYPED_RSET -I../../common -I../../p2pApp -DFINAL_LOCATION="\"<https://jenkins.aps.anl.gov/job/epics-7.0-windows/LIBRARIES=STATIC,OS=win64/ws/"";> -DNOMINMAX     -nologo -FC -D__STDC__=0 -D_CRT_SECURE_NO_DEPRECATE -D_CRT_NONSTDC_NO_DEPRECATE   -Ox -Oy-   -W3 -w44355 -w44344 -w44251        -MT  -TP  -I. -I../O.Common -I. -I. -I.. -I<https://jenkins.aps.anl.gov/job/epics-7.0-windows/LIBRARIES=STATIC,OS=win64/ws/include/compiler/msvc> -I<https://jenkins.aps.anl.gov/job/epics-7.0-windows/LIBRARIES=STATIC,OS=win64/ws/include/os/WIN32> -I<https://jenkins.aps.anl.gov/job/epics-7.0-windows/LIBRARIES=STATIC,OS=win64/ws/include> -I<https://jenkins.aps.anl.gov/job/epics-7.0-windows/LIBRARIES=STATIC,OS=win64/ws/include/compiler/msvc> -I<https://jenkins.aps.anl.gov/job/epics-7.0-windows/LIBRARIES=STATIC,OS=win64/ws/include/os/WIN32> -I<https://jenkins.aps.anl.gov/job/epics-7.0-windows/LIBRARIES=STATIC,OS=win64/ws/include>        -c ../configparse.cpp
configparse.cpp
c:\jenkins\win64-1\workspace\epics-7.0-windows\libraries\static\os\win64\include\pv\pvdata.h(508): warning C4800: 'char': forcing value to bool 'true' or 'false' (performance warning)
c:\jenkins\win64-1\workspace\epics-7.0-windows\libraries\static\os\win64\include\pv\pvdata.h(558): warning C4250: 'epics::pvData::PVString': inherits 'epics::pvData::PVScalarValue<std::string>::epics::pvData::PVScalarValue<std::string>::deserialize' via dominance
c:\jenkins\win64-1\workspace\epics-7.0-windows\libraries\static\os\win64\include\pv\pvdata.h(461): note: see declaration of 'epics::pvData::PVScalarValue<std::string>::deserialize'
c:\jenkins\win64-1\workspace\epics-7.0-windows\libraries\static\os\win64\modules\pva2pva\pdbapp\configparse.cpp(54): warning C4800: 'epics::pvData::boolean': forcing value to bool 'true' or 'false' (performance warning)
cl -EHsc -GR           -DUSE_TYPED_RSET -I../../common -I../../p2pApp -DFINAL_LOCATION="\"<https://jenkins.aps.anl.gov/job/epics-7.0-windows/LIBRARIES=STATIC,OS=win64/ws/"";> -DNOMINMAX     -nologo -FC -D__STDC__=0 -D_CRT_SECURE_NO_DEPRECATE -D_CRT_NONSTDC_NO_DEPRECATE   -Ox -Oy-   -W3 -w44355 -w44344 -w44251        -MT  -TP  -I. -I../O.Common -I. -I. -I.. -I<https://jenkins.aps.anl.gov/job/epics-7.0-windows/LIBRARIES=STATIC,OS=win64/ws/include/compiler/msvc> -I<https://jenkins.aps.anl.gov/job/epics-7.0-windows/LIBRARIES=STATIC,OS=win64/ws/include/os/WIN32> -I<https://jenkins.aps.anl.gov/job/epics-7.0-windows/LIBRARIES=STATIC,OS=win64/ws/include> -I<https://jenkins.aps.anl.gov/job/epics-7.0-windows/LIBRARIES=STATIC,OS=win64/ws/include/compiler/msvc> -I<https://jenkins.aps.anl.gov/job/epics-7.0-windows/LIBRARIES=STATIC,OS=win64/ws/include/os/WIN32> -I<https://jenkins.aps.anl.gov/job/epics-7.0-windows/LIBRARIES=STATIC,OS=win64/ws/include>        -c ../dbf_copy.cpp
dbf_copy.cpp
c:\jenkins\win64-1\workspace\epics-7.0-windows\libraries\static\os\win64\include\pv\pvdata.h(508): warning C4800: 'char': forcing value to bool 'true' or 'false' (performance warning)
c:\jenkins\win64-1\workspace\epics-7.0-windows\libraries\static\os\win64\include\pv\pvdata.h(558): warning C4250: 'epics::pvData::PVString': inherits 'epics::pvData::PVScalarValue<std::string>::epics::pvData::PVScalarValue<std::string>::deserialize' via dominance
c:\jenkins\win64-1\workspace\epics-7.0-windows\libraries\static\os\win64\include\pv\pvdata.h(461): note: see declaration of 'epics::pvData::PVScalarValue<std::string>::deserialize'
c:\jenkins\win64-1\workspace\epics-7.0-windows\libraries\static\os\win64\modules\pva2pva\pdbapp\dbf_copy.cpp(100): warning C4267: '=': conversion from 'size_t' to 'long', possible loss of data
c:\jenkins\win64-1\workspace\epics-7.0-windows\libraries\static\os\win64\modules\pva2pva\pdbapp\dbf_copy.cpp(242): warning C4267: 'argument': conversion from 'size_t' to 'epics::pvData::uint32', possible loss of data
cl -EHsc -GR           -DUSE_TYPED_RSET -I../../common -I../../p2pApp -DFINAL_LOCATION="\"<https://jenkins.aps.anl.gov/job/epics-7.0-windows/LIBRARIES=STATIC,OS=win64/ws/"";> -DNOMINMAX     -nologo -FC -D__STDC__=0 -D_CRT_SECURE_NO_DEPRECATE -D_CRT_NONSTDC_NO_DEPRECATE   -Ox -Oy-   -W3 -w44355 -w44344 -w44251        -MT  -TP  -I. -I../O.Common -I. -I. -I.. -I<https://jenkins.aps.anl.gov/job/epics-7.0-windows/LIBRARIES=STATIC,OS=win64/ws/include/compiler/msvc> -I<https://jenkins.aps.anl.gov/job/epics-7.0-windows/LIBRARIES=STATIC,OS=win64/ws/include/os/WIN32> -I<https://jenkins.aps.anl.gov/job/epics-7.0-windows/LIBRARIES=STATIC,OS=win64/ws/include> -I<https://jenkins.aps.anl.gov/job/epics-7.0-windows/LIBRARIES=STATIC,OS=win64/ws/include/compiler/msvc> -I<https://jenkins.aps.anl.gov/job/epics-7.0-windows/LIBRARIES=STATIC,OS=win64/ws/include/os/WIN32> -I<https://jenkins.aps.anl.gov/job/epics-7.0-windows/LIBRARIES=STATIC,OS=win64/ws/include>        -c ../tpool.cpp
tpool.cpp
cl -EHsc -GR           -DUSE_TYPED_RSET -I../../common -I../../p2pApp -DFINAL_LOCATION="\"<https://jenkins.aps.anl.gov/job/epics-7.0-windows/LIBRARIES=STATIC,OS=win64/ws/"";> -DNOMINMAX     -nologo -FC -D__STDC__=0 -D_CRT_SECURE_NO_DEPRECATE -D_CRT_NONSTDC_NO_DEPRECATE   -Ox -Oy-   -W3 -w44355 -w44344 -w44251        -MT  -TP  -I. -I../O.Common -I. -I. -I.. -I<https://jenkins.aps.anl.gov/job/epics-7.0-windows/LIBRARIES=STATIC,OS=win64/ws/include/compiler/msvc> -I<https://jenkins.aps.anl.gov/job/epics-7.0-windows/LIBRARIES=STATIC,OS=win64/ws/include/os/WIN32> -I<https://jenkins.aps.anl.gov/job/epics-7.0-windows/LIBRARIES=STATIC,OS=win64/ws/include> -I<https://jenkins.aps.anl.gov/job/epics-7.0-windows/LIBRARIES=STATIC,OS=win64/ws/include/compiler/msvc> -I<https://jenkins.aps.anl.gov/job/epics-7.0-windows/LIBRARIES=STATIC,OS=win64/ws/include/os/WIN32> -I<https://jenkins.aps.anl.gov/job/epics-7.0-windows/LIBRARIES=STATIC,OS=win64/ws/include>        -c ../pvalink.cpp
pvalink.cpp
c:\jenkins\win64-1\workspace\epics-7.0-windows\libraries\static\os\win64\include\pv\pvdata.h(508): warning C4800: 'char': forcing value to bool 'true' or 'false' (performance warning)
c:\jenkins\win64-1\workspace\epics-7.0-windows\libraries\static\os\win64\include\pv\pvdata.h(558): warning C4250: 'epics::pvData::PVString': inherits 'epics::pvData::PVScalarValue<std::string>::epics::pvData::PVScalarValue<std::string>::deserialize' via dominance
c:\jenkins\win64-1\workspace\epics-7.0-windows\libraries\static\os\win64\include\pv\pvdata.h(461): note: see declaration of 'epics::pvData::PVScalarValue<std::string>::deserialize'
cl -EHsc -GR           -DUSE_TYPED_RSET -I../../common -I../../p2pApp -DFINAL_LOCATION="\"<https://jenkins.aps.anl.gov/job/epics-7.0-windows/LIBRARIES=STATIC,OS=win64/ws/"";> -DNOMINMAX     -nologo -FC -D__STDC__=0 -D_CRT_SECURE_NO_DEPRECATE -D_CRT_NONSTDC_NO_DEPRECATE   -Ox -Oy-   -W3 -w44355 -w44344 -w44251        -MT  -TP  -I. -I../O.Common -I. -I. -I.. -I<https://jenkins.aps.anl.gov/job/epics-7.0-windows/LIBRARIES=STATIC,OS=win64/ws/include/compiler/msvc> -I<https://jenkins.aps.anl.gov/job/epics-7.0-windows/LIBRARIES=STATIC,OS=win64/ws/include/os/WIN32> -I<https://jenkins.aps.anl.gov/job/epics-7.0-windows/LIBRARIES=STATIC,OS=win64/ws/include> -I<https://jenkins.aps.anl.gov/job/epics-7.0-windows/LIBRARIES=STATIC,OS=win64/ws/include/compiler/msvc> -I<https://jenkins.aps.anl.gov/job/epics-7.0-windows/LIBRARIES=STATIC,OS=win64/ws/include/os/WIN32> -I<https://jenkins.aps.anl.gov/job/epics-7.0-windows/LIBRARIES=STATIC,OS=win64/ws/include>        -c ../pvalink_lset.cpp
pvalink_lset.cpp
c:\jenkins\win64-1\workspace\epics-7.0-windows\libraries\static\os\win64\include\pv\pvdata.h(508): warning C4800: 'char': forcing value to bool 'true' or 'false' (performance warning)
c:\jenkins\win64-1\workspace\epics-7.0-windows\libraries\static\os\win64\include\pv\pvdata.h(558): warning C4250: 'epics::pvData::PVString': inherits 'epics::pvData::PVScalarValue<std::string>::epics::pvData::PVScalarValue<std::string>::deserialize' via dominance
c:\jenkins\win64-1\workspace\epics-7.0-windows\libraries\static\os\win64\include\pv\pvdata.h(461): note: see declaration of 'epics::pvData::PVScalarValue<std::string>::deserialize'
c:\jenkins\win64-1\workspace\epics-7.0-windows\libraries\static\os\win64\modules\pva2pva\pdbapp\pvalink_lset.cpp(178): warning C4267: '=': conversion from 'size_t' to 'long', possible loss of data
cl -EHsc -GR           -DUSE_TYPED_RSET -I../../common -I../../p2pApp -DFINAL_LOCATION="\"<https://jenkins.aps.anl.gov/job/epics-7.0-windows/LIBRARIES=STATIC,OS=win64/ws/"";> -DNOMINMAX     -nologo -FC -D__STDC__=0 -D_CRT_SECURE_NO_DEPRECATE -D_CRT_NONSTDC_NO_DEPRECATE   -Ox -Oy-   -W3 -w44355 -w44344 -w44251        -MT  -TP  -I. -I../O.Common -I. -I. -I.. -I<https://jenkins.aps.anl.gov/job/epics-7.0-windows/LIBRARIES=STATIC,OS=win64/ws/include/compiler/msvc> -I<https://jenkins.aps.anl.gov/job/epics-7.0-windows/LIBRARIES=STATIC,OS=win64/ws/include/os/WIN32> -I<https://jenkins.aps.anl.gov/job/epics-7.0-windows/LIBRARIES=STATIC,OS=win64/ws/include> -I<https://jenkins.aps.anl.gov/job/epics-7.0-windows/LIBRARIES=STATIC,OS=win64/ws/include/compiler/msvc> -I<https://jenkins.aps.anl.gov/job/epics-7.0-windows/LIBRARIES=STATIC,OS=win64/ws/include/os/WIN32> -I<https://jenkins.aps.anl.gov/job/epics-7.0-windows/LIBRARIES=STATIC,OS=win64/ws/include>        -c ../pvalink_jlif.cpp
pvalink_jlif.cpp
c:\jenkins\win64-1\workspace\epics-7.0-windows\libraries\static\os\win64\include\pv\pvdata.h(508): warning C4800: 'char': forcing value to bool 'true' or 'false' (performance warning)
c:\jenkins\win64-1\workspace\epics-7.0-windows\libraries\static\os\win64\include\pv\pvdata.h(558): warning C4250: 'epics::pvData::PVString': inherits 'epics::pvData::PVScalarValue<std::string>::epics::pvData::PVScalarValue<std::string>::deserialize' via dominance
c:\jenkins\win64-1\workspace\epics-7.0-windows\libraries\static\os\win64\include\pv\pvdata.h(461): note: see declaration of 'epics::pvData::PVScalarValue<std::string>::deserialize'
c:\jenkins\win64-1\workspace\epics-7.0-windows\libraries\static\os\win64\modules\pva2pva\pdbapp\pvalink_jlif.cpp(53): warning C4003: not enough actual parameters for macro 'TRACE'
c:\jenkins\win64-1\workspace\epics-7.0-windows\libraries\static\os\win64\modules\pva2pva\pdbapp\pvalink_jlif.cpp(70): warning C4003: not enough actual parameters for macro 'TRACE'
c:\jenkins\win64-1\workspace\epics-7.0-windows\libraries\static\os\win64\modules\pva2pva\pdbapp\pvalink_jlif.cpp(211): warning C4003: not enough actual parameters for macro 'TRACE'
c:\jenkins\win64-1\workspace\epics-7.0-windows\libraries\static\os\win64\modules\pva2pva\pdbapp\pvalink_jlif.cpp(230): warning C4003: not enough actual parameters for macro 'TRACE'
c:\jenkins\win64-1\workspace\epics-7.0-windows\libraries\static\os\win64\modules\pva2pva\pdbapp\pvalink_jlif.cpp(237): warning C4003: not enough actual parameters for macro 'TRACE'
c:\jenkins\win64-1\workspace\epics-7.0-windows\libraries\static\os\win64\modules\pva2pva\pdbapp\pvalink_jlif.cpp(297): warning C4003: not enough actual parameters for macro 'CATCH'
cl -EHsc -GR           -DUSE_TYPED_RSET -I../../common -I../../p2pApp -DFINAL_LOCATION="\"<https://jenkins.aps.anl.gov/job/epics-7.0-windows/LIBRARIES=STATIC,OS=win64/ws/"";> -DNOMINMAX     -nologo -FC -D__STDC__=0 -D_CRT_SECURE_NO_DEPRECATE -D_CRT_NONSTDC_NO_DEPRECATE   -Ox -Oy-   -W3 -w44355 -w44344 -w44251        -MT  -TP  -I. -I../O.Common -I. -I. -I.. -I<https://jenkins.aps.anl.gov/job/epics-7.0-windows/LIBRARIES=STATIC,OS=win64/ws/include/compiler/msvc> -I<https://jenkins.aps.anl.gov/job/epics-7.0-windows/LIBRARIES=STATIC,OS=win64/ws/include/os/WIN32> -I<https://jenkins.aps.anl.gov/job/epics-7.0-windows/LIBRARIES=STATIC,OS=win64/ws/include> -I<https://jenkins.aps.anl.gov/job/epics-7.0-windows/LIBRARIES=STATIC,OS=win64/ws/include/compiler/msvc> -I<https://jenkins.aps.anl.gov/job/epics-7.0-windows/LIBRARIES=STATIC,OS=win64/ws/include/os/WIN32> -I<https://jenkins.aps.anl.gov/job/epics-7.0-windows/LIBRARIES=STATIC,OS=win64/ws/include>        -c ../pvalink_link.cpp
pvalink_link.cpp
c:\jenkins\win64-1\workspace\epics-7.0-windows\libraries\static\os\win64\include\pv\pvdata.h(508): warning C4800: 'char': forcing value to bool 'true' or 'false' (performance warning)
c:\jenkins\win64-1\workspace\epics-7.0-windows\libraries\static\os\win64\include\pv\pvdata.h(558): warning C4250: 'epics::pvData::PVString': inherits 'epics::pvData::PVScalarValue<std::string>::epics::pvData::PVScalarValue<std::string>::deserialize' via dominance
c:\jenkins\win64-1\workspace\epics-7.0-windows\libraries\static\os\win64\include\pv\pvdata.h(461): note: see declaration of 'epics::pvData::PVScalarValue<std::string>::deserialize'
c:\jenkins\win64-1\workspace\epics-7.0-windows\libraries\static\os\win64\modules\pva2pva\pdbapp\pvalink_link.cpp(73): warning C4267: 'argument': conversion from 'size_t' to 'unsigned int', possible loss of data
c:\jenkins\win64-1\workspace\epics-7.0-windows\libraries\static\os\win64\modules\pva2pva\pdbapp\pvalink_link.cpp(139): warning C4267: 'argument': conversion from 'size_t' to 'epics::pvData::uint32', possible loss of data
c:\jenkins\win64-1\workspace\epics-7.0-windows\libraries\static\os\win64\modules\pva2pva\pdbapp\pvalink_link.cpp(143): warning C4267: 'argument': conversion from 'size_t' to 'epics::pvData::uint32', possible loss of data
c:\jenkins\win64-1\workspace\epics-7.0-windows\libraries\static\os\win64\modules\pva2pva\pdbapp\pvalink_link.cpp(151): warning C4267: 'argument': conversion from 'size_t' to 'epics::pvData::uint32', possible loss of data
cl -EHsc -GR           -DUSE_TYPED_RSET -I../../common -I../../p2pApp -DFINAL_LOCATION="\"<https://jenkins.aps.anl.gov/job/epics-7.0-windows/LIBRARIES=STATIC,OS=win64/ws/"";> -DNOMINMAX     -nologo -FC -D__STDC__=0 -D_CRT_SECURE_NO_DEPRECATE -D_CRT_NONSTDC_NO_DEPRECATE   -Ox -Oy-   -W3 -w44355 -w44344 -w44251        -MT  -TP  -I. -I../O.Common -I. -I. -I.. -I<https://jenkins.aps.anl.gov/job/epics-7.0-windows/LIBRARIES=STATIC,OS=win64/ws/include/compiler/msvc> -I<https://jenkins.aps.anl.gov/job/epics-7.0-windows/LIBRARIES=STATIC,OS=win64/ws/include/os/WIN32> -I<https://jenkins.aps.anl.gov/job/epics-7.0-windows/LIBRARIES=STATIC,OS=win64/ws/include> -I<https://jenkins.aps.anl.gov/job/epics-7.0-windows/LIBRARIES=STATIC,OS=win64/ws/include/compiler/msvc> -I<https://jenkins.aps.anl.gov/job/epics-7.0-windows/LIBRARIES=STATIC,OS=win64/ws/include/os/WIN32> -I<https://jenkins.aps.anl.gov/job/epics-7.0-windows/LIBRARIES=STATIC,OS=win64/ws/include>        -c ../pvalink_channel.cpp
pvalink_channel.cpp
c:\jenkins\win64-1\workspace\epics-7.0-windows\libraries\static\os\win64\include\pv\pvdata.h(508): warning C4800: 'char': forcing value to bool 'true' or 'false' (performance warning)
c:\jenkins\win64-1\workspace\epics-7.0-windows\libraries\static\os\win64\include\pv\pvdata.h(558): warning C4250: 'epics::pvData::PVString': inherits 'epics::pvData::PVScalarValue<std::string>::epics::pvData::PVScalarValue<std::string>::deserialize' via dominance
c:\jenkins\win64-1\workspace\epics-7.0-windows\libraries\static\os\win64\include\pv\pvdata.h(461): note: see declaration of 'epics::pvData::PVScalarValue<std::string>::deserialize'
lib -nologo -verbose -out:qsrv.lib        pvif.obj qsrv.obj pdb.obj pdbsingle.obj demo.obj imagedemo.obj pdbgroup.obj configparse.obj dbf_copy.obj tpool.obj pvalink.obj pvalink_lset.obj pvalink_jlif.obj pvalink_link.obj pvalink_channel.obj 
Appending pvalink_channel.obj
Appending pvalink_link.obj
Appending pvalink_jlif.obj
Appending pvalink_lset.obj
Appending pvalink.obj
Appending tpool.obj
Appending dbf_copy.obj
Appending configparse.obj
Appending pdbgroup.obj
Appending imagedemo.obj
Appending demo.obj
Appending pdbsingle.obj
Appending pdb.obj
Appending qsrv.obj
Appending pvif.obj
"Installing library <https://jenkins.aps.anl.gov/job/epics-7.0-windows/LIBRARIES=STATIC,OS=win64/ws/lib/windows-x64-static/qsrv.lib";>
cl -EHsc -GR           -DUSE_TYPED_RSET -I../../common -I../../p2pApp -DFINAL_LOCATION="\"<https://jenkins.aps.anl.gov/job/epics-7.0-windows/LIBRARIES=STATIC,OS=win64/ws/"";> -DNOMINMAX     -nologo -FC -D__STDC__=0 -D_CRT_SECURE_NO_DEPRECATE -D_CRT_NONSTDC_NO_DEPRECATE   -Ox -Oy-   -W3 -w44355 -w44344 -w44251        -MT  -TP  -I. -I../O.Common -I. -I. -I.. -I<https://jenkins.aps.anl.gov/job/epics-7.0-windows/LIBRARIES=STATIC,OS=win64/ws/include/compiler/msvc> -I<https://jenkins.aps.anl.gov/job/epics-7.0-windows/LIBRARIES=STATIC,OS=win64/ws/include/os/WIN32> -I<https://jenkins.aps.anl.gov/job/epics-7.0-windows/LIBRARIES=STATIC,OS=win64/ws/include> -I<https://jenkins.aps.anl.gov/job/epics-7.0-windows/LIBRARIES=STATIC,OS=win64/ws/include/compiler/msvc> -I<https://jenkins.aps.anl.gov/job/epics-7.0-windows/LIBRARIES=STATIC,OS=win64/ws/include/os/WIN32> -I<https://jenkins.aps.anl.gov/job/epics-7.0-windows/LIBRARIES=STATIC,OS=win64/ws/include>        -c ../softMain.cpp
softMain.cpp
cl -EHsc -GR           -DUSE_TYPED_RSET -I../../common -I../../p2pApp -DFINAL_LOCATION="\"<https://jenkins.aps.anl.gov/job/epics-7.0-windows/LIBRARIES=STATIC,OS=win64/ws/"";> -DNOMINMAX     -nologo -FC -D__STDC__=0 -D_CRT_SECURE_NO_DEPRECATE -D_CRT_NONSTDC_NO_DEPRECATE   -Ox -Oy-   -W3 -w44355 -w44344 -w44251        -MT  -TP  -I. -I../O.Common -I. -I. -I.. -I<https://jenkins.aps.anl.gov/job/epics-7.0-windows/LIBRARIES=STATIC,OS=win64/ws/include/compiler/msvc> -I<https://jenkins.aps.anl.gov/job/epics-7.0-windows/LIBRARIES=STATIC,OS=win64/ws/include/os/WIN32> -I<https://jenkins.aps.anl.gov/job/epics-7.0-windows/LIBRARIES=STATIC,OS=win64/ws/include> -I<https://jenkins.aps.anl.gov/job/epics-7.0-windows/LIBRARIES=STATIC,OS=win64/ws/include/compiler/msvc> -I<https://jenkins.aps.anl.gov/job/epics-7.0-windows/LIBRARIES=STATIC,OS=win64/ws/include/os/WIN32> -I<https://jenkins.aps.anl.gov/job/epics-7.0-windows/LIBRARIES=STATIC,OS=win64/ws/include>        -c softIocPVA_registerRecordDeviceDriver.cpp
softIocPVA_registerRecordDeviceDriver.cpp
link -nologo   -incremental:no -opt:ref -release  -MACHINE:X64              -out:softIocPVA.exe       softMain.obj softIocPVA_registerRecordDeviceDriver.obj     <https://jenkins.aps.anl.gov/job/epics-7.0-windows/LIBRARIES=STATIC,OS=win64/ws/lib/windows-x64-static/qsrv.lib>  <https://jenkins.aps.anl.gov/job/epics-7.0-windows/LIBRARIES=STATIC,OS=win64/ws/lib/windows-x64-static/pvAccessIOC.lib>  <https://jenkins.aps.anl.gov/job/epics-7.0-windows/LIBRARIES=STATIC,OS=win64/ws/lib/windows-x64-static/pvAccessCA.lib>  <https://jenkins.aps.anl.gov/job/epics-7.0-windows/LIBRARIES=STATIC,OS=win64/ws/lib/windows-x64-static/pvAccess.lib>  <https://jenkins.aps.anl.gov/job/epics-7.0-windows/LIBRARIES=STATIC,OS=win64/ws/lib/windows-x64-static/pvData.lib>  <https://jenkins.aps.anl.gov/job/epics-7.0-windows/LIBRARIES=STATIC,OS=win64/ws/lib/windows-x64-static/dbRecStd.lib>  <https://jenkins.aps.anl.gov/job/epics-7.0-windows/LIBRARIES=STATIC,OS=win64/ws/lib/windows-x64-static/dbCore.lib>  <https://jenkins.aps.anl.gov/job/epics-7.0-windows/LIBRARIES=STATIC,OS=win64/ws/lib/windows-x64-static/ca.lib>  <https://jenkins.aps.anl.gov/job/epics-7.0-windows/LIBRARIES=STATIC,OS=win64/ws/lib/windows-x64-static/Com.lib>   ws2_32.lib advapi32.lib user32.lib kernel32.lib winmm.lib     
"Installing created executable <https://jenkins.aps.anl.gov/job/epics-7.0-windows/LIBRARIES=STATIC,OS=win64/ws/bin/windows-x64-static/softIocPVA.exe";>
make[4]: Leaving directory '<https://jenkins.aps.anl.gov/job/epics-7.0-windows/LIBRARIES=STATIC,OS=win64/ws/modules/pva2pva/pdbApp/O.windows-x64-static'>
make[3]: Leaving directory '<https://jenkins.aps.anl.gov/job/epics-7.0-windows/LIBRARIES=STATIC,OS=win64/ws/modules/pva2pva/pdbApp'>
make -C ./testApp install 
make[3]: Entering directory '<https://jenkins.aps.anl.gov/job/epics-7.0-windows/LIBRARIES=STATIC,OS=win64/ws/modules/pva2pva/testApp'>
perl -CSD <https://jenkins.aps.anl.gov/job/epics-7.0-windows/LIBRARIES=STATIC,OS=win64/ws/bin/windows-x64-static/makeMakefile.pl> O.windows-x64-static ../..
perl -CSD -MExtUtils::Command -e mkpath O.Common
make -C O.windows-x64-static -f ../Makefile TOP=../.. \
    T_A=windows-x64-static install
make[4]: Entering directory '<https://jenkins.aps.anl.gov/job/epics-7.0-windows/LIBRARIES=STATIC,OS=win64/ws/modules/pva2pva/testApp/O.windows-x64-static'>
perl -CSD <https://jenkins.aps.anl.gov/job/epics-7.0-windows/LIBRARIES=STATIC,OS=win64/ws/bin/windows-x64-static/mkmf.pl>  -m check_consist.d -I. -I../O.Common -I. -I. -I.. -I<https://jenkins.aps.anl.gov/job/epics-7.0-windows/LIBRARIES=STATIC,OS=win64/ws/include/compiler/msvc> -I<https://jenkins.aps.anl.gov/job/epics-7.0-windows/LIBRARIES=STATIC,OS=win64/ws/include/os/WIN32> -I<https://jenkins.aps.anl.gov/job/epics-7.0-windows/LIBRARIES=STATIC,OS=win64/ws/include> -I<https://jenkins.aps.anl.gov/job/epics-7.0-windows/LIBRARIES=STATIC,OS=win64/ws/include/compiler/msvc> -I<https://jenkins.aps.anl.gov/job/epics-7.0-windows/LIBRARIES=STATIC,OS=win64/ws/include/os/WIN32> -I<https://jenkins.aps.anl.gov/job/epics-7.0-windows/LIBRARIES=STATIC,OS=win64/ws/include>        check_consist.obj ../check_consist.cpp
perl -CSD <https://jenkins.aps.anl.gov/job/epics-7.0-windows/LIBRARIES=STATIC,OS=win64/ws/bin/windows-x64-static/mkmf.pl>  -m testdbf_copy.d -I. -I../O.Common -I. -I. -I.. -I<https://jenkins.aps.anl.gov/job/epics-7.0-windows/LIBRARIES=STATIC,OS=win64/ws/include/compiler/msvc> -I<https://jenkins.aps.anl.gov/job/epics-7.0-windows/LIBRARIES=STATIC,OS=win64/ws/include/os/WIN32> -I<https://jenkins.aps.anl.gov/job/epics-7.0-windows/LIBRARIES=STATIC,OS=win64/ws/include> -I<https://jenkins.aps.anl.gov/job/epics-7.0-windows/LIBRARIES=STATIC,OS=win64/ws/include/compiler/msvc> -I<https://jenkins.aps.anl.gov/job/epics-7.0-windows/LIBRARIES=STATIC,OS=win64/ws/include/os/WIN32> -I<https://jenkins.aps.anl.gov/job/epics-7.0-windows/LIBRARIES=STATIC,OS=win64/ws/include>        testdbf_copy.obj ../testdbf_copy.cpp
perl -CSD <https://jenkins.aps.anl.gov/job/epics-7.0-windows/LIBRARIES=STATIC,OS=win64/ws/bin/windows-x64-static/mkmf.pl>  -m testgroupconfig.d -I. -I../O.Common -I. -I. -I.. -I<https://jenkins.aps.anl.gov/job/epics-7.0-windows/LIBRARIES=STATIC,OS=win64/ws/include/compiler/msvc> -I<https://jenkins.aps.anl.gov/job/epics-7.0-windows/LIBRARIES=STATIC,OS=win64/ws/include/os/WIN32> -I<https://jenkins.aps.anl.gov/job/epics-7.0-windows/LIBRARIES=STATIC,OS=win64/ws/include> -I<https://jenkins.aps.anl.gov/job/epics-7.0-windows/LIBRARIES=STATIC,OS=win64/ws/include/compiler/msvc> -I<https://jenkins.aps.anl.gov/job/epics-7.0-windows/LIBRARIES=STATIC,OS=win64/ws/include/os/WIN32> -I<https://jenkins.aps.anl.gov/job/epics-7.0-windows/LIBRARIES=STATIC,OS=win64/ws/include>        testgroupconfig.obj ../testgroupconfig.cpp
"Creating dbd file pvaLinkTestIoc.dbd"
perl -CSD <https://jenkins.aps.anl.gov/job/epics-7.0-windows/LIBRARIES=STATIC,OS=win64/ws/bin/windows-x64-static/dbdExpand.pl>   -I. -I.. -I../O.Common -I<https://jenkins.aps.anl.gov/job/epics-7.0-windows/LIBRARIES=STATIC,OS=win64/ws/dbd> -I<https://jenkins.aps.anl.gov/job/epics-7.0-windows/LIBRARIES=STATIC,OS=win64/ws/dbd> -o pvaLinkTestIoc.dbd base.dbd qsrv.dbd
perl -CSD <https://jenkins.aps.anl.gov/job/epics-7.0-windows/LIBRARIES=STATIC,OS=win64/ws/bin/windows-x64-static/registerRecordDeviceDriver.pl>   -I. -I.. -I../O.Common -I<https://jenkins.aps.anl.gov/job/epics-7.0-windows/LIBRARIES=STATIC,OS=win64/ws/dbd> -I<https://jenkins.aps.anl.gov/job/epics-7.0-windows/LIBRARIES=STATIC,OS=win64/ws/dbd>    -o pvaLinkTestIoc_registerRecordDeviceDriver.cpp ../O.Common/pvaLinkTestIoc.dbd pvaLinkTestIoc_registerRecordDeviceDriver <https://jenkins.aps.anl.gov/job/epics-7.0-windows/LIBRARIES=STATIC,OS=win64/ws/>
perl -CSD <https://jenkins.aps.anl.gov/job/epics-7.0-windows/LIBRARIES=STATIC,OS=win64/ws/bin/windows-x64-static/mkmf.pl>  -m pvaLinkTestIoc_registerRecordDeviceDriver.d -I. -I../O.Common -I. -I. -I.. -I<https://jenkins.aps.anl.gov/job/epics-7.0-windows/LIBRARIES=STATIC,OS=win64/ws/include/compiler/msvc> -I<https://jenkins.aps.anl.gov/job/epics-7.0-windows/LIBRARIES=STATIC,OS=win64/ws/include/os/WIN32> -I<https://jenkins.aps.anl.gov/job/epics-7.0-windows/LIBRARIES=STATIC,OS=win64/ws/include> -I<https://jenkins.aps.anl.gov/job/epics-7.0-windows/LIBRARIES=STATIC,OS=win64/ws/include/compiler/msvc> -I<https://jenkins.aps.anl.gov/job/epics-7.0-windows/LIBRARIES=STATIC,OS=win64/ws/include/os/WIN32> -I<https://jenkins.aps.anl.gov/job/epics-7.0-windows/LIBRARIES=STATIC,OS=win64/ws/include>        pvaLinkTestIoc_registerRecordDeviceDriver.obj pvaLinkTestIoc_registerRecordDeviceDriver.cpp
perl -CSD <https://jenkins.aps.anl.gov/job/epics-7.0-windows/LIBRARIES=STATIC,OS=win64/ws/bin/windows-x64-static/mkmf.pl>  -m testpvalink.d -I. -I../O.Common -I. -I. -I.. -I<https://jenkins.aps.anl.gov/job/epics-7.0-windows/LIBRARIES=STATIC,OS=win64/ws/include/compiler/msvc> -I<https://jenkins.aps.anl.gov/job/epics-7.0-windows/LIBRARIES=STATIC,OS=win64/ws/include/os/WIN32> -I<https://jenkins.aps.anl.gov/job/epics-7.0-windows/LIBRARIES=STATIC,OS=win64/ws/include> -I<https://jenkins.aps.anl.gov/job/epics-7.0-windows/LIBRARIES=STATIC,OS=win64/ws/include/compiler/msvc> -I<https://jenkins.aps.anl.gov/job/epics-7.0-windows/LIBRARIES=STATIC,OS=win64/ws/include/os/WIN32> -I<https://jenkins.aps.anl.gov/job/epics-7.0-windows/LIBRARIES=STATIC,OS=win64/ws/include>        testpvalink.obj ../testpvalink.cpp
"Creating dbd file p2pTestIoc.dbd"
perl -CSD <https://jenkins.aps.anl.gov/job/epics-7.0-windows/LIBRARIES=STATIC,OS=win64/ws/bin/windows-x64-static/dbdExpand.pl>   -I. -I.. -I../O.Common -I<https://jenkins.aps.anl.gov/job/epics-7.0-windows/LIBRARIES=STATIC,OS=win64/ws/dbd> -I<https://jenkins.aps.anl.gov/job/epics-7.0-windows/LIBRARIES=STATIC,OS=win64/ws/dbd> -o p2pTestIoc.dbd base.dbd
perl -CSD <https://jenkins.aps.anl.gov/job/epics-7.0-windows/LIBRARIES=STATIC,OS=win64/ws/bin/windows-x64-static/registerRecordDeviceDriver.pl>   -I. -I.. -I../O.Common -I<https://jenkins.aps.anl.gov/job/epics-7.0-windows/LIBRARIES=STATIC,OS=win64/ws/dbd> -I<https://jenkins.aps.anl.gov/job/epics-7.0-windows/LIBRARIES=STATIC,OS=win64/ws/dbd>    -o p2pTestIoc_registerRecordDeviceDriver.cpp ../O.Common/p2pTestIoc.dbd p2pTestIoc_registerRecordDeviceDriver <https://jenkins.aps.anl.gov/job/epics-7.0-windows/LIBRARIES=STATIC,OS=win64/ws/>
perl -CSD <https://jenkins.aps.anl.gov/job/epics-7.0-windows/LIBRARIES=STATIC,OS=win64/ws/bin/windows-x64-static/mkmf.pl>  -m p2pTestIoc_registerRecordDeviceDriver.d -I. -I../O.Common -I. -I. -I.. -I<https://jenkins.aps.anl.gov/job/epics-7.0-windows/LIBRARIES=STATIC,OS=win64/ws/include/compiler/msvc> -I<https://jenkins.aps.anl.gov/job/epics-7.0-windows/LIBRARIES=STATIC,OS=win64/ws/include/os/WIN32> -I<https://jenkins.aps.anl.gov/job/epics-7.0-windows/LIBRARIES=STATIC,OS=win64/ws/include> -I<https://jenkins.aps.anl.gov/job/epics-7.0-windows/LIBRARIES=STATIC,OS=win64/ws/include/compiler/msvc> -I<https://jenkins.aps.anl.gov/job/epics-7.0-windows/LIBRARIES=STATIC,OS=win64/ws/include/os/WIN32> -I<https://jenkins.aps.anl.gov/job/epics-7.0-windows/LIBRARIES=STATIC,OS=win64/ws/include>        p2pTestIoc_registerRecordDeviceDriver.obj p2pTestIoc_registerRecordDeviceDriver.cpp
perl -CSD <https://jenkins.aps.anl.gov/job/epics-7.0-windows/LIBRARIES=STATIC,OS=win64/ws/bin/windows-x64-static/mkmf.pl>  -m testpdb.d -I. -I../O.Common -I. -I. -I.. -I<https://jenkins.aps.anl.gov/job/epics-7.0-windows/LIBRARIES=STATIC,OS=win64/ws/include/compiler/msvc> -I<https://jenkins.aps.anl.gov/job/epics-7.0-windows/LIBRARIES=STATIC,OS=win64/ws/include/os/WIN32> -I<https://jenkins.aps.anl.gov/job/epics-7.0-windows/LIBRARIES=STATIC,OS=win64/ws/include> -I<https://jenkins.aps.anl.gov/job/epics-7.0-windows/LIBRARIES=STATIC,OS=win64/ws/include/compiler/msvc> -I<https://jenkins.aps.anl.gov/job/epics-7.0-windows/LIBRARIES=STATIC,OS=win64/ws/include/os/WIN32> -I<https://jenkins.aps.anl.gov/job/epics-7.0-windows/LIBRARIES=STATIC,OS=win64/ws/include>        testpdb.obj ../testpdb.cpp
perl -CSD <https://jenkins.aps.anl.gov/job/epics-7.0-windows/LIBRARIES=STATIC,OS=win64/ws/bin/windows-x64-static/mkmf.pl>  -m testpvif.d -I. -I../O.Common -I. -I. -I.. -I<https://jenkins.aps.anl.gov/job/epics-7.0-windows/LIBRARIES=STATIC,OS=win64/ws/include/compiler/msvc> -I<https://jenkins.aps.anl.gov/job/epics-7.0-windows/LIBRARIES=STATIC,OS=win64/ws/include/os/WIN32> -I<https://jenkins.aps.anl.gov/job/epics-7.0-windows/LIBRARIES=STATIC,OS=win64/ws/include> -I<https://jenkins.aps.anl.gov/job/epics-7.0-windows/LIBRARIES=STATIC,OS=win64/ws/include/compiler/msvc> -I<https://jenkins.aps.anl.gov/job/epics-7.0-windows/LIBRARIES=STATIC,OS=win64/ws/include/os/WIN32> -I<https://jenkins.aps.anl.gov/job/epics-7.0-windows/LIBRARIES=STATIC,OS=win64/ws/include>        testpvif.obj ../testpvif.cpp
perl -CSD <https://jenkins.aps.anl.gov/job/epics-7.0-windows/LIBRARIES=STATIC,OS=win64/ws/bin/windows-x64-static/mkmf.pl>  -m testtest.d -I. -I../O.Common -I. -I. -I.. -I<https://jenkins.aps.anl.gov/job/epics-7.0-windows/LIBRARIES=STATIC,OS=win64/ws/include/compiler/msvc> -I<https://jenkins.aps.anl.gov/job/epics-7.0-windows/LIBRARIES=STATIC,OS=win64/ws/include/os/WIN32> -I<https://jenkins.aps.anl.gov/job/epics-7.0-windows/LIBRARIES=STATIC,OS=win64/ws/include> -I<https://jenkins.aps.anl.gov/job/epics-7.0-windows/LIBRARIES=STATIC,OS=win64/ws/include/compiler/msvc> -I<https://jenkins.aps.anl.gov/job/epics-7.0-windows/LIBRARIES=STATIC,OS=win64/ws/include/os/WIN32> -I<https://jenkins.aps.anl.gov/job/epics-7.0-windows/LIBRARIES=STATIC,OS=win64/ws/include>        testtest.obj ../testtest.cpp
perl -CSD <https://jenkins.aps.anl.gov/job/epics-7.0-windows/LIBRARIES=STATIC,OS=win64/ws/bin/windows-x64-static/mkmf.pl>  -m testweak.d -I. -I../O.Common -I. -I. -I.. -I<https://jenkins.aps.anl.gov/job/epics-7.0-windows/LIBRARIES=STATIC,OS=win64/ws/include/compiler/msvc> -I<https://jenkins.aps.anl.gov/job/epics-7.0-windows/LIBRARIES=STATIC,OS=win64/ws/include/os/WIN32> -I<https://jenkins.aps.anl.gov/job/epics-7.0-windows/LIBRARIES=STATIC,OS=win64/ws/include> -I<https://jenkins.aps.anl.gov/job/epics-7.0-windows/LIBRARIES=STATIC,OS=win64/ws/include/compiler/msvc> -I<https://jenkins.aps.anl.gov/job/epics-7.0-windows/LIBRARIES=STATIC,OS=win64/ws/include/os/WIN32> -I<https://jenkins.aps.anl.gov/job/epics-7.0-windows/LIBRARIES=STATIC,OS=win64/ws/include>        testweak.obj ../testweak.cpp
perl -CSD <https://jenkins.aps.anl.gov/job/epics-7.0-windows/LIBRARIES=STATIC,OS=win64/ws/bin/windows-x64-static/mkmf.pl>  -m utilitiesx.d -I. -I../O.Common -I. -I. -I.. -I<https://jenkins.aps.anl.gov/job/epics-7.0-windows/LIBRARIES=STATIC,OS=win64/ws/include/compiler/msvc> -I<https://jenkins.aps.anl.gov/job/epics-7.0-windows/LIBRARIES=STATIC,OS=win64/ws/include/os/WIN32> -I<https://jenkins.aps.anl.gov/job/epics-7.0-windows/LIBRARIES=STATIC,OS=win64/ws/include> -I<https://jenkins.aps.anl.gov/job/epics-7.0-windows/LIBRARIES=STATIC,OS=win64/ws/include/compiler/msvc> -I<https://jenkins.aps.anl.gov/job/epics-7.0-windows/LIBRARIES=STATIC,OS=win64/ws/include/os/WIN32> -I<https://jenkins.aps.anl.gov/job/epics-7.0-windows/LIBRARIES=STATIC,OS=win64/ws/include>        utilitiesx.obj ../utilitiesx.cpp
cl -EHsc -GR           -DUSE_TYPED_RSET -I../../pdbApp -I../../p2pApp -I../../common -DNOMINMAX     -nologo -FC -D__STDC__=0 -D_CRT_SECURE_NO_DEPRECATE -D_CRT_NONSTDC_NO_DEPRECATE   -Ox -Oy-   -W3 -w44355 -w44344 -w44251        -MT  -TP  -I. -I../O.Common -I. -I. -I.. -I<https://jenkins.aps.anl.gov/job/epics-7.0-windows/LIBRARIES=STATIC,OS=win64/ws/include/compiler/msvc> -I<https://jenkins.aps.anl.gov/job/epics-7.0-windows/LIBRARIES=STATIC,OS=win64/ws/include/os/WIN32> -I<https://jenkins.aps.anl.gov/job/epics-7.0-windows/LIBRARIES=STATIC,OS=win64/ws/include> -I<https://jenkins.aps.anl.gov/job/epics-7.0-windows/LIBRARIES=STATIC,OS=win64/ws/include/compiler/msvc> -I<https://jenkins.aps.anl.gov/job/epics-7.0-windows/LIBRARIES=STATIC,OS=win64/ws/include/os/WIN32> -I<https://jenkins.aps.anl.gov/job/epics-7.0-windows/LIBRARIES=STATIC,OS=win64/ws/include>        -c ../check_consist.cpp
check_consist.cpp
c:\jenkins\win64-1\workspace\epics-7.0-windows\libraries\static\os\win64\include\pv\pvdata.h(508): warning C4800: 'char': forcing value to bool 'true' or 'false' (performance warning)
c:\jenkins\win64-1\workspace\epics-7.0-windows\libraries\static\os\win64\include\pv\pvdata.h(558): warning C4250: 'epics::pvData::PVString': inherits 'epics::pvData::PVScalarValue<std::string>::epics::pvData::PVScalarValue<std::string>::deserialize' via dominance
c:\jenkins\win64-1\workspace\epics-7.0-windows\libraries\static\os\win64\include\pv\pvdata.h(461): note: see declaration of 'epics::pvData::PVScalarValue<std::string>::deserialize'
cl -EHsc -GR           -DUSE_TYPED_RSET -I../../pdbApp -I../../p2pApp -I../../common -DNOMINMAX     -nologo -FC -D__STDC__=0 -D_CRT_SECURE_NO_DEPRECATE -D_CRT_NONSTDC_NO_DEPRECATE   -Ox -Oy-   -W3 -w44355 -w44344 -w44251        -MT  -TP  -I. -I../O.Common -I. -I. -I.. -I<https://jenkins.aps.anl.gov/job/epics-7.0-windows/LIBRARIES=STATIC,OS=win64/ws/include/compiler/msvc> -I<https://jenkins.aps.anl.gov/job/epics-7.0-windows/LIBRARIES=STATIC,OS=win64/ws/include/os/WIN32> -I<https://jenkins.aps.anl.gov/job/epics-7.0-windows/LIBRARIES=STATIC,OS=win64/ws/include> -I<https://jenkins.aps.anl.gov/job/epics-7.0-windows/LIBRARIES=STATIC,OS=win64/ws/include/compiler/msvc> -I<https://jenkins.aps.anl.gov/job/epics-7.0-windows/LIBRARIES=STATIC,OS=win64/ws/include/os/WIN32> -I<https://jenkins.aps.anl.gov/job/epics-7.0-windows/LIBRARIES=STATIC,OS=win64/ws/include>        -c ../utilitiesx.cpp
utilitiesx.cpp
c:\jenkins\win64-1\workspace\epics-7.0-windows\libraries\static\os\win64\include\pv\pvdata.h(508): warning C4800: 'char': forcing value to bool 'true' or 'false' (performance warning)
c:\jenkins\win64-1\workspace\epics-7.0-windows\libraries\static\os\win64\include\pv\pvdata.h(558): warning C4250: 'epics::pvData::PVString': inherits 'epics::pvData::PVScalarValue<std::string>::epics::pvData::PVScalarValue<std::string>::deserialize' via dominance
c:\jenkins\win64-1\workspace\epics-7.0-windows\libraries\static\os\win64\include\pv\pvdata.h(461): note: see declaration of 'epics::pvData::PVScalarValue<std::string>::deserialize'
link -nologo   -incremental:no -opt:ref -release  -MACHINE:X64              -out:check_consist.exe       check_consist.obj utilitiesx.obj     <https://jenkins.aps.anl.gov/job/epics-7.0-windows/LIBRARIES=STATIC,OS=win64/ws/lib/windows-x64-static/pvAccess.lib>  <https://jenkins.aps.anl.gov/job/epics-7.0-windows/LIBRARIES=STATIC,OS=win64/ws/lib/windows-x64-static/pvData.lib>  <https://jenkins.aps.anl.gov/job/epics-7.0-windows/LIBRARIES=STATIC,OS=win64/ws/lib/windows-x64-static/dbRecStd.lib>  <https://jenkins.aps.anl.gov/job/epics-7.0-windows/LIBRARIES=STATIC,OS=win64/ws/lib/windows-x64-static/dbCore.lib>  <https://jenkins.aps.anl.gov/job/epics-7.0-windows/LIBRARIES=STATIC,OS=win64/ws/lib/windows-x64-static/ca.lib>  <https://jenkins.aps.anl.gov/job/epics-7.0-windows/LIBRARIES=STATIC,OS=win64/ws/lib/windows-x64-static/Com.lib>  ws2_32.lib advapi32.lib user32.lib kernel32.lib winmm.lib     
cl -EHsc -GR           -DUSE_TYPED_RSET -I../../pdbApp -I../../p2pApp -I../../common -DNOMINMAX     -nologo -FC -D__STDC__=0 -D_CRT_SECURE_NO_DEPRECATE -D_CRT_NONSTDC_NO_DEPRECATE   -Ox -Oy-   -W3 -w44355 -w44344 -w44251        -MT  -TP  -I. -I../O.Common -I. -I. -I.. -I<https://jenkins.aps.anl.gov/job/epics-7.0-windows/LIBRARIES=STATIC,OS=win64/ws/include/compiler/msvc> -I<https://jenkins.aps.anl.gov/job/epics-7.0-windows/LIBRARIES=STATIC,OS=win64/ws/include/os/WIN32> -I<https://jenkins.aps.anl.gov/job/epics-7.0-windows/LIBRARIES=STATIC,OS=win64/ws/include> -I<https://jenkins.aps.anl.gov/job/epics-7.0-windows/LIBRARIES=STATIC,OS=win64/ws/include/compiler/msvc> -I<https://jenkins.aps.anl.gov/job/epics-7.0-windows/LIBRARIES=STATIC,OS=win64/ws/include/os/WIN32> -I<https://jenkins.aps.anl.gov/job/epics-7.0-windows/LIBRARIES=STATIC,OS=win64/ws/include>        -c ../testweak.cpp
testweak.cpp
link -nologo   -incremental:no -opt:ref -release  -MACHINE:X64              -out:testweak.exe       testweak.obj utilitiesx.obj    <https://jenkins.aps.anl.gov/job/epics-7.0-windows/LIBRARIES=STATIC,OS=win64/ws/lib/windows-x64-static/Com.lib>  <https://jenkins.aps.anl.gov/job/epics-7.0-windows/LIBRARIES=STATIC,OS=win64/ws/lib/windows-x64-static/pvAccess.lib>  <https://jenkins.aps.anl.gov/job/epics-7.0-windows/LIBRARIES=STATIC,OS=win64/ws/lib/windows-x64-static/pvData.lib>  <https://jenkins.aps.anl.gov/job/epics-7.0-windows/LIBRARIES=STATIC,OS=win64/ws/lib/windows-x64-static/dbRecStd.lib>  <https://jenkins.aps.anl.gov/job/epics-7.0-windows/LIBRARIES=STATIC,OS=win64/ws/lib/windows-x64-static/dbCore.lib>  <https://jenkins.aps.anl.gov/job/epics-7.0-windows/LIBRARIES=STATIC,OS=win64/ws/lib/windows-x64-static/ca.lib>  <https://jenkins.aps.anl.gov/job/epics-7.0-windows/LIBRARIES=STATIC,OS=win64/ws/lib/windows-x64-static/Com.lib>  ws2_32.lib advapi32.lib user32.lib kernel32.lib winmm.lib     
cl -EHsc -GR           -DUSE_TYPED_RSET -I../../pdbApp -I../../p2pApp -I../../common -DNOMINMAX     -nologo -FC -D__STDC__=0 -D_CRT_SECURE_NO_DEPRECATE -D_CRT_NONSTDC_NO_DEPRECATE   -Ox -Oy-   -W3 -w44355 -w44344 -w44251        -MT  -TP  -I. -I../O.Common -I. -I. -I.. -I<https://jenkins.aps.anl.gov/job/epics-7.0-windows/LIBRARIES=STATIC,OS=win64/ws/include/compiler/msvc> -I<https://jenkins.aps.anl.gov/job/epics-7.0-windows/LIBRARIES=STATIC,OS=win64/ws/include/os/WIN32> -I<https://jenkins.aps.anl.gov/job/epics-7.0-windows/LIBRARIES=STATIC,OS=win64/ws/include> -I<https://jenkins.aps.anl.gov/job/epics-7.0-windows/LIBRARIES=STATIC,OS=win64/ws/include/compiler/msvc> -I<https://jenkins.aps.anl.gov/job/epics-7.0-windows/LIBRARIES=STATIC,OS=win64/ws/include/os/WIN32> -I<https://jenkins.aps.anl.gov/job/epics-7.0-windows/LIBRARIES=STATIC,OS=win64/ws/include>        -c ../testtest.cpp
testtest.cpp
c:\jenkins\win64-1\workspace\epics-7.0-windows\libraries\static\os\win64\include\pv\pvdata.h(508): warning C4800: 'char': forcing value to bool 'true' or 'false' (performance warning)
c:\jenkins\win64-1\workspace\epics-7.0-windows\libraries\static\os\win64\include\pv\pvdata.h(558): warning C4250: 'epics::pvData::PVString': inherits 'epics::pvData::PVScalarValue<std::string>::epics::pvData::PVScalarValue<std::string>::deserialize' via dominance
c:\jenkins\win64-1\workspace\epics-7.0-windows\libraries\static\os\win64\include\pv\pvdata.h(461): note: see declaration of 'epics::pvData::PVScalarValue<std::string>::deserialize'
link -nologo   -incremental:no -opt:ref -release  -MACHINE:X64              -out:testtest.exe       testtest.obj utilitiesx.obj     <https://jenkins.aps.anl.gov/job/epics-7.0-windows/LIBRARIES=STATIC,OS=win64/ws/lib/windows-x64-static/pvAccess.lib>  <https://jenkins.aps.anl.gov/job/epics-7.0-windows/LIBRARIES=STATIC,OS=win64/ws/lib/windows-x64-static/pvData.lib>  <https://jenkins.aps.anl.gov/job/epics-7.0-windows/LIBRARIES=STATIC,OS=win64/ws/lib/windows-x64-static/dbRecStd.lib>  <https://jenkins.aps.anl.gov/job/epics-7.0-windows/LIBRARIES=STATIC,OS=win64/ws/lib/windows-x64-static/dbCore.lib>  <https://jenkins.aps.anl.gov/job/epics-7.0-windows/LIBRARIES=STATIC,OS=win64/ws/lib/windows-x64-static/ca.lib>  <https://jenkins.aps.anl.gov/job/epics-7.0-windows/LIBRARIES=STATIC,OS=win64/ws/lib/windows-x64-static/Com.lib>  ws2_32.lib advapi32.lib user32.lib kernel32.lib winmm.lib     
cl -EHsc -GR           -DUSE_TYPED_RSET -I../../pdbApp -I../../p2pApp -I../../common -DNOMINMAX     -nologo -FC -D__STDC__=0 -D_CRT_SECURE_NO_DEPRECATE -D_CRT_NONSTDC_NO_DEPRECATE   -Ox -Oy-   -W3 -w44355 -w44344 -w44251        -MT  -TP  -I. -I../O.Common -I. -I. -I.. -I<https://jenkins.aps.anl.gov/job/epics-7.0-windows/LIBRARIES=STATIC,OS=win64/ws/include/compiler/msvc> -I<https://jenkins.aps.anl.gov/job/epics-7.0-windows/LIBRARIES=STATIC,OS=win64/ws/include/os/WIN32> -I<https://jenkins.aps.anl.gov/job/epics-7.0-windows/LIBRARIES=STATIC,OS=win64/ws/include> -I<https://jenkins.aps.anl.gov/job/epics-7.0-windows/LIBRARIES=STATIC,OS=win64/ws/include/compiler/msvc> -I<https://jenkins.aps.anl.gov/job/epics-7.0-windows/LIBRARIES=STATIC,OS=win64/ws/include/os/WIN32> -I<https://jenkins.aps.anl.gov/job/epics-7.0-windows/LIBRARIES=STATIC,OS=win64/ws/include>        -c ../testpvif.cpp
testpvif.cpp
c:\jenkins\win64-1\workspace\epics-7.0-windows\libraries\static\os\win64\include\pv\pvdata.h(508): warning C4800: 'char': forcing value to bool 'true' or 'false' (performance warning)
c:\jenkins\win64-1\workspace\epics-7.0-windows\libraries\static\os\win64\include\pv\pvdata.h(558): warning C4250: 'epics::pvData::PVString': inherits 'epics::pvData::PVScalarValue<std::string>::epics::pvData::PVScalarValue<std::string>::deserialize' via dominance
c:\jenkins\win64-1\workspace\epics-7.0-windows\libraries\static\os\win64\include\pv\pvdata.h(461): note: see declaration of 'epics::pvData::PVScalarValue<std::string>::deserialize'
c:\jenkins\win64-1\workspace\epics-7.0-windows\libraries\static\os\win64\modules\pva2pva\testapp\testpvif.cpp(201): warning C4267: 'argument': conversion from 'size_t' to 'epics::pvData::uint32', possible loss of data
c:\jenkins\win64-1\workspace\epics-7.0-windows\libraries\static\os\win64\modules\pva2pva\testapp\testpvif.cpp(260): warning C4267: 'argument': conversion from 'size_t' to 'epics::pvData::uint32', possible loss of data
c:\jenkins\win64-1\workspace\epics-7.0-windows\libraries\static\os\win64\modules\pva2pva\testapp\testpvif.cpp(267): warning C4267: 'argument': conversion from 'size_t' to 'epics::pvData::uint32', possible loss of data
c:\jenkins\win64-1\workspace\epics-7.0-windows\libraries\static\os\win64\modules\pva2pva\testapp\testpvif.cpp(274): warning C4267: 'argument': conversion from 'size_t' to 'epics::pvData::uint32', possible loss of data
c:\jenkins\win64-1\workspace\epics-7.0-windows\libraries\static\os\win64\modules\pva2pva\testapp\testpvif.cpp(281): warning C4267: 'argument': conversion from 'size_t' to 'epics::pvData::uint32', possible loss of data
c:\jenkins\win64-1\workspace\epics-7.0-windows\libraries\static\os\win64\modules\pva2pva\testapp\testpvif.cpp(288): warning C4267: 'argument': conversion from 'size_t' to 'epics::pvData::uint32', possible loss of data
c:\jenkins\win64-1\workspace\epics-7.0-windows\libraries\static\os\win64\modules\pva2pva\testapp\testpvif.cpp(347): warning C4267: 'argument': conversion from 'size_t' to 'epics::pvData::uint32', possible loss of data
c:\jenkins\win64-1\workspace\epics-7.0-windows\libraries\static\os\win64\modules\pva2pva\testapp\testpvif.cpp(356): warning C4267: 'argument': conversion from 'size_t' to 'epics::pvData::uint32', possible loss of data
c:\jenkins\win64-1\workspace\epics-7.0-windows\libraries\static\os\win64\modules\pva2pva\testapp\testpvif.cpp(365): warning C4267: 'argument': conversion from 'size_t' to 'epics::pvData::uint32', possible loss of data
c:\jenkins\win64-1\workspace\epics-7.0-windows\libraries\static\os\win64\modules\pva2pva\testapp\testpvif.cpp(374): warning C4267: 'argument': conversion from 'size_t' to 'epics::pvData::uint32', possible loss of data
c:\jenkins\win64-1\workspace\epics-7.0-windows\libraries\static\os\win64\modules\pva2pva\testapp\testpvif.cpp(386): warning C4267: 'argument': conversion from 'size_t' to 'epics::pvData::uint32', possible loss of data
c:\jenkins\win64-1\workspace\epics-7.0-windows\libraries\static\os\win64\modules\pva2pva\testapp\testpvif.cpp(393): warning C4267: 'argument': conversion from 'size_t' to 'epics::pvData::uint32', possible loss of data
c:\jenkins\win64-1\workspace\epics-7.0-windows\libraries\static\os\win64\modules\pva2pva\testapp\testpvif.cpp(400): warning C4267: 'argument': conversion from 'size_t' to 'epics::pvData::uint32', possible loss of data
c:\jenkins\win64-1\workspace\epics-7.0-windows\libraries\static\os\win64\modules\pva2pva\testapp\testpvif.cpp(407): warning C4267: 'argument': conversion from 'size_t' to 'epics::pvData::uint32', possible loss of data
cl -EHsc -GR           -DUSE_TYPED_RSET -I../../pdbApp -I../../p2pApp -I../../common -DNOMINMAX     -nologo -FC -D__STDC__=0 -D_CRT_SECURE_NO_DEPRECATE -D_CRT_NONSTDC_NO_DEPRECATE   -Ox -Oy-   -W3 -w44355 -w44344 -w44251        -MT  -TP  -I. -I../O.Common -I. -I. -I.. -I<https://jenkins.aps.anl.gov/job/epics-7.0-windows/LIBRARIES=STATIC,OS=win64/ws/include/compiler/msvc> -I<https://jenkins.aps.anl.gov/job/epics-7.0-windows/LIBRARIES=STATIC,OS=win64/ws/include/os/WIN32> -I<https://jenkins.aps.anl.gov/job/epics-7.0-windows/LIBRARIES=STATIC,OS=win64/ws/include> -I<https://jenkins.aps.anl.gov/job/epics-7.0-windows/LIBRARIES=STATIC,OS=win64/ws/include/compiler/msvc> -I<https://jenkins.aps.anl.gov/job/epics-7.0-windows/LIBRARIES=STATIC,OS=win64/ws/include/os/WIN32> -I<https://jenkins.aps.anl.gov/job/epics-7.0-windows/LIBRARIES=STATIC,OS=win64/ws/include>        -c p2pTestIoc_registerRecordDeviceDriver.cpp
p2pTestIoc_registerRecordDeviceDriver.cpp
link -nologo   -incremental:no -opt:ref -release  -MACHINE:X64              -out:testpvif.exe       testpvif.obj p2pTestIoc_registerRecordDeviceDriver.obj utilitiesx.obj    <https://jenkins.aps.anl.gov/job/epics-7.0-windows/LIBRARIES=STATIC,OS=win64/ws/lib/windows-x64-static/qsrv.lib>  <https://jenkins.aps.anl.gov/job/epics-7.0-windows/LIBRARIES=STATIC,OS=win64/ws/lib/windows-x64-static/pvAccess.lib>  <https://jenkins.aps.anl.gov/job/epics-7.0-windows/LIBRARIES=STATIC,OS=win64/ws/lib/windows-x64-static/pvData.lib>  <https://jenkins.aps.anl.gov/job/epics-7.0-windows/LIBRARIES=STATIC,OS=win64/ws/lib/windows-x64-static/dbRecStd.lib>  <https://jenkins.aps.anl.gov/job/epics-7.0-windows/LIBRARIES=STATIC,OS=win64/ws/lib/windows-x64-static/dbCore.lib>  <https://jenkins.aps.anl.gov/job/epics-7.0-windows/LIBRARIES=STATIC,OS=win64/ws/lib/windows-x64-static/ca.lib>  <https://jenkins.aps.anl.gov/job/epics-7.0-windows/LIBRARIES=STATIC,OS=win64/ws/lib/windows-x64-static/Com.lib>  ws2_32.lib advapi32.lib user32.lib kernel32.lib winmm.lib     
cl -EHsc -GR           -DUSE_TYPED_RSET -I../../pdbApp -I../../p2pApp -I../../common -DNOMINMAX     -nologo -FC -D__STDC__=0 -D_CRT_SECURE_NO_DEPRECATE -D_CRT_NONSTDC_NO_DEPRECATE   -Ox -Oy-   -W3 -w44355 -w44344 -w44251        -MT  -TP  -I. -I../O.Common -I. -I. -I.. -I<https://jenkins.aps.anl.gov/job/epics-7.0-windows/LIBRARIES=STATIC,OS=win64/ws/include/compiler/msvc> -I<https://jenkins.aps.anl.gov/job/epics-7.0-windows/LIBRARIES=STATIC,OS=win64/ws/include/os/WIN32> -I<https://jenkins.aps.anl.gov/job/epics-7.0-windows/LIBRARIES=STATIC,OS=win64/ws/include> -I<https://jenkins.aps.anl.gov/job/epics-7.0-windows/LIBRARIES=STATIC,OS=win64/ws/include/compiler/msvc> -I<https://jenkins.aps.anl.gov/job/epics-7.0-windows/LIBRARIES=STATIC,OS=win64/ws/include/os/WIN32> -I<https://jenkins.aps.anl.gov/job/epics-7.0-windows/LIBRARIES=STATIC,OS=win64/ws/include>        -c ../testpdb.cpp
testpdb.cpp
c:\jenkins\win64-1\workspace\epics-7.0-windows\libraries\static\os\win64\include\pv\pvdata.h(508): warning C4800: 'char': forcing value to bool 'true' or 'false' (performance warning)
c:\jenkins\win64-1\workspace\epics-7.0-windows\libraries\static\os\win64\include\pv\pvdata.h(558): warning C4250: 'epics::pvData::PVString': inherits 'epics::pvData::PVScalarValue<std::string>::epics::pvData::PVScalarValue<std::string>::deserialize' via dominance
c:\jenkins\win64-1\workspace\epics-7.0-windows\libraries\static\os\win64\include\pv\pvdata.h(461): note: see declaration of 'epics::pvData::PVScalarValue<std::string>::deserialize'
c:\jenkins\win64-1\workspace\epics-7.0-windows\libraries\static\os\win64\modules\pva2pva\testapp\testpdb.cpp(153): warning C4267: 'argument': conversion from 'size_t' to 'epics::pvData::uint32', possible loss of data
c:\jenkins\win64-1\workspace\epics-7.0-windows\libraries\static\os\win64\modules\pva2pva\testapp\testpdb.cpp(168): warning C4267: 'argument': conversion from 'size_t' to 'epics::pvData::uint32', possible loss of data
c:\jenkins\win64-1\workspace\epics-7.0-windows\libraries\static\os\win64\modules\pva2pva\testapp\testpdb.cpp(169): warning C4267: 'argument': conversion from 'size_t' to 'epics::pvData::uint32', possible loss of data
c:\jenkins\win64-1\workspace\epics-7.0-windows\libraries\static\os\win64\modules\pva2pva\testapp\testpdb.cpp(223): warning C4267: 'argument': conversion from 'size_t' to 'epics::pvData::uint32', possible loss of data
c:\jenkins\win64-1\workspace\epics-7.0-windows\libraries\static\os\win64\modules\pva2pva\testapp\testpdb.cpp(282): warning C4267: 'argument': conversion from 'size_t' to 'epics::pvData::uint32', possible loss of data
link -nologo   -incremental:no -opt:ref -release  -MACHINE:X64              -out:testpdb.exe       testpdb.obj p2pTestIoc_registerRecordDeviceDriver.obj utilitiesx.obj    <https://jenkins.aps.anl.gov/job/epics-7.0-windows/LIBRARIES=STATIC,OS=win64/ws/lib/windows-x64-static/qsrv.lib>  <https://jenkins.aps.anl.gov/job/epics-7.0-windows/LIBRARIES=STATIC,OS=win64/ws/lib/windows-x64-static/pvAccess.lib>  <https://jenkins.aps.anl.gov/job/epics-7.0-windows/LIBRARIES=STATIC,OS=win64/ws/lib/windows-x64-static/pvData.lib>  <https://jenkins.aps.anl.gov/job/epics-7.0-windows/LIBRARIES=STATIC,OS=win64/ws/lib/windows-x64-static/dbRecStd.lib>  <https://jenkins.aps.anl.gov/job/epics-7.0-windows/LIBRARIES=STATIC,OS=win64/ws/lib/windows-x64-static/dbCore.lib>  <https://jenkins.aps.anl.gov/job/epics-7.0-windows/LIBRARIES=STATIC,OS=win64/ws/lib/windows-x64-static/ca.lib>  <https://jenkins.aps.anl.gov/job/epics-7.0-windows/LIBRARIES=STATIC,OS=win64/ws/lib/windows-x64-static/Com.lib>  ws2_32.lib advapi32.lib user32.lib kernel32.lib winmm.lib     
cl -EHsc -GR           -DUSE_TYPED_RSET -I../../pdbApp -I../../p2pApp -I../../common -DNOMINMAX     -nologo -FC -D__STDC__=0 -D_CRT_SECURE_NO_DEPRECATE -D_CRT_NONSTDC_NO_DEPRECATE   -Ox -Oy-   -W3 -w44355 -w44344 -w44251        -MT  -TP  -I. -I../O.Common -I. -I. -I.. -I<https://jenkins.aps.anl.gov/job/epics-7.0-windows/LIBRARIES=STATIC,OS=win64/ws/include/compiler/msvc> -I<https://jenkins.aps.anl.gov/job/epics-7.0-windows/LIBRARIES=STATIC,OS=win64/ws/include/os/WIN32> -I<https://jenkins.aps.anl.gov/job/epics-7.0-windows/LIBRARIES=STATIC,OS=win64/ws/include> -I<https://jenkins.aps.anl.gov/job/epics-7.0-windows/LIBRARIES=STATIC,OS=win64/ws/include/compiler/msvc> -I<https://jenkins.aps.anl.gov/job/epics-7.0-windows/LIBRARIES=STATIC,OS=win64/ws/include/os/WIN32> -I<https://jenkins.aps.anl.gov/job/epics-7.0-windows/LIBRARIES=STATIC,OS=win64/ws/include>        -c ../testpvalink.cpp
testpvalink.cpp
c:\jenkins\win64-1\workspace\epics-7.0-windows\libraries\static\os\win64\include\pv\pvdata.h(508): warning C4800: 'char': forcing value to bool 'true' or 'false' (performance warning)
c:\jenkins\win64-1\workspace\epics-7.0-windows\libraries\static\os\win64\include\pv\pvdata.h(558): warning C4250: 'epics::pvData::PVString': inherits 'epics::pvData::PVScalarValue<std::string>::epics::pvData::PVScalarValue<std::string>::deserialize' via dominance
c:\jenkins\win64-1\workspace\epics-7.0-windows\libraries\static\os\win64\include\pv\pvdata.h(461): note: see declaration of 'epics::pvData::PVScalarValue<std::string>::deserialize'
cl -EHsc -GR           -DUSE_TYPED_RSET -I../../pdbApp -I../../p2pApp -I../../common -DNOMINMAX     -nologo -FC -D__STDC__=0 -D_CRT_SECURE_NO_DEPRECATE -D_CRT_NONSTDC_NO_DEPRECATE   -Ox -Oy-   -W3 -w44355 -w44344 -w44251        -MT  -TP  -I. -I../O.Common -I. -I. -I.. -I<https://jenkins.aps.anl.gov/job/epics-7.0-windows/LIBRARIES=STATIC,OS=win64/ws/include/compiler/msvc> -I<https://jenkins.aps.anl.gov/job/epics-7.0-windows/LIBRARIES=STATIC,OS=win64/ws/include/os/WIN32> -I<https://jenkins.aps.anl.gov/job/epics-7.0-windows/LIBRARIES=STATIC,OS=win64/ws/include> -I<https://jenkins.aps.anl.gov/job/epics-7.0-windows/LIBRARIES=STATIC,OS=win64/ws/include/compiler/msvc> -I<https://jenkins.aps.anl.gov/job/epics-7.0-windows/LIBRARIES=STATIC,OS=win64/ws/include/os/WIN32> -I<https://jenkins.aps.anl.gov/job/epics-7.0-windows/LIBRARIES=STATIC,OS=win64/ws/include>        -c pvaLinkTestIoc_registerRecordDeviceDriver.cpp
pvaLinkTestIoc_registerRecordDeviceDriver.cpp
link -nologo   -incremental:no -opt:ref -release  -MACHINE:X64              -out:testpvalink.exe       testpvalink.obj pvaLinkTestIoc_registerRecordDeviceDriver.obj utilitiesx.obj    <https://jenkins.aps.anl.gov/job/epics-7.0-windows/LIBRARIES=STATIC,OS=win64/ws/lib/windows-x64-static/qsrv.lib>  <https://jenkins.aps.anl.gov/job/epics-7.0-windows/LIBRARIES=STATIC,OS=win64/ws/lib/windows-x64-static/pvAccess.lib>  <https://jenkins.aps.anl.gov/job/epics-7.0-windows/LIBRARIES=STATIC,OS=win64/ws/lib/windows-x64-static/pvData.lib>  <https://jenkins.aps.anl.gov/job/epics-7.0-windows/LIBRARIES=STATIC,OS=win64/ws/lib/windows-x64-static/dbRecStd.lib>  <https://jenkins.aps.anl.gov/job/epics-7.0-windows/LIBRARIES=STATIC,OS=win64/ws/lib/windows-x64-static/dbCore.lib>  <https://jenkins.aps.anl.gov/job/epics-7.0-windows/LIBRARIES=STATIC,OS=win64/ws/lib/windows-x64-static/ca.lib>  <https://jenkins.aps.anl.gov/job/epics-7.0-windows/LIBRARIES=STATIC,OS=win64/ws/lib/windows-x64-static/Com.lib>  ws2_32.lib advapi32.lib user32.lib kernel32.lib winmm.lib     
cl -EHsc -GR           -DUSE_TYPED_RSET -I../../pdbApp -I../../p2pApp -I../../common -DNOMINMAX     -nologo -FC -D__STDC__=0 -D_CRT_SECURE_NO_DEPRECATE -D_CRT_NONSTDC_NO_DEPRECATE   -Ox -Oy-   -W3 -w44355 -w44344 -w44251        -MT  -TP  -I. -I../O.Common -I. -I. -I.. -I<https://jenkins.aps.anl.gov/job/epics-7.0-windows/LIBRARIES=STATIC,OS=win64/ws/include/compiler/msvc> -I<https://jenkins.aps.anl.gov/job/epics-7.0-windows/LIBRARIES=STATIC,OS=win64/ws/include/os/WIN32> -I<https://jenkins.aps.anl.gov/job/epics-7.0-windows/LIBRARIES=STATIC,OS=win64/ws/include> -I<https://jenkins.aps.anl.gov/job/epics-7.0-windows/LIBRARIES=STATIC,OS=win64/ws/include/compiler/msvc> -I<https://jenkins.aps.anl.gov/job/epics-7.0-windows/LIBRARIES=STATIC,OS=win64/ws/include/os/WIN32> -I<https://jenkins.aps.anl.gov/job/epics-7.0-windows/LIBRARIES=STATIC,OS=win64/ws/include>        -c ../testgroupconfig.cpp
testgroupconfig.cpp
c:\jenkins\win64-1\workspace\epics-7.0-windows\libraries\static\os\win64\include\pv\pvdata.h(508): warning C4800: 'char': forcing value to bool 'true' or 'false' (performance warning)
c:\jenkins\win64-1\workspace\epics-7.0-windows\libraries\static\os\win64\include\pv\pvdata.h(558): warning C4250: 'epics::pvData::PVString': inherits 'epics::pvData::PVScalarValue<std::string>::epics::pvData::PVScalarValue<std::string>::deserialize' via dominance
c:\jenkins\win64-1\workspace\epics-7.0-windows\libraries\static\os\win64\include\pv\pvdata.h(461): note: see declaration of 'epics::pvData::PVScalarValue<std::string>::deserialize'
link -nologo   -incremental:no -opt:ref -release  -MACHINE:X64              -out:testgroupconfig.exe       testgroupconfig.obj utilitiesx.obj    <https://jenkins.aps.anl.gov/job/epics-7.0-windows/LIBRARIES=STATIC,OS=win64/ws/lib/windows-x64-static/qsrv.lib>  <https://jenkins.aps.anl.gov/job/epics-7.0-windows/LIBRARIES=STATIC,OS=win64/ws/lib/windows-x64-static/pvAccess.lib>  <https://jenkins.aps.anl.gov/job/epics-7.0-windows/LIBRARIES=STATIC,OS=win64/ws/lib/windows-x64-static/pvData.lib>  <https://jenkins.aps.anl.gov/job/epics-7.0-windows/LIBRARIES=STATIC,OS=win64/ws/lib/windows-x64-static/dbRecStd.lib>  <https://jenkins.aps.anl.gov/job/epics-7.0-windows/LIBRARIES=STATIC,OS=win64/ws/lib/windows-x64-static/dbCore.lib>  <https://jenkins.aps.anl.gov/job/epics-7.0-windows/LIBRARIES=STATIC,OS=win64/ws/lib/windows-x64-static/ca.lib>  <https://jenkins.aps.anl.gov/job/epics-7.0-windows/LIBRARIES=STATIC,OS=win64/ws/lib/windows-x64-static/Com.lib>  <https://jenkins.aps.anl.gov/job/epics-7.0-windows/LIBRARIES=STATIC,OS=win64/ws/lib/windows-x64-static/pvAccess.lib>  <https://jenkins.aps.anl.gov/job/epics-7.0-windows/LIBRARIES=STATIC,OS=win64/ws/lib/windows-x64-static/pvData.lib>  <https://jenkins.aps.anl.gov/job/epics-7.0-windows/LIBRARIES=STATIC,OS=win64/ws/lib/windows-x64-static/dbRecStd.lib>  <https://jenkins.aps.anl.gov/job/epics-7.0-windows/LIBRARIES=STATIC,OS=win64/ws/lib/windows-x64-static/dbCore.lib>  <https://jenkins.aps.anl.gov/job/epics-7.0-windows/LIBRARIES=STATIC,OS=win64/ws/lib/windows-x64-static/ca.lib>  <https://jenkins.aps.anl.gov/job/epics-7.0-windows/LIBRARIES=STATIC,OS=win64/ws/lib/windows-x64-static/Com.lib>  ws2_32.lib advapi32.lib user32.lib kernel32.lib winmm.lib     
cl -EHsc -GR           -DUSE_TYPED_RSET -I../../pdbApp -I../../p2pApp -I../../common -DNOMINMAX     -nologo -FC -D__STDC__=0 -D_CRT_SECURE_NO_DEPRECATE -D_CRT_NONSTDC_NO_DEPRECATE   -Ox -Oy-   -W3 -w44355 -w44344 -w44251        -MT  -TP  -I. -I../O.Common -I. -I. -I.. -I<https://jenkins.aps.anl.gov/job/epics-7.0-windows/LIBRARIES=STATIC,OS=win64/ws/include/compiler/msvc> -I<https://jenkins.aps.anl.gov/job/epics-7.0-windows/LIBRARIES=STATIC,OS=win64/ws/include/os/WIN32> -I<https://jenkins.aps.anl.gov/job/epics-7.0-windows/LIBRARIES=STATIC,OS=win64/ws/include> -I<https://jenkins.aps.anl.gov/job/epics-7.0-windows/LIBRARIES=STATIC,OS=win64/ws/include/compiler/msvc> -I<https://jenkins.aps.anl.gov/job/epics-7.0-windows/LIBRARIES=STATIC,OS=win64/ws/include/os/WIN32> -I<https://jenkins.aps.anl.gov/job/epics-7.0-windows/LIBRARIES=STATIC,OS=win64/ws/include>        -c ../testdbf_copy.cpp
testdbf_copy.cpp
c:\jenkins\win64-1\workspace\epics-7.0-windows\libraries\static\os\win64\include\pv\pvdata.h(508): warning C4800: 'char': forcing value to bool 'true' or 'false' (performance warning)
c:\jenkins\win64-1\workspace\epics-7.0-windows\libraries\static\os\win64\include\pv\pvdata.h(558): warning C4250: 'epics::pvData::PVString': inherits 'epics::pvData::PVScalarValue<std::string>::epics::pvData::PVScalarValue<std::string>::deserialize' via dominance
c:\jenkins\win64-1\workspace\epics-7.0-windows\libraries\static\os\win64\include\pv\pvdata.h(461): note: see declaration of 'epics::pvData::PVScalarValue<std::string>::deserialize'
c:\jenkins\win64-1\workspace\epics-7.0-windows\libraries\static\os\win64\modules\pva2pva\testapp\testdbf_copy.cpp(123): error C2976: 'epics::pvData::ScalarTypeTraits': too few template arguments
c:\jenkins\win64-1\workspace\epics-7.0-windows\libraries\static\os\win64\include\pv\pvintrospect.h(1260): note: see declaration of 'epics::pvData::ScalarTypeTraits'
c:\jenkins\win64-1\workspace\epics-7.0-windows\libraries\static\os\win64\modules\pva2pva\testapp\testdbf_copy.cpp(123): error C2146: syntax error: missing '>' before identifier 'type'
c:\jenkins\win64-1\workspace\epics-7.0-windows\libraries\static\os\win64\modules\pva2pva\testapp\testdbf_copy.cpp(124): error C2976: 'epics::pvData::ScalarTypeTraits': too few template arguments
c:\jenkins\win64-1\workspace\epics-7.0-windows\libraries\static\os\win64\include\pv\pvintrospect.h(1260): note: see declaration of 'epics::pvData::ScalarTypeTraits'
c:\jenkins\win64-1\workspace\epics-7.0-windows\libraries\static\os\win64\modules\pva2pva\testapp\testdbf_copy.cpp(124): error C2146: syntax error: missing '>' before identifier 'type'
c:\jenkins\win64-1\workspace\epics-7.0-windows\libraries\static\os\win64\modules\pva2pva\testapp\testdbf_copy.cpp(205): warning C4267: 'argument': conversion from 'size_t' to 'epics::pvData::uint32', possible loss of data
c:\jenkins\win64-1\workspace\epics-7.0-windows\libraries\static\os\win64\modules\pva2pva\testapp\testdbf_copy.cpp(226): warning C4267: 'argument': conversion from 'size_t' to 'epics::pvData::uint32', possible loss of data
c:\jenkins\win64-1\workspace\epics-7.0-windows\libraries\static\os\win64\modules\pva2pva\testapp\testdbf_copy.cpp(254): error C2672: '`anonymous-namespace'::testDBR2PVD_scalar': no matching overloaded function found
c:\jenkins\win64-1\workspace\epics-7.0-windows\libraries\static\os\win64\modules\pva2pva\testapp\testdbf_copy.cpp(254): error C2893: Failed to specialize function template 'void `anonymous-namespace'::testDBR2PVD_scalar(epics::pvData::meta::arg_type<int>::type,epics::pvData::meta::arg_type<int>::type)'
c:\jenkins\win64-1\workspace\epics-7.0-windows\libraries\static\os\win64\modules\pva2pva\testapp\testdbf_copy.cpp(254): note: With the following template arguments:
c:\jenkins\win64-1\workspace\epics-7.0-windows\libraries\static\os\win64\modules\pva2pva\testapp\testdbf_copy.cpp(254): note: '__formal=epics::pvData::pvDouble'
c:\jenkins\win64-1\workspace\epics-7.0-windows\libraries\static\os\win64\modules\pva2pva\testapp\testdbf_copy.cpp(254): note: '__formal=epics::pvData::pvDouble'
c:\jenkins\win64-1\workspace\epics-7.0-windows\libraries\static\os\win64\modules\pva2pva\testapp\testdbf_copy.cpp(255): error C2672: '`anonymous-namespace'::testDBR2PVD_scalar': no matching overloaded function found
c:\jenkins\win64-1\workspace\epics-7.0-windows\libraries\static\os\win64\modules\pva2pva\testapp\testdbf_copy.cpp(255): error C2893: Failed to specialize function template 'void `anonymous-namespace'::testDBR2PVD_scalar(epics::pvData::meta::arg_type<int>::type,epics::pvData::meta::arg_type<int>::type)'
c:\jenkins\win64-1\workspace\epics-7.0-windows\libraries\static\os\win64\modules\pva2pva\testapp\testdbf_copy.cpp(255): note: With the following template arguments:
c:\jenkins\win64-1\workspace\epics-7.0-windows\libraries\static\os\win64\modules\pva2pva\testapp\testdbf_copy.cpp(255): note: '__formal=epics::pvData::pvUShort'
c:\jenkins\win64-1\workspace\epics-7.0-windows\libraries\static\os\win64\modules\pva2pva\testapp\testdbf_copy.cpp(255): note: '__formal=epics::pvData::pvDouble'
c:\jenkins\win64-1\workspace\epics-7.0-windows\libraries\static\os\win64\modules\pva2pva\testapp\testdbf_copy.cpp(256): error C2672: '`anonymous-namespace'::testDBR2PVD_scalar': no matching overloaded function found
c:\jenkins\win64-1\workspace\epics-7.0-windows\libraries\static\os\win64\modules\pva2pva\testapp\testdbf_copy.cpp(256): error C2893: Failed to specialize function template 'void `anonymous-namespace'::testDBR2PVD_scalar(epics::pvData::meta::arg_type<int>::type,epics::pvData::meta::arg_type<int>::type)'
c:\jenkins\win64-1\workspace\epics-7.0-windows\libraries\static\os\win64\modules\pva2pva\testapp\testdbf_copy.cpp(256): note: With the following template arguments:
c:\jenkins\win64-1\workspace\epics-7.0-windows\libraries\static\os\win64\modules\pva2pva\testapp\testdbf_copy.cpp(256): note: '__formal=epics::pvData::pvInt'
c:\jenkins\win64-1\workspace\epics-7.0-windows\libraries\static\os\win64\modules\pva2pva\testapp\testdbf_copy.cpp(256): note: '__formal=epics::pvData::pvInt'
c:\jenkins\win64-1\workspace\epics-7.0-windows\libraries\static\os\win64\modules\pva2pva\testapp\testdbf_copy.cpp(257): error C2672: '`anonymous-namespace'::testDBR2PVD_scalar': no matching overloaded function found
c:\jenkins\win64-1\workspace\epics-7.0-windows\libraries\static\os\win64\modules\pva2pva\testapp\testdbf_copy.cpp(257): error C2893: Failed to specialize function template 'void `anonymous-namespace'::testDBR2PVD_scalar(epics::pvData::meta::arg_type<int>::type,epics::pvData::meta::arg_type<int>::type)'
c:\jenkins\win64-1\workspace\epics-7.0-windows\libraries\static\os\win64\modules\pva2pva\testapp\testdbf_copy.cpp(257): note: With the following template arguments:
c:\jenkins\win64-1\workspace\epics-7.0-windows\libraries\static\os\win64\modules\pva2pva\testapp\testdbf_copy.cpp(257): note: '__formal=epics::pvData::pvString'
c:\jenkins\win64-1\workspace\epics-7.0-windows\libraries\static\os\win64\modules\pva2pva\testapp\testdbf_copy.cpp(257): note: '__formal=epics::pvData::pvInt'
c:\jenkins\win64-1\workspace\epics-7.0-windows\libraries\static\os\win64\modules\pva2pva\testapp\testdbf_copy.cpp(258): error C2672: '`anonymous-namespace'::testDBR2PVD_scalar': no matching overloaded function found
c:\jenkins\win64-1\workspace\epics-7.0-windows\libraries\static\os\win64\modules\pva2pva\testapp\testdbf_copy.cpp(258): error C2893: Failed to specialize function template 'void `anonymous-namespace'::testDBR2PVD_scalar(epics::pvData::meta::arg_type<int>::type,epics::pvData::meta::arg_type<int>::type)'
c:\jenkins\win64-1\workspace\epics-7.0-windows\libraries\static\os\win64\modules\pva2pva\testapp\testdbf_copy.cpp(258): note: With the following template arguments:
c:\jenkins\win64-1\workspace\epics-7.0-windows\libraries\static\os\win64\modules\pva2pva\testapp\testdbf_copy.cpp(258): note: '__formal=epics::pvData::pvString'
c:\jenkins\win64-1\workspace\epics-7.0-windows\libraries\static\os\win64\modules\pva2pva\testapp\testdbf_copy.cpp(258): note: '__formal=epics::pvData::pvString'
c:\jenkins\win64-1\workspace\epics-7.0-windows\libraries\static\os\win64\modules\pva2pva\testapp\testdbf_copy.cpp(259): error C2672: '`anonymous-namespace'::testDBR2PVD_scalar': no matching overloaded function found
c:\jenkins\win64-1\workspace\epics-7.0-windows\libraries\static\os\win64\modules\pva2pva\testapp\testdbf_copy.cpp(259): error C2893: Failed to specialize function template 'void `anonymous-namespace'::testDBR2PVD_scalar(epics::pvData::meta::arg_type<int>::type,epics::pvData::meta::arg_type<int>::type)'
c:\jenkins\win64-1\workspace\epics-7.0-windows\libraries\static\os\win64\modules\pva2pva\testapp\testdbf_copy.cpp(259): note: With the following template arguments:
c:\jenkins\win64-1\workspace\epics-7.0-windows\libraries\static\os\win64\modules\pva2pva\testapp\testdbf_copy.cpp(259): note: '__formal=epics::pvData::pvInt'
c:\jenkins\win64-1\workspace\epics-7.0-windows\libraries\static\os\win64\modules\pva2pva\testapp\testdbf_copy.cpp(259): note: '__formal=epics::pvData::pvString'
<https://jenkins.aps.anl.gov/job/epics-7.0-windows/LIBRARIES=STATIC,OS=win64/ws/configure/RULES_BUILD>:239: recipe for target 'testdbf_copy.obj' failed
make[4]: *** [testdbf_copy.obj] Error 2
make[4]: Leaving directory '<https://jenkins.aps.anl.gov/job/epics-7.0-windows/LIBRARIES=STATIC,OS=win64/ws/modules/pva2pva/testApp/O.windows-x64-static'>
<https://jenkins.aps.anl.gov/job/epics-7.0-windows/LIBRARIES=STATIC,OS=win64/ws/configure/RULES_ARCHS>:58: recipe for target 'install.windows-x64-static' failed
make[3]: *** [install.windows-x64-static] Error 2
make[3]: Leaving directory '<https://jenkins.aps.anl.gov/job/epics-7.0-windows/LIBRARIES=STATIC,OS=win64/ws/modules/pva2pva/testApp'>
<https://jenkins.aps.anl.gov/job/epics-7.0-windows/LIBRARIES=STATIC,OS=win64/ws/configure/RULES_DIRS>:84: recipe for target 'testApp.install' failed
make[2]: *** [testApp.install] Error 2
make[2]: Leaving directory '<https://jenkins.aps.anl.gov/job/epics-7.0-windows/LIBRARIES=STATIC,OS=win64/ws/modules/pva2pva'>
../configure/RULES_DIRS:84: recipe for target 'pva2pva.install' failed
make[1]: *** [pva2pva.install] Error 2
make[1]: Leaving directory '<https://jenkins.aps.anl.gov/job/epics-7.0-windows/LIBRARIES=STATIC,OS=win64/ws/modules'>
configure/RULES_DIRS:84: recipe for target 'modules.install' failed
make: *** [modules.install] Error 2
Build step 'Execute Windows batch command' marked build as failure
[WARNINGS] Skipping publisher since build result is FAILURE

Replies:
Jenkins build is back to normal : epics-7.0-windows » STATIC,win64 #49 APS Jenkins

Navigate by Date:
Prev: Build failed in Jenkins: epics-7.0-windows » DLL, win64 #48 APS Jenkins
Next: pending PVA changes Michael Davidsaver
Index: 2002  2003  2004  2005  2006  2007  2008  2009  2010  2011  2012  2013  2014  2015  2016  2017  <20182019  2020  2021 
Navigate by Thread:
Prev: Jenkins build is back to normal : epics-7.0-windows » DLL,win32 #49 APS Jenkins
Next: Jenkins build is back to normal : epics-7.0-windows » STATIC,win64 #49 APS Jenkins
Index: 2002  2003  2004  2005  2006  2007  2008  2009  2010  2011  2012  2013  2014  2015  2016  2017  <20182019  2020  2021 
ANJ, 27 Jun 2018 Valid HTML 4.01! · Home · News · About · Base · Modules · Extensions · Distributions · Download ·
· Search · EPICS V4 · IRMIS · Talk · Bugs · Documents · Links · Licensing ·