Argonne National Laboratory

Experimental Physics and
Industrial Control System

2002  2003  2004  2005  2006  2007  2008  2009  2010  2011  2012  2013  2014  2015  2016  2017  <20182019  2020  2021  Index 2002  2003  2004  2005  2006  2007  2008  2009  2010  2011  2012  2013  2014  2015  2016  2017  <20182019  2020  2021 
<== Date ==> <== Thread ==>

Subject: Build failed in Jenkins: epics-base-3.15-mac-test #184
From: APS Jenkins <aps-jenkins@anl.gov>
To: core-talk@aps.anl.gov
Date: Sat, 21 Jul 2018 01:59:09 -0500 (CDT)
See <https://jenkins.aps.anl.gov/job/epics-base-3.15-mac-test/184/display/redirect>

------------------------------------------
[...truncated 7.78 KB...]
make -C O.darwin-x86 -f ../Makefile TOP=../../../../.. \
    T_A=darwin-x86 tapfiles
make[3]: Entering directory '<https://jenkins.aps.anl.gov/job/epics-base-3.15-mac-test/ws/src/ca/client/tools/O.darwin-x86'>
make[3]: Nothing to be done for 'tapfiles'.
make[3]: Leaving directory '<https://jenkins.aps.anl.gov/job/epics-base-3.15-mac-test/ws/src/ca/client/tools/O.darwin-x86'>
make[2]: Leaving directory '<https://jenkins.aps.anl.gov/job/epics-base-3.15-mac-test/ws/src/ca/client/tools'>
make -C ca/client/perl tapfiles 
make[2]: Entering directory '<https://jenkins.aps.anl.gov/job/epics-base-3.15-mac-test/ws/src/ca/client/perl'>
perl -CSD epicsUnitTestTest.t -tap > epicsUnitTestTest.tap
make[3]: Nothing to be done for 'tapfiles'.
make[3]: Leaving directory '<https://jenkins.aps.anl.gov/job/epics-base-3.15-mac-test/ws/src/ca/legacy/gdd/O.darwin-x86'>
make[2]: Leaving directory '<https://jenkins.aps.anl.gov/job/epics-base-3.15-mac-test/ws/src/ca/legacy/gdd'>
make -C ca/legacy/pcas tapfiles 
make[2]: Entering directory '<https://jenkins.aps.anl.gov/job/epics-base-3.15-mac-test/ws/src/ca/legacy/pcas'>
perl -CSD epicsTypesTest.t -tap > epicsTypesTest.tap
make -C O.darwin-x86 -f ../Makefile TOP=../../../../.. \
    T_A=darwin-x86 tapfiles
make[3]: Entering directory '<https://jenkins.aps.anl.gov/job/epics-base-3.15-mac-test/ws/src/ca/client/perl/O.darwin-x86'>
perl -CSD epicsInlineTest.t -tap > epicsInlineTest.tap
perl -CSD epicsCalcTest.t -tap > epicsCalcTest.tap
make -C ./build tapfiles 
make[3]: Entering directory '<https://jenkins.aps.anl.gov/job/epics-base-3.15-mac-test/ws/src/ca/legacy/pcas/build'>
perl -CSD epicsAlgorithmTest.t -tap > epicsAlgorithmTest.tap
perl -CSD epicsMathTest.t -tap > epicsMathTest.tap
perl -CSD epicsMMIOTest.t -tap > epicsMMIOTest.tap
perl -CSD epicsEllTest.t -tap > epicsEllTest.tap
perl -CSD epicsEnvTest.t -tap > epicsEnvTest.tap
make -C O.darwin-x86 -f ../Makefile TOP=../../../../../.. \
    T_A=darwin-x86 tapfiles
make[4]: Entering directory '<https://jenkins.aps.anl.gov/job/epics-base-3.15-mac-test/ws/src/ca/legacy/pcas/build/O.darwin-x86'>
perl -CSD epicsErrlogTest.t -tap > epicsErrlogTest.tap
make[3]: Nothing to be done for 'tapfiles'.
make[3]: Leaving directory '<https://jenkins.aps.anl.gov/job/epics-base-3.15-mac-test/ws/src/ca/client/perl/O.darwin-x86'>
make[2]: Leaving directory '<https://jenkins.aps.anl.gov/job/epics-base-3.15-mac-test/ws/src/ca/client/perl'>
perl -CSD epicsStdioTest.t -tap > epicsStdioTest.tap
perl -CSD epicsStdlibTest.t -tap > epicsStdlibTest.tap
perl -CSD epicsSockResolveTest.t -tap > epicsSockResolveTest.tap
perl -CSD epicsStringTest.t -tap > epicsStringTest.tap
perl -CSD epicsTimeTest.t -tap > epicsTimeTest.tap
make[4]: Nothing to be done for 'tapfiles'.
make[4]: Leaving directory '<https://jenkins.aps.anl.gov/job/epics-base-3.15-mac-test/ws/src/ca/legacy/pcas/build/O.darwin-x86'>
make[3]: Leaving directory '<https://jenkins.aps.anl.gov/job/epics-base-3.15-mac-test/ws/src/ca/legacy/pcas/build'>
make -C ./example tapfiles 
make[3]: Entering directory '<https://jenkins.aps.anl.gov/job/epics-base-3.15-mac-test/ws/src/ca/legacy/pcas/example'>
make -C ./directoryService tapfiles 
make[4]: Entering directory '<https://jenkins.aps.anl.gov/job/epics-base-3.15-mac-test/ws/src/ca/legacy/pcas/example/directoryService'>
make -C O.darwin-x86 -f ../Makefile TOP=../../../../../../.. \
    T_A=darwin-x86 tapfiles
make[5]: Entering directory '<https://jenkins.aps.anl.gov/job/epics-base-3.15-mac-test/ws/src/ca/legacy/pcas/example/directoryService/O.darwin-x86'>
make[5]: Nothing to be done for 'tapfiles'.
make[5]: Leaving directory '<https://jenkins.aps.anl.gov/job/epics-base-3.15-mac-test/ws/src/ca/legacy/pcas/example/directoryService/O.darwin-x86'>
make[4]: Leaving directory '<https://jenkins.aps.anl.gov/job/epics-base-3.15-mac-test/ws/src/ca/legacy/pcas/example/directoryService'>
make[3]: Leaving directory '<https://jenkins.aps.anl.gov/job/epics-base-3.15-mac-test/ws/src/ca/legacy/pcas/example'>
make[2]: Leaving directory '<https://jenkins.aps.anl.gov/job/epics-base-3.15-mac-test/ws/src/ca/legacy/pcas'>
perl -CSD epicsTimeZoneTest.t -tap > epicsTimeZoneTest.tap
perl -CSD epicsThreadTest.t -tap > epicsThreadTest.tap
make[3]: Nothing to be done for 'tapfiles'.
make[3]: Leaving directory '<https://jenkins.aps.anl.gov/job/epics-base-3.15-mac-test/ws/src/ioc/O.darwin-x86'>
make[2]: Leaving directory '<https://jenkins.aps.anl.gov/job/epics-base-3.15-mac-test/ws/src/ioc'>
perl -CSD epicsThreadOnceTest.t -tap > epicsThreadOnceTest.tap
log client: connected to log server at "127.0.0.1:49503"
perl -CSD epicsThreadPriorityTest.t -tap > epicsThreadPriorityTest.tap
make -C ca/legacy/pcas/ex tapfiles 
make[2]: Entering directory '<https://jenkins.aps.anl.gov/job/epics-base-3.15-mac-test/ws/src/ca/legacy/pcas/ex'>
perl -CSD epicsThreadPrivateTest.t -tap > epicsThreadPrivateTest.tap
make -C O.darwin-x86 -f ../Makefile TOP=../../../../../.. \
    T_A=darwin-x86 tapfiles
make[3]: Entering directory '<https://jenkins.aps.anl.gov/job/epics-base-3.15-mac-test/ws/src/ca/legacy/pcas/ex/O.darwin-x86'>
make -C ioc/db/test tapfiles 
make[2]: Entering directory '<https://jenkins.aps.anl.gov/job/epics-base-3.15-mac-test/ws/src/ioc/db/test'>
make[3]: Nothing to be done for 'tapfiles'.
make[3]: Leaving directory '<https://jenkins.aps.anl.gov/job/epics-base-3.15-mac-test/ws/src/ca/legacy/pcas/ex/O.darwin-x86'>
make[2]: Leaving directory '<https://jenkins.aps.anl.gov/job/epics-base-3.15-mac-test/ws/src/ca/legacy/pcas/ex'>
make -C ioc/dbtemplate/test tapfiles 
make[2]: Entering directory '<https://jenkins.aps.anl.gov/job/epics-base-3.15-mac-test/ws/src/ioc/dbtemplate/test'>
make -C O.darwin-x86 -f ../Makefile TOP=../../../../.. \
    T_A=darwin-x86 tapfiles
make -C O.darwin-x86 -f ../Makefile TOP=../../../../.. \
    T_A=darwin-x86 tapfiles
make[3]: Entering directory '<https://jenkins.aps.anl.gov/job/epics-base-3.15-mac-test/ws/src/ioc/db/test/O.darwin-x86'>
make[3]: Entering directory '<https://jenkins.aps.anl.gov/job/epics-base-3.15-mac-test/ws/src/ioc/dbtemplate/test/O.darwin-x86'>
perl -CSD msi.t -tap > msi.tap
perl -CSD dbShutdownTest.t -tap > dbShutdownTest.tap
make[3]: Leaving directory '<https://jenkins.aps.anl.gov/job/epics-base-3.15-mac-test/ws/src/ioc/dbtemplate/test/O.darwin-x86'>
make[2]: Leaving directory '<https://jenkins.aps.anl.gov/job/epics-base-3.15-mac-test/ws/src/ioc/dbtemplate/test'>
perl -CSD epicsThreadHooksTest.t -tap > epicsThreadHooksTest.tap
make -C ./std tapfiles 
make[2]: Entering directory '<https://jenkins.aps.anl.gov/job/epics-base-3.15-mac-test/ws/src/std'>
make -C O.darwin-x86 -f ../Makefile TOP=../../.. \
    T_A=darwin-x86 tapfiles
make[3]: Entering directory '<https://jenkins.aps.anl.gov/job/epics-base-3.15-mac-test/ws/src/std/O.darwin-x86'>
make[3]: Nothing to be done for 'tapfiles'.
make[3]: Leaving directory '<https://jenkins.aps.anl.gov/job/epics-base-3.15-mac-test/ws/src/std/O.darwin-x86'>
make[2]: Leaving directory '<https://jenkins.aps.anl.gov/job/epics-base-3.15-mac-test/ws/src/std'>
make -C std/filters/test tapfiles 
make[2]: Entering directory '<https://jenkins.aps.anl.gov/job/epics-base-3.15-mac-test/ws/src/std/filters/test'>
make -C O.darwin-x86 -f ../Makefile TOP=../../../../.. \
    T_A=darwin-x86 tapfiles
make[3]: Entering directory '<https://jenkins.aps.anl.gov/job/epics-base-3.15-mac-test/ws/src/std/filters/test/O.darwin-x86'>
perl -CSD tsTest.t -tap > tsTest.tap
perl -CSD dbPutLinkTest.t -tap > dbPutLinkTest.tap
perl -CSD dbndTest.t -tap > dbndTest.tap
make -C std/rec/test tapfiles 
make[2]: Entering directory '<https://jenkins.aps.anl.gov/job/epics-base-3.15-mac-test/ws/src/std/rec/test'>
make -C O.darwin-x86 -f ../Makefile TOP=../../../../.. \
    T_A=darwin-x86 tapfiles
make[3]: Entering directory '<https://jenkins.aps.anl.gov/job/epics-base-3.15-mac-test/ws/src/std/rec/test/O.darwin-x86'>
perl -CSD epicsThreadPoolTest.t -tap > epicsThreadPoolTest.tap
perl -CSD arrayOpTest.t -tap > arrayOpTest.tap
perl -CSD epicsExitTest.t -tap > epicsExitTest.tap
perl -CSD arrTest.t -tap > arrTest.tap
perl -CSD analogMonitorTest.t -tap > analogMonitorTest.tap
Starting iocInit
perl -CSD syncTest.t -tap > syncTest.tap
perl -CSD scanEventTest.t -tap > scanEventTest.tap
Starting iocInit
perl -CSD epicsTimerTest.t -tap > epicsTimerTest.tap
make[3]: Leaving directory '<https://jenkins.aps.anl.gov/job/epics-base-3.15-mac-test/ws/src/std/filters/test/O.darwin-x86'>
make[2]: Leaving directory '<https://jenkins.aps.anl.gov/job/epics-base-3.15-mac-test/ws/src/std/filters/test'>
perl -CSD dbLockTest.t -tap > dbLockTest.tap
iocRun: All initialization complete
perl -CSD regressTest.t -tap > regressTest.tap
perl -CSD ringPointerTest.t -tap > ringPointerTest.tap
perl -CSD testdbConvert.t -tap > testdbConvert.tap
epicsThreadSetPriority called by non epics thread
perl -CSD callbackTest.t -tap > callbackTest.tap
epicsThreadSetPriority called by non epics thread
perl -CSD ringBytesTest.t -tap > ringBytesTest.tap
perl -CSD callbackParallelTest.t -tap > callbackParallelTest.tap
make[3]: Leaving directory '<https://jenkins.aps.anl.gov/job/epics-base-3.15-mac-test/ws/src/std/rec/test/O.darwin-x86'>
make[2]: Leaving directory '<https://jenkins.aps.anl.gov/job/epics-base-3.15-mac-test/ws/src/std/rec/test'>
perl -CSD epicsEventTest.t -tap > epicsEventTest.tap
perl -CSD epicsMutexTest.t -tap > epicsMutexTest.tap
perl -CSD dbStateTest.t -tap > dbStateTest.tap
perl -CSD dbCaStatsTest.t -tap > dbCaStatsTest.tap
perl -CSD scanIoTest.t -tap > scanIoTest.tap
Starting iocInit
iocRun: All initialization complete
perl -CSD dbChannelTest.t -tap > dbChannelTest.tap
perl -CSD dbChArrTest.t -tap > dbChArrTest.tap
Starting iocInit
iocRun: All initialization complete
perl -CSD chfPluginTest.t -tap > chfPluginTest.tap
chfConfigParseStart: plugin pvt alloc failed
perl -CSD epicsSpinTest.t -tap > epicsSpinTest.tap
Starting iocInit
iocRun: All initialization complete
perl -CSD arrShorthandTest.t -tap > arrShorthandTest.tap
perl -CSD recGblCheckDeadbandTest.t -tap > recGblCheckDeadbandTest.tap
perl -CSD epicsAtomicTest.t -tap > epicsAtomicTest.tap
epicsAtomicTest(54582,0x700000081000) malloc: *** error for object 0x7f9b18d002b0: pointer being freed was not allocated
*** set a breakpoint in malloc_error_break to debug
epicsAtomicTest(54582,0x700000104000) malloc: *** error for object 0x7f9b18d002b8: incorrect checksum for freed object - object was probably modified after being freed.
*** set a breakpoint in malloc_error_break to debug
/bin/sh: line 1: 54582 Abort trap: 6           perl -CSD epicsAtomicTest.t -tap > epicsAtomicTest.tap
../../../../configure/RULES_BUILD:372: recipe for target 'epicsAtomicTest.tap' failed
make[3]: [epicsAtomicTest.tap] Error 134 (ignored)
perl -CSD macDefExpandTest.t -tap > macDefExpandTest.tap
perl -CSD testPutGetTest.t -tap > testPutGetTest.tap
Starting iocInit
perl -CSD macLibTest.t -tap > macLibTest.tap
perl -CSD taskwdTest.t -tap > taskwdTest.tap
iocRun: All initialization complete
make[3]: Leaving directory '<https://jenkins.aps.anl.gov/job/epics-base-3.15-mac-test/ws/src/ioc/db/test/O.darwin-x86'>
make[2]: Leaving directory '<https://jenkins.aps.anl.gov/job/epics-base-3.15-mac-test/ws/src/ioc/db/test'>
perl -CSD blockingSockTest.t -tap > blockingSockTest.tap
perl -CSD epicsMessageQueueTest.t -tap > epicsMessageQueueTest.tap
perl -CSD epicsStackTraceTest.t -tap > epicsStackTraceTest.tap
perl -CSD ipAddrToAsciiTest.t -tap > ipAddrToAsciiTest.tap
perl -CSD osiSockTest.t -tap > osiSockTest.tap
make[3]: Leaving directory '<https://jenkins.aps.anl.gov/job/epics-base-3.15-mac-test/ws/src/libCom/test/O.darwin-x86'>
make[2]: Leaving directory '<https://jenkins.aps.anl.gov/job/epics-base-3.15-mac-test/ws/src/libCom/test'>
make[1]: Leaving directory '<https://jenkins.aps.anl.gov/job/epics-base-3.15-mac-test/ws/src'>
+ make -s test-results CROSS_COMPILER_TARGET_ARCHS=
Breaktable.tap .. ok
DBD.tap ......... ok
Device.tap ...... ok
Driver.tap ...... ok
Function.tap .... ok
macLib.tap ...... ok
Menu.tap ........ ok
Recfield.tap .... ok
Recordtype.tap .. ok
Registrar.tap ... ok
Snippets.tap .... ok
Variable.tap .... ok
All tests successful.
Files=12, Tests=224,  0 wallclock secs ( 0.07 usr  0.02 sys +  0.04 cusr  0.04 csys =  0.17 CPU)
Result: PASS
epicsUnitTestTest.tap ........ ok
epicsTypesTest.tap ........... ok
epicsInlineTest.tap .......... ok
epicsCalcTest.tap ............ ok
epicsAlgorithmTest.tap ....... ok
epicsMathTest.tap ............ ok
epicsMMIOTest.tap ............ ok
epicsEllTest.tap ............. ok
epicsEnvTest.tap ............. ok
epicsErrlogTest.tap .......... ok
epicsStdioTest.tap ........... ok
epicsStdlibTest.tap .......... ok
epicsSockResolveTest.tap ..... ok
epicsStringTest.tap .......... ok
epicsTimeTest.tap ............ ok
epicsTimeZoneTest.tap ........ ok
epicsThreadTest.tap .......... ok
epicsThreadOnceTest.tap ...... ok
epicsThreadPriorityTest.tap .. ok
epicsThreadPrivateTest.tap ... ok
epicsThreadHooksTest.tap ..... ok
epicsThreadPoolTest.tap ...... ok
epicsExitTest.tap ............ ok
epicsTimerTest.tap ........... ok
ringPointerTest.tap .......... ok
ringBytesTest.tap ............ ok
epicsEventTest.tap ........... ok
epicsMutexTest.tap ........... ok
epicsSpinTest.tap ............ ok
epicsAtomicTest.tap .......... 
Failed 17/31 subtests 
macDefExpandTest.tap ......... ok
macLibTest.tap ............... ok
taskwdTest.tap ............... ok
blockingSockTest.tap ......... ok
epicsMessageQueueTest.tap .... ok
epicsStackTraceTest.tap ...... ok
ipAddrToAsciiTest.tap ........ ok
osiSockTest.tap .............. ok

Test Summary Report
-------------------
epicsAtomicTest.tap        (Wstat: 0 Tests: 14 Failed: 0)
  Parse errors: Bad plan.  You planned 31 tests but ran 14.
Files=38, Tests=2878,  1 wallclock secs ( 0.30 usr  0.07 sys +  0.16 cusr  0.15 csys =  0.68 CPU)
Result: FAIL
../../../../configure/RULES_BUILD:354: recipe for target 'test-results' failed
make[3]: *** [test-results] Error 1
../../../configure/RULES_ARCHS:58: recipe for target 'test-results.darwin-x86' failed
make[2]: *** [test-results.darwin-x86] Error 2
../configure/RULES_DIRS:84: recipe for target 'libCom/test.test-results' failed
make[1]: *** [libCom/test.test-results] Error 2
configure/RULES_DIRS:84: recipe for target 'src.test-results' failed
make: *** [src.test-results] Error 2
Build step 'Execute shell' marked build as failure
TAP Reports Processing: START
Looking for TAP results report in workspace using pattern: src/**/O.darwin-x86/*.tap
Saving reports...
Not all test cases were executed according to the test set plan. Marking build as UNSTABLE
TAP Reports Processing: FINISH

Replies:
Jenkins build is back to normal : epics-base-3.15-mac-test #185 APS Jenkins

Navigate by Date:
Prev: Jenkins build is back to normal : epics-base-3.15-vx55 #328 APS Jenkins
Next: Jenkins build is back to normal : epics-base-3.15-mac-test #185 APS Jenkins
Index: 2002  2003  2004  2005  2006  2007  2008  2009  2010  2011  2012  2013  2014  2015  2016  2017  <20182019  2020  2021 
Navigate by Thread:
Prev: Jenkins build is back to normal : epics-base-3.15-ios #190 APS Jenkins
Next: Jenkins build is back to normal : epics-base-3.15-mac-test #185 APS Jenkins
Index: 2002  2003  2004  2005  2006  2007  2008  2009  2010  2011  2012  2013  2014  2015  2016  2017  <20182019  2020  2021 
ANJ, 21 Jul 2018 Valid HTML 4.01! · Home · News · About · Base · Modules · Extensions · Distributions · Download ·
· Search · EPICS V4 · IRMIS · Talk · Bugs · Documents · Links · Licensing ·