Argonne National Laboratory

Experimental Physics and
Industrial Control System

2002  2003  2004  2005  2006  2007  2008  2009  2010  2011  2012  2013  2014  2015  2016  2017  <20182019  2020  2021  Index 2002  2003  2004  2005  2006  2007  2008  2009  2010  2011  2012  2013  2014  2015  2016  2017  <20182019  2020  2021 
<== Date ==> <== Thread ==>

Subject: Build failed in Jenkins: epics-base-3.15-mac-test #187
From: APS Jenkins <aps-jenkins@anl.gov>
To: core-talk@aps.anl.gov
Date: Fri, 10 Aug 2018 15:08:12 -0500 (CDT)
See <https://jenkins.aps.anl.gov/job/epics-base-3.15-mac-test/187/display/redirect>

------------------------------------------
[...truncated 7.87 KB...]
make[3]: Entering directory '<https://jenkins.aps.anl.gov/job/epics-base-3.15-mac-test/ws/src/ca/legacy/gdd/O.darwin-x86'>
perl -CSD epicsUnitTestTest.t -tap > epicsUnitTestTest.tap
make -C O.darwin-x86 -f ../Makefile TOP=../../.. \
    T_A=darwin-x86 tapfiles
make[3]: Entering directory '<https://jenkins.aps.anl.gov/job/epics-base-3.15-mac-test/ws/src/ioc/O.darwin-x86'>
make -C O.darwin-x86 -f ../Makefile TOP=../../../../.. \
    T_A=darwin-x86 tapfiles
make[3]: Entering directory '<https://jenkins.aps.anl.gov/job/epics-base-3.15-mac-test/ws/src/ca/client/perl/O.darwin-x86'>
perl -CSD epicsTypesTest.t -tap > epicsTypesTest.tap
perl -CSD epicsInlineTest.t -tap > epicsInlineTest.tap
perl -CSD epicsCalcTest.t -tap > epicsCalcTest.tap
perl -CSD epicsAlgorithmTest.t -tap > epicsAlgorithmTest.tap
perl -CSD epicsMathTest.t -tap > epicsMathTest.tap
make[3]: Nothing to be done for 'tapfiles'.
make[3]: Leaving directory '<https://jenkins.aps.anl.gov/job/epics-base-3.15-mac-test/ws/src/ca/legacy/gdd/O.darwin-x86'>
make[2]: Leaving directory '<https://jenkins.aps.anl.gov/job/epics-base-3.15-mac-test/ws/src/ca/legacy/gdd'>
make -C ca/legacy/pcas tapfiles 
make[2]: Entering directory '<https://jenkins.aps.anl.gov/job/epics-base-3.15-mac-test/ws/src/ca/legacy/pcas'>
perl -CSD epicsMMIOTest.t -tap > epicsMMIOTest.tap
perl -CSD epicsEllTest.t -tap > epicsEllTest.tap
perl -CSD epicsEnvTest.t -tap > epicsEnvTest.tap
make -C ./build tapfiles 
make[3]: Entering directory '<https://jenkins.aps.anl.gov/job/epics-base-3.15-mac-test/ws/src/ca/legacy/pcas/build'>
perl -CSD epicsErrlogTest.t -tap > epicsErrlogTest.tap
make[3]: Nothing to be done for 'tapfiles'.
make[3]: Leaving directory '<https://jenkins.aps.anl.gov/job/epics-base-3.15-mac-test/ws/src/ca/client/perl/O.darwin-x86'>
make[2]: Leaving directory '<https://jenkins.aps.anl.gov/job/epics-base-3.15-mac-test/ws/src/ca/client/perl'>
perl -CSD epicsStdioTest.t -tap > epicsStdioTest.tap
make -C O.darwin-x86 -f ../Makefile TOP=../../../../../.. \
    T_A=darwin-x86 tapfiles
make[4]: Entering directory '<https://jenkins.aps.anl.gov/job/epics-base-3.15-mac-test/ws/src/ca/legacy/pcas/build/O.darwin-x86'>
perl -CSD epicsStdlibTest.t -tap > epicsStdlibTest.tap
perl -CSD epicsSockResolveTest.t -tap > epicsSockResolveTest.tap
make[4]: Nothing to be done for 'tapfiles'.
make[4]: Leaving directory '<https://jenkins.aps.anl.gov/job/epics-base-3.15-mac-test/ws/src/ca/legacy/pcas/build/O.darwin-x86'>
make[3]: Leaving directory '<https://jenkins.aps.anl.gov/job/epics-base-3.15-mac-test/ws/src/ca/legacy/pcas/build'>
make -C ./example tapfiles 
make[3]: Entering directory '<https://jenkins.aps.anl.gov/job/epics-base-3.15-mac-test/ws/src/ca/legacy/pcas/example'>
perl -CSD epicsStringTest.t -tap > epicsStringTest.tap
perl -CSD epicsTimeTest.t -tap > epicsTimeTest.tap
make -C ./directoryService tapfiles 
make[4]: Entering directory '<https://jenkins.aps.anl.gov/job/epics-base-3.15-mac-test/ws/src/ca/legacy/pcas/example/directoryService'>
make -C O.darwin-x86 -f ../Makefile TOP=../../../../../../.. \
    T_A=darwin-x86 tapfiles
make[5]: Entering directory '<https://jenkins.aps.anl.gov/job/epics-base-3.15-mac-test/ws/src/ca/legacy/pcas/example/directoryService/O.darwin-x86'>
make[5]: Nothing to be done for 'tapfiles'.
make[5]: Leaving directory '<https://jenkins.aps.anl.gov/job/epics-base-3.15-mac-test/ws/src/ca/legacy/pcas/example/directoryService/O.darwin-x86'>
make[4]: Leaving directory '<https://jenkins.aps.anl.gov/job/epics-base-3.15-mac-test/ws/src/ca/legacy/pcas/example/directoryService'>
make[3]: Leaving directory '<https://jenkins.aps.anl.gov/job/epics-base-3.15-mac-test/ws/src/ca/legacy/pcas/example'>
make[2]: Leaving directory '<https://jenkins.aps.anl.gov/job/epics-base-3.15-mac-test/ws/src/ca/legacy/pcas'>
perl -CSD epicsTimeZoneTest.t -tap > epicsTimeZoneTest.tap
perl -CSD epicsThreadTest.t -tap > epicsThreadTest.tap
make[3]: Nothing to be done for 'tapfiles'.
make[3]: Leaving directory '<https://jenkins.aps.anl.gov/job/epics-base-3.15-mac-test/ws/src/ioc/O.darwin-x86'>
make[2]: Leaving directory '<https://jenkins.aps.anl.gov/job/epics-base-3.15-mac-test/ws/src/ioc'>
perl -CSD epicsThreadOnceTest.t -tap > epicsThreadOnceTest.tap
make -C ca/legacy/pcas/ex tapfiles 
make[2]: Entering directory '<https://jenkins.aps.anl.gov/job/epics-base-3.15-mac-test/ws/src/ca/legacy/pcas/ex'>
make -C O.darwin-x86 -f ../Makefile TOP=../../../../../.. \
    T_A=darwin-x86 tapfiles
make[3]: Entering directory '<https://jenkins.aps.anl.gov/job/epics-base-3.15-mac-test/ws/src/ca/legacy/pcas/ex/O.darwin-x86'>
make[3]: Nothing to be done for 'tapfiles'.
make[3]: Leaving directory '<https://jenkins.aps.anl.gov/job/epics-base-3.15-mac-test/ws/src/ca/legacy/pcas/ex/O.darwin-x86'>
make[2]: Leaving directory '<https://jenkins.aps.anl.gov/job/epics-base-3.15-mac-test/ws/src/ca/legacy/pcas/ex'>
perl -CSD epicsThreadPriorityTest.t -tap > epicsThreadPriorityTest.tap
log client: connected to log server at "127.0.0.1:54003"
perl -CSD epicsThreadPrivateTest.t -tap > epicsThreadPrivateTest.tap
perl -CSD epicsThreadHooksTest.t -tap > epicsThreadHooksTest.tap
perl -CSD epicsThreadPoolTest.t -tap > epicsThreadPoolTest.tap
perl -CSD epicsExitTest.t -tap > epicsExitTest.tap
make -C ioc/db/test tapfiles 
make[2]: Entering directory '<https://jenkins.aps.anl.gov/job/epics-base-3.15-mac-test/ws/src/ioc/db/test'>
make -C O.darwin-x86 -f ../Makefile TOP=../../../../.. \
    T_A=darwin-x86 tapfiles
make[3]: Entering directory '<https://jenkins.aps.anl.gov/job/epics-base-3.15-mac-test/ws/src/ioc/db/test/O.darwin-x86'>
perl -CSD dbShutdownTest.t -tap > dbShutdownTest.tap
perl -CSD epicsTimerTest.t -tap > epicsTimerTest.tap
perl -CSD ringPointerTest.t -tap > ringPointerTest.tap
epicsThreadSetPriority called by non epics thread
epicsThreadSetPriority called by non epics thread
make -C ioc/dbtemplate/test tapfiles 
make[2]: Entering directory '<https://jenkins.aps.anl.gov/job/epics-base-3.15-mac-test/ws/src/ioc/dbtemplate/test'>
make -C O.darwin-x86 -f ../Makefile TOP=../../../../.. \
    T_A=darwin-x86 tapfiles
make[3]: Entering directory '<https://jenkins.aps.anl.gov/job/epics-base-3.15-mac-test/ws/src/ioc/dbtemplate/test/O.darwin-x86'>
perl -CSD msi.t -tap > msi.tap
msi: Error - undefined macros present
macLib: macro a is undefined (expanding string With $(a) & ${b}:
)
macLib: macro b is undefined (expanding string With $(a) & ${b}:
)
perl -CSD dbPutLinkTest.t -tap > dbPutLinkTest.tap
make[3]: Leaving directory '<https://jenkins.aps.anl.gov/job/epics-base-3.15-mac-test/ws/src/ioc/dbtemplate/test/O.darwin-x86'>
make[2]: Leaving directory '<https://jenkins.aps.anl.gov/job/epics-base-3.15-mac-test/ws/src/ioc/dbtemplate/test'>
perl -CSD ringBytesTest.t -tap > ringBytesTest.tap
make -C ./std tapfiles 
make[2]: Entering directory '<https://jenkins.aps.anl.gov/job/epics-base-3.15-mac-test/ws/src/std'>
make -C O.darwin-x86 -f ../Makefile TOP=../../.. \
    T_A=darwin-x86 tapfiles
make[3]: Entering directory '<https://jenkins.aps.anl.gov/job/epics-base-3.15-mac-test/ws/src/std/O.darwin-x86'>
make[3]: Nothing to be done for 'tapfiles'.
make[3]: Leaving directory '<https://jenkins.aps.anl.gov/job/epics-base-3.15-mac-test/ws/src/std/O.darwin-x86'>
make[2]: Leaving directory '<https://jenkins.aps.anl.gov/job/epics-base-3.15-mac-test/ws/src/std'>
perl -CSD epicsEventTest.t -tap > epicsEventTest.tap
perl -CSD epicsMutexTest.t -tap > epicsMutexTest.tap
perl -CSD dbLockTest.t -tap > dbLockTest.tap
perl -CSD testdbConvert.t -tap > testdbConvert.tap
perl -CSD callbackTest.t -tap > callbackTest.tap
perl -CSD epicsSpinTest.t -tap > epicsSpinTest.tap
make -C std/filters/test tapfiles 
make[2]: Entering directory '<https://jenkins.aps.anl.gov/job/epics-base-3.15-mac-test/ws/src/std/filters/test'>
make -C O.darwin-x86 -f ../Makefile TOP=../../../../.. \
    T_A=darwin-x86 tapfiles
make[3]: Entering directory '<https://jenkins.aps.anl.gov/job/epics-base-3.15-mac-test/ws/src/std/filters/test/O.darwin-x86'>
perl -CSD tsTest.t -tap > tsTest.tap
perl -CSD dbndTest.t -tap > dbndTest.tap
perl -CSD arrTest.t -tap > arrTest.tap
perl -CSD syncTest.t -tap > syncTest.tap
make[3]: Leaving directory '<https://jenkins.aps.anl.gov/job/epics-base-3.15-mac-test/ws/src/std/filters/test/O.darwin-x86'>
make[2]: Leaving directory '<https://jenkins.aps.anl.gov/job/epics-base-3.15-mac-test/ws/src/std/filters/test'>
make -C std/rec/test tapfiles 
make[2]: Entering directory '<https://jenkins.aps.anl.gov/job/epics-base-3.15-mac-test/ws/src/std/rec/test'>
make -C O.darwin-x86 -f ../Makefile TOP=../../../../.. \
    T_A=darwin-x86 tapfiles
make[3]: Entering directory '<https://jenkins.aps.anl.gov/job/epics-base-3.15-mac-test/ws/src/std/rec/test/O.darwin-x86'>
perl -CSD arrayOpTest.t -tap > arrayOpTest.tap
perl -CSD analogMonitorTest.t -tap > analogMonitorTest.tap
Starting iocInit
perl -CSD scanEventTest.t -tap > scanEventTest.tap
Starting iocInit
iocRun: All initialization complete
perl -CSD regressTest.t -tap > regressTest.tap
perl -CSD callbackParallelTest.t -tap > callbackParallelTest.tap
perl -CSD epicsAtomicTest.t -tap > epicsAtomicTest.tap
epicsAtomicTest(53011,0x700000081000) malloc: *** error for object 0x7f8452d00240: pointer being freed was not allocated
*** set a breakpoint in malloc_error_break to debug
epicsEventDestroy: pthread_mutex_destroy failed: Invalid argument
/bin/sh: line 1: 53011 Abort trap: 6           perl -CSD epicsAtomicTest.t -tap > epicsAtomicTest.tap
../../../../configure/RULES_BUILD:372: recipe for target 'epicsAtomicTest.tap' failed
make[3]: [epicsAtomicTest.tap] Error 134 (ignored)
perl -CSD macDefExpandTest.t -tap > macDefExpandTest.tap
perl -CSD macLibTest.t -tap > macLibTest.tap
perl -CSD taskwdTest.t -tap > taskwdTest.tap
perl -CSD dbStateTest.t -tap > dbStateTest.tap
perl -CSD dbCaStatsTest.t -tap > dbCaStatsTest.tap
make[3]: Leaving directory '<https://jenkins.aps.anl.gov/job/epics-base-3.15-mac-test/ws/src/std/rec/test/O.darwin-x86'>
make[2]: Leaving directory '<https://jenkins.aps.anl.gov/job/epics-base-3.15-mac-test/ws/src/std/rec/test'>
perl -CSD blockingSockTest.t -tap > blockingSockTest.tap
perl -CSD scanIoTest.t -tap > scanIoTest.tap
Starting iocInit
iocRun: All initialization complete
Starting iocInit
iocRun: All initialization complete
perl -CSD dbChannelTest.t -tap > dbChannelTest.tap
perl -CSD epicsMessageQueueTest.t -tap > epicsMessageQueueTest.tap
Starting iocInit
iocRun: All initialization complete
perl -CSD dbChArrTest.t -tap > dbChArrTest.tap
Starting iocInit
iocRun: All initialization complete
perl -CSD chfPluginTest.t -tap > chfPluginTest.tap
chfConfigParseStart: plugin pvt alloc failed
perl -CSD arrShorthandTest.t -tap > arrShorthandTest.tap
perl -CSD recGblCheckDeadbandTest.t -tap > recGblCheckDeadbandTest.tap
perl -CSD testPutGetTest.t -tap > testPutGetTest.tap
perl -CSD epicsStackTraceTest.t -tap > epicsStackTraceTest.tap
perl -CSD ipAddrToAsciiTest.t -tap > ipAddrToAsciiTest.tap
perl -CSD osiSockTest.t -tap > osiSockTest.tap
make[3]: Leaving directory '<https://jenkins.aps.anl.gov/job/epics-base-3.15-mac-test/ws/src/ioc/db/test/O.darwin-x86'>
make[2]: Leaving directory '<https://jenkins.aps.anl.gov/job/epics-base-3.15-mac-test/ws/src/ioc/db/test'>
make[3]: Leaving directory '<https://jenkins.aps.anl.gov/job/epics-base-3.15-mac-test/ws/src/libCom/test/O.darwin-x86'>
make[2]: Leaving directory '<https://jenkins.aps.anl.gov/job/epics-base-3.15-mac-test/ws/src/libCom/test'>
make[1]: Leaving directory '<https://jenkins.aps.anl.gov/job/epics-base-3.15-mac-test/ws/src'>
+ make -s test-results CROSS_COMPILER_TARGET_ARCHS=
Breaktable.tap .. ok
DBD.tap ......... ok
Device.tap ...... ok
Driver.tap ...... ok
Function.tap .... ok
macLib.tap ...... ok
Menu.tap ........ ok
Recfield.tap .... ok
Recordtype.tap .. ok
Registrar.tap ... ok
Snippets.tap .... ok
Variable.tap .... ok
All tests successful.
Files=12, Tests=224,  0 wallclock secs ( 0.06 usr  0.02 sys +  0.01 cusr  0.02 csys =  0.11 CPU)
Result: PASS
epicsUnitTestTest.tap ........ ok
epicsTypesTest.tap ........... ok
epicsInlineTest.tap .......... ok
epicsCalcTest.tap ............ ok
epicsAlgorithmTest.tap ....... ok
epicsMathTest.tap ............ ok
epicsMMIOTest.tap ............ ok
epicsEllTest.tap ............. ok
epicsEnvTest.tap ............. ok
epicsErrlogTest.tap .......... ok
epicsStdioTest.tap ........... ok
epicsStdlibTest.tap .......... ok
epicsSockResolveTest.tap ..... ok
epicsStringTest.tap .......... ok
epicsTimeTest.tap ............ ok
epicsTimeZoneTest.tap ........ ok
epicsThreadTest.tap .......... ok
epicsThreadOnceTest.tap ...... ok
epicsThreadPriorityTest.tap .. ok
epicsThreadPrivateTest.tap ... ok
epicsThreadHooksTest.tap ..... ok
epicsThreadPoolTest.tap ...... ok
epicsExitTest.tap ............ ok
epicsTimerTest.tap ........... ok
ringPointerTest.tap .......... ok
ringBytesTest.tap ............ ok
epicsEventTest.tap ........... ok
epicsMutexTest.tap ........... ok
epicsSpinTest.tap ............ ok
epicsAtomicTest.tap .......... 
Failed 21/31 subtests 
macDefExpandTest.tap ......... ok
macLibTest.tap ............... ok
taskwdTest.tap ............... ok
blockingSockTest.tap ......... ok
epicsMessageQueueTest.tap .... ok
epicsStackTraceTest.tap ...... ok
ipAddrToAsciiTest.tap ........ ok
osiSockTest.tap .............. ok

Test Summary Report
-------------------
epicsAtomicTest.tap        (Wstat: 0 Tests: 10 Failed: 0)
  Parse errors: Bad plan.  You planned 31 tests but ran 10.
Files=38, Tests=2876,  0 wallclock secs ( 0.24 usr  0.05 sys +  0.05 cusr  0.07 csys =  0.41 CPU)
Result: FAIL
../../../../configure/RULES_BUILD:354: recipe for target 'test-results' failed
make[3]: *** [test-results] Error 1
../../../configure/RULES_ARCHS:58: recipe for target 'test-results.darwin-x86' failed
make[2]: *** [test-results.darwin-x86] Error 2
../configure/RULES_DIRS:84: recipe for target 'libCom/test.test-results' failed
make[1]: *** [libCom/test.test-results] Error 2
configure/RULES_DIRS:84: recipe for target 'src.test-results' failed
make: *** [src.test-results] Error 2
Build step 'Execute shell' marked build as failure
TAP Reports Processing: START
Looking for TAP results report in workspace using pattern: src/**/O.darwin-x86/*.tap
Saving reports...
Not all test cases were executed according to the test set plan. Marking build as UNSTABLE
TAP Reports Processing: FINISH

Replies:
Jenkins build is back to normal : epics-base-3.15-mac-test #188 APS Jenkins

Navigate by Date:
Prev: EPICS pvRequest Marty Kraimer
Next: Jenkins build is back to normal : epics-base-3.15-mac-test #188 APS Jenkins
Index: 2002  2003  2004  2005  2006  2007  2008  2009  2010  2011  2012  2013  2014  2015  2016  2017  <20182019  2020  2021 
Navigate by Thread:
Prev: EPICS pvRequest Marty Kraimer
Next: Jenkins build is back to normal : epics-base-3.15-mac-test #188 APS Jenkins
Index: 2002  2003  2004  2005  2006  2007  2008  2009  2010  2011  2012  2013  2014  2015  2016  2017  <20182019  2020  2021 
ANJ, 10 Aug 2018 Valid HTML 4.01! · Home · News · About · Base · Modules · Extensions · Distributions · Download ·
· Search · EPICS V4 · IRMIS · Talk · Bugs · Documents · Links · Licensing ·