EPICS Controls Argonne National Laboratory

Experimental Physics and
Industrial Control System

2002  2003  2004  2005  2006  2007  2008  2009  2010  2011  2012  2013  2014  2015  2016  2017  <20182019  2020  2021  2022  2023  Index 2002  2003  2004  2005  2006  2007  2008  2009  2010  2011  2012  2013  2014  2015  2016  2017  <20182019  2020  2021  2022  2023 
<== Date ==> <== Thread ==>

Subject: Build failed in Jenkins: epics-base-3.14-ios #200
From: APS Jenkins <[email protected]>
To: [email protected]
Date: Fri, 17 Aug 2018 14:34:23 -0500 (CDT)
See <https://jenkins.aps.anl.gov/job/epics-base-3.14-ios/200/display/redirect>

------------------------------------------
[...truncated 179.41 KB...]
/Applications/Xcode.app/Contents/Developer/Toolchains/XcodeDefault.xctoolchain/usr/bin/ar -rc    librsrvIoc.a         caserverio.o caservertask.o camsgtask.o camessage.o cast_server.o online_notify.o rsrvIocRegister.o
/Applications/Xcode.app/Contents/Developer/Toolchains/XcodeDefault.xctoolchain/usr/bin/ranlib librsrvIoc.a
/Applications/Xcode.app/Contents/Developer/Toolchains/XcodeDefault.xctoolchain/usr/bin/clang++ -o librsrvIoc.3.14.12.dylib -dynamiclib -flat_namespace -undefined suppress -install_name <https://jenkins.aps.anl.gov/job/epics-base-3.14-ios/ws/lib/ios-arm/librsrvIoc.3.14.12.dylib> -compatibility_version 3.14 -current_version 3.14.12 -L<https://jenkins.aps.anl.gov/job/epics-base-3.14-ios/ws/lib/ios-arm>        -arch armv7 -arch armv7s -arch arm64    -miphoneos-version-min=8.0 -isysroot /Applications/Xcode.app/Contents/Developer/Platforms/iPhoneOS.platform/Developer/SDKs/iPhoneOS.sdk -dynamic -Z -L/Applications/Xcode.app/Contents/Developer/Platforms/iPhoneOS.platform/Developer/SDKs/iPhoneOS.sdk/usr/lib -L/Applications/Xcode.app/Contents/Developer/Platforms/iPhoneOS.platform/Developer/SDKs/iPhoneOS.sdk/usr/lib/system             caserverio.o caservertask.o camsgtask.o camessage.o cast_server.o online_notify.o rsrvIocRegister.o   -lasIoc -ldbIoc -lca -lCom       -lm 
ld: warning: directory not found for option '-L/Applications/Xcode.app/Contents/Developer/Platforms/iPhoneOS.platform/Developer/SDKs/iPhoneOS.sdk/usr/lib/system'
ld: warning: -flat_namespace is deprecated on iOS
ld: warning: directory not found for option '-L/Applications/Xcode.app/Contents/Developer/Platforms/iPhoneOS.platform/Developer/SDKs/iPhoneOS.sdk/usr/lib/system'
ld: warning: -flat_namespace is deprecated on iOS
ld: warning: directory not found for option '-L/Applications/Xcode.app/Contents/Developer/Platforms/iPhoneOS.platform/Developer/SDKs/iPhoneOS.sdk/usr/lib/system'
ld: warning: -flat_namespace is deprecated on iOS
Installing shared library ../../../lib/ios-arm/librsrvIoc.3.14.12.dylib
ln -s librsrvIoc.3.14.12.dylib ../../../lib/ios-arm/librsrvIoc.dylib
Installing library ../../../lib/ios-arm/librsrvIoc.a
make[3]: Leaving directory '<https://jenkins.aps.anl.gov/job/epics-base-3.14-ios/ws/src/rsrv/O.ios-arm'>
make[2]: Leaving directory '<https://jenkins.aps.anl.gov/job/epics-base-3.14-ios/ws/src/rsrv'>
make -C ./rec ios-arm 
make[2]: Entering directory '<https://jenkins.aps.anl.gov/job/epics-base-3.14-ios/ws/src/rec'>
perl ../../bin/darwin-x86/makeMakefile.pl O.ios-arm ../../..
make -C O.darwin-x86 -f ../Makefile TOP=../../.. T_A=darwin-x86
make[3]: Entering directory '<https://jenkins.aps.anl.gov/job/epics-base-3.14-ios/ws/src/rec/O.darwin-x86'>
make[3]: Nothing to be done for 'all'.
make[3]: Leaving directory '<https://jenkins.aps.anl.gov/job/epics-base-3.14-ios/ws/src/rec/O.darwin-x86'>
make -C O.ios-arm -f ../Makefile TOP=../../.. T_A=ios-arm
make[3]: Entering directory '<https://jenkins.aps.anl.gov/job/epics-base-3.14-ios/ws/src/rec/O.ios-arm'>
/Applications/Xcode.app/Contents/Developer/Toolchains/XcodeDefault.xctoolchain/usr/bin/clang -c               -DUNIX      -O3 -g   -Wall       -arch armv7 -arch armv7s -arch arm64 -fno-common -Wno-unused-value   -fno-inline-functions -miphoneos-version-min=8.0 -isysroot /Applications/Xcode.app/Contents/Developer/Platforms/iPhoneOS.platform/Developer/SDKs/iPhoneOS.sdk -fPIC  -I. -I../O.Common -I. -I.. -I../../../include/os/iOS -I../../../include         ../aaiRecord.c 
/Applications/Xcode.app/Contents/Developer/Toolchains/XcodeDefault.xctoolchain/usr/bin/clang -c               -DUNIX      -O3 -g   -Wall       -arch armv7 -arch armv7s -arch arm64 -fno-common -Wno-unused-value   -fno-inline-functions -miphoneos-version-min=8.0 -isysroot /Applications/Xcode.app/Contents/Developer/Platforms/iPhoneOS.platform/Developer/SDKs/iPhoneOS.sdk -fPIC  -I. -I../O.Common -I. -I.. -I../../../include/os/iOS -I../../../include         ../aaoRecord.c 
/Applications/Xcode.app/Contents/Developer/Toolchains/XcodeDefault.xctoolchain/usr/bin/clang -c               -DUNIX      -O3 -g   -Wall       -arch armv7 -arch armv7s -arch arm64 -fno-common -Wno-unused-value   -fno-inline-functions -miphoneos-version-min=8.0 -isysroot /Applications/Xcode.app/Contents/Developer/Platforms/iPhoneOS.platform/Developer/SDKs/iPhoneOS.sdk -fPIC  -I. -I../O.Common -I. -I.. -I../../../include/os/iOS -I../../../include         ../aiRecord.c 
/Applications/Xcode.app/Contents/Developer/Toolchains/XcodeDefault.xctoolchain/usr/bin/clang -c               -DUNIX      -O3 -g   -Wall       -arch armv7 -arch armv7s -arch arm64 -fno-common -Wno-unused-value   -fno-inline-functions -miphoneos-version-min=8.0 -isysroot /Applications/Xcode.app/Contents/Developer/Platforms/iPhoneOS.platform/Developer/SDKs/iPhoneOS.sdk -fPIC  -I. -I../O.Common -I. -I.. -I../../../include/os/iOS -I../../../include         ../aoRecord.c 
/Applications/Xcode.app/Contents/Developer/Toolchains/XcodeDefault.xctoolchain/usr/bin/clang -c               -DUNIX      -O3 -g   -Wall       -arch armv7 -arch armv7s -arch arm64 -fno-common -Wno-unused-value   -fno-inline-functions -miphoneos-version-min=8.0 -isysroot /Applications/Xcode.app/Contents/Developer/Platforms/iPhoneOS.platform/Developer/SDKs/iPhoneOS.sdk -fPIC  -I. -I../O.Common -I. -I.. -I../../../include/os/iOS -I../../../include         ../aSubRecord.c 
../aSubRecord.c:110:5: warning: unused typedef 'static_assert_failed_at_line_110' [-Wunused-local-typedef]
    STATIC_ASSERT(sizeof(prec->onam)==sizeof(prec->snam));
    ^
../../../include/epicsAssert.h:52:17: note: expanded from macro 'STATIC_ASSERT'
    typedef int STATIC_JOIN(static_assert_failed_at_line_, __LINE__) \
                ^
../../../include/epicsAssert.h:49:27: note: expanded from macro 'STATIC_JOIN'
#define STATIC_JOIN(x, y) STATIC_JOIN2(x, y)
                          ^
../../../include/epicsAssert.h:50:28: note: expanded from macro 'STATIC_JOIN2'
#define STATIC_JOIN2(x, y) x ## y
                           ^
<scratch space>:128:1: note: expanded from here
static_assert_failed_at_line_110
^
1 warning generated.
../aSubRecord.c:110:5: warning: unused typedef 'static_assert_failed_at_line_110' [-Wunused-local-typedef]
    STATIC_ASSERT(sizeof(prec->onam)==sizeof(prec->snam));
    ^
../../../include/epicsAssert.h:52:17: note: expanded from macro 'STATIC_ASSERT'
    typedef int STATIC_JOIN(static_assert_failed_at_line_, __LINE__) \
                ^
../../../include/epicsAssert.h:49:27: note: expanded from macro 'STATIC_JOIN'
#define STATIC_JOIN(x, y) STATIC_JOIN2(x, y)
                          ^
../../../include/epicsAssert.h:50:28: note: expanded from macro 'STATIC_JOIN2'
#define STATIC_JOIN2(x, y) x ## y
                           ^
<scratch space>:128:1: note: expanded from here
static_assert_failed_at_line_110
^
1 warning generated.
../aSubRecord.c:110:5: warning: unused typedef 'static_assert_failed_at_line_110' [-Wunused-local-typedef]
    STATIC_ASSERT(sizeof(prec->onam)==sizeof(prec->snam));
    ^
../../../include/epicsAssert.h:52:17: note: expanded from macro 'STATIC_ASSERT'
    typedef int STATIC_JOIN(static_assert_failed_at_line_, __LINE__) \
                ^
../../../include/epicsAssert.h:49:27: note: expanded from macro 'STATIC_JOIN'
#define STATIC_JOIN(x, y) STATIC_JOIN2(x, y)
                          ^
../../../include/epicsAssert.h:50:28: note: expanded from macro 'STATIC_JOIN2'
#define STATIC_JOIN2(x, y) x ## y
                           ^
<scratch space>:128:1: note: expanded from here
static_assert_failed_at_line_110
^
1 warning generated.
/Applications/Xcode.app/Contents/Developer/Toolchains/XcodeDefault.xctoolchain/usr/bin/clang -c               -DUNIX      -O3 -g   -Wall       -arch armv7 -arch armv7s -arch arm64 -fno-common -Wno-unused-value   -fno-inline-functions -miphoneos-version-min=8.0 -isysroot /Applications/Xcode.app/Contents/Developer/Platforms/iPhoneOS.platform/Developer/SDKs/iPhoneOS.sdk -fPIC  -I. -I../O.Common -I. -I.. -I../../../include/os/iOS -I../../../include         ../biRecord.c 
/Applications/Xcode.app/Contents/Developer/Toolchains/XcodeDefault.xctoolchain/usr/bin/clang -c               -DUNIX      -O3 -g   -Wall       -arch armv7 -arch armv7s -arch arm64 -fno-common -Wno-unused-value   -fno-inline-functions -miphoneos-version-min=8.0 -isysroot /Applications/Xcode.app/Contents/Developer/Platforms/iPhoneOS.platform/Developer/SDKs/iPhoneOS.sdk -fPIC  -I. -I../O.Common -I. -I.. -I../../../include/os/iOS -I../../../include         ../boRecord.c 
/Applications/Xcode.app/Contents/Developer/Toolchains/XcodeDefault.xctoolchain/usr/bin/clang -c               -DUNIX      -O3 -g   -Wall       -arch armv7 -arch armv7s -arch arm64 -fno-common -Wno-unused-value   -fno-inline-functions -miphoneos-version-min=8.0 -isysroot /Applications/Xcode.app/Contents/Developer/Platforms/iPhoneOS.platform/Developer/SDKs/iPhoneOS.sdk -fPIC  -I. -I../O.Common -I. -I.. -I../../../include/os/iOS -I../../../include         ../calcRecord.c 
/Applications/Xcode.app/Contents/Developer/Toolchains/XcodeDefault.xctoolchain/usr/bin/clang -c               -DUNIX      -O3 -g   -Wall       -arch armv7 -arch armv7s -arch arm64 -fno-common -Wno-unused-value   -fno-inline-functions -miphoneos-version-min=8.0 -isysroot /Applications/Xcode.app/Contents/Developer/Platforms/iPhoneOS.platform/Developer/SDKs/iPhoneOS.sdk -fPIC  -I. -I../O.Common -I. -I.. -I../../../include/os/iOS -I../../../include         ../calcoutRecord.c 
/Applications/Xcode.app/Contents/Developer/Toolchains/XcodeDefault.xctoolchain/usr/bin/clang -c               -DUNIX      -O3 -g   -Wall       -arch armv7 -arch armv7s -arch arm64 -fno-common -Wno-unused-value   -fno-inline-functions -miphoneos-version-min=8.0 -isysroot /Applications/Xcode.app/Contents/Developer/Platforms/iPhoneOS.platform/Developer/SDKs/iPhoneOS.sdk -fPIC  -I. -I../O.Common -I. -I.. -I../../../include/os/iOS -I../../../include         ../compressRecord.c 
/Applications/Xcode.app/Contents/Developer/Toolchains/XcodeDefault.xctoolchain/usr/bin/clang -c               -DUNIX      -O3 -g   -Wall       -arch armv7 -arch armv7s -arch arm64 -fno-common -Wno-unused-value   -fno-inline-functions -miphoneos-version-min=8.0 -isysroot /Applications/Xcode.app/Contents/Developer/Platforms/iPhoneOS.platform/Developer/SDKs/iPhoneOS.sdk -fPIC  -I. -I../O.Common -I. -I.. -I../../../include/os/iOS -I../../../include         ../dfanoutRecord.c 
/Applications/Xcode.app/Contents/Developer/Toolchains/XcodeDefault.xctoolchain/usr/bin/clang -c               -DUNIX      -O3 -g   -Wall       -arch armv7 -arch armv7s -arch arm64 -fno-common -Wno-unused-value   -fno-inline-functions -miphoneos-version-min=8.0 -isysroot /Applications/Xcode.app/Contents/Developer/Platforms/iPhoneOS.platform/Developer/SDKs/iPhoneOS.sdk -fPIC  -I. -I../O.Common -I. -I.. -I../../../include/os/iOS -I../../../include         ../eventRecord.c 
/Applications/Xcode.app/Contents/Developer/Toolchains/XcodeDefault.xctoolchain/usr/bin/clang -c               -DUNIX      -O3 -g   -Wall       -arch armv7 -arch armv7s -arch arm64 -fno-common -Wno-unused-value   -fno-inline-functions -miphoneos-version-min=8.0 -isysroot /Applications/Xcode.app/Contents/Developer/Platforms/iPhoneOS.platform/Developer/SDKs/iPhoneOS.sdk -fPIC  -I. -I../O.Common -I. -I.. -I../../../include/os/iOS -I../../../include         ../fanoutRecord.c 
/Applications/Xcode.app/Contents/Developer/Toolchains/XcodeDefault.xctoolchain/usr/bin/clang -c               -DUNIX      -O3 -g   -Wall       -arch armv7 -arch armv7s -arch arm64 -fno-common -Wno-unused-value   -fno-inline-functions -miphoneos-version-min=8.0 -isysroot /Applications/Xcode.app/Contents/Developer/Platforms/iPhoneOS.platform/Developer/SDKs/iPhoneOS.sdk -fPIC  -I. -I../O.Common -I. -I.. -I../../../include/os/iOS -I../../../include         ../histogramRecord.c 
/Applications/Xcode.app/Contents/Developer/Toolchains/XcodeDefault.xctoolchain/usr/bin/clang -c               -DUNIX      -O3 -g   -Wall       -arch armv7 -arch armv7s -arch arm64 -fno-common -Wno-unused-value   -fno-inline-functions -miphoneos-version-min=8.0 -isysroot /Applications/Xcode.app/Contents/Developer/Platforms/iPhoneOS.platform/Developer/SDKs/iPhoneOS.sdk -fPIC  -I. -I../O.Common -I. -I.. -I../../../include/os/iOS -I../../../include         ../longinRecord.c 
/Applications/Xcode.app/Contents/Developer/Toolchains/XcodeDefault.xctoolchain/usr/bin/clang -c               -DUNIX      -O3 -g   -Wall       -arch armv7 -arch armv7s -arch arm64 -fno-common -Wno-unused-value   -fno-inline-functions -miphoneos-version-min=8.0 -isysroot /Applications/Xcode.app/Contents/Developer/Platforms/iPhoneOS.platform/Developer/SDKs/iPhoneOS.sdk -fPIC  -I. -I../O.Common -I. -I.. -I../../../include/os/iOS -I../../../include         ../longoutRecord.c 
/Applications/Xcode.app/Contents/Developer/Toolchains/XcodeDefault.xctoolchain/usr/bin/clang -c               -DUNIX      -O3 -g   -Wall       -arch armv7 -arch armv7s -arch arm64 -fno-common -Wno-unused-value   -fno-inline-functions -miphoneos-version-min=8.0 -isysroot /Applications/Xcode.app/Contents/Developer/Platforms/iPhoneOS.platform/Developer/SDKs/iPhoneOS.sdk -fPIC  -I. -I../O.Common -I. -I.. -I../../../include/os/iOS -I../../../include         ../mbbiRecord.c 
/Applications/Xcode.app/Contents/Developer/Toolchains/XcodeDefault.xctoolchain/usr/bin/clang -c               -DUNIX      -O3 -g   -Wall       -arch armv7 -arch armv7s -arch arm64 -fno-common -Wno-unused-value   -fno-inline-functions -miphoneos-version-min=8.0 -isysroot /Applications/Xcode.app/Contents/Developer/Platforms/iPhoneOS.platform/Developer/SDKs/iPhoneOS.sdk -fPIC  -I. -I../O.Common -I. -I.. -I../../../include/os/iOS -I../../../include         ../mbbiDirectRecord.c 
/Applications/Xcode.app/Contents/Developer/Toolchains/XcodeDefault.xctoolchain/usr/bin/clang -c               -DUNIX      -O3 -g   -Wall       -arch armv7 -arch armv7s -arch arm64 -fno-common -Wno-unused-value   -fno-inline-functions -miphoneos-version-min=8.0 -isysroot /Applications/Xcode.app/Contents/Developer/Platforms/iPhoneOS.platform/Developer/SDKs/iPhoneOS.sdk -fPIC  -I. -I../O.Common -I. -I.. -I../../../include/os/iOS -I../../../include         ../mbboRecord.c 
/Applications/Xcode.app/Contents/Developer/Toolchains/XcodeDefault.xctoolchain/usr/bin/clang -c               -DUNIX      -O3 -g   -Wall       -arch armv7 -arch armv7s -arch arm64 -fno-common -Wno-unused-value   -fno-inline-functions -miphoneos-version-min=8.0 -isysroot /Applications/Xcode.app/Contents/Developer/Platforms/iPhoneOS.platform/Developer/SDKs/iPhoneOS.sdk -fPIC  -I. -I../O.Common -I. -I.. -I../../../include/os/iOS -I../../../include         ../mbboDirectRecord.c 
/Applications/Xcode.app/Contents/Developer/Toolchains/XcodeDefault.xctoolchain/usr/bin/clang -c               -DUNIX      -O3 -g   -Wall       -arch armv7 -arch armv7s -arch arm64 -fno-common -Wno-unused-value   -fno-inline-functions -miphoneos-version-min=8.0 -isysroot /Applications/Xcode.app/Contents/Developer/Platforms/iPhoneOS.platform/Developer/SDKs/iPhoneOS.sdk -fPIC  -I. -I../O.Common -I. -I.. -I../../../include/os/iOS -I../../../include         ../permissiveRecord.c 
/Applications/Xcode.app/Contents/Developer/Toolchains/XcodeDefault.xctoolchain/usr/bin/clang -c               -DUNIX      -O3 -g   -Wall       -arch armv7 -arch armv7s -arch arm64 -fno-common -Wno-unused-value   -fno-inline-functions -miphoneos-version-min=8.0 -isysroot /Applications/Xcode.app/Contents/Developer/Platforms/iPhoneOS.platform/Developer/SDKs/iPhoneOS.sdk -fPIC  -I. -I../O.Common -I. -I.. -I../../../include/os/iOS -I../../../include         ../selRecord.c 
/Applications/Xcode.app/Contents/Developer/Toolchains/XcodeDefault.xctoolchain/usr/bin/clang -c               -DUNIX      -O3 -g   -Wall       -arch armv7 -arch armv7s -arch arm64 -fno-common -Wno-unused-value   -fno-inline-functions -miphoneos-version-min=8.0 -isysroot /Applications/Xcode.app/Contents/Developer/Platforms/iPhoneOS.platform/Developer/SDKs/iPhoneOS.sdk -fPIC  -I. -I../O.Common -I. -I.. -I../../../include/os/iOS -I../../../include         ../seqRecord.c 
/Applications/Xcode.app/Contents/Developer/Toolchains/XcodeDefault.xctoolchain/usr/bin/clang -c               -DUNIX      -O3 -g   -Wall       -arch armv7 -arch armv7s -arch arm64 -fno-common -Wno-unused-value   -fno-inline-functions -miphoneos-version-min=8.0 -isysroot /Applications/Xcode.app/Contents/Developer/Platforms/iPhoneOS.platform/Developer/SDKs/iPhoneOS.sdk -fPIC  -I. -I../O.Common -I. -I.. -I../../../include/os/iOS -I../../../include         ../stateRecord.c 
/Applications/Xcode.app/Contents/Developer/Toolchains/XcodeDefault.xctoolchain/usr/bin/clang -c               -DUNIX      -O3 -g   -Wall       -arch armv7 -arch armv7s -arch arm64 -fno-common -Wno-unused-value   -fno-inline-functions -miphoneos-version-min=8.0 -isysroot /Applications/Xcode.app/Contents/Developer/Platforms/iPhoneOS.platform/Developer/SDKs/iPhoneOS.sdk -fPIC  -I. -I../O.Common -I. -I.. -I../../../include/os/iOS -I../../../include         ../stringinRecord.c 
../stringinRecord.c:95:5: warning: unused typedef 'static_assert_failed_at_line_95' [-Wunused-local-typedef]
    STATIC_ASSERT(sizeof(prec->oval)==sizeof(prec->val));
    ^
../../../include/epicsAssert.h:52:17: note: expanded from macro 'STATIC_ASSERT'
    typedef int STATIC_JOIN(static_assert_failed_at_line_, __LINE__) \
                ^
../../../include/epicsAssert.h:49:27: note: expanded from macro 'STATIC_JOIN'
#define STATIC_JOIN(x, y) STATIC_JOIN2(x, y)
                          ^
../../../include/epicsAssert.h:50:28: note: expanded from macro 'STATIC_JOIN2'
#define STATIC_JOIN2(x, y) x ## y
                           ^
<scratch space>:128:1: note: expanded from here
static_assert_failed_at_line_95
^
1 warning generated.
../stringinRecord.c:95:5: warning: unused typedef 'static_assert_failed_at_line_95' [-Wunused-local-typedef]
    STATIC_ASSERT(sizeof(prec->oval)==sizeof(prec->val));
    ^
../../../include/epicsAssert.h:52:17: note: expanded from macro 'STATIC_ASSERT'
    typedef int STATIC_JOIN(static_assert_failed_at_line_, __LINE__) \
                ^
../../../include/epicsAssert.h:49:27: note: expanded from macro 'STATIC_JOIN'
#define STATIC_JOIN(x, y) STATIC_JOIN2(x, y)
                          ^
../../../include/epicsAssert.h:50:28: note: expanded from macro 'STATIC_JOIN2'
#define STATIC_JOIN2(x, y) x ## y
                           ^
<scratch space>:128:1: note: expanded from here
static_assert_failed_at_line_95
^
1 warning generated.
../stringinRecord.c:95:5: warning: unused typedef 'static_assert_failed_at_line_95' [-Wunused-local-typedef]
    STATIC_ASSERT(sizeof(prec->oval)==sizeof(prec->val));
    ^
../../../include/epicsAssert.h:52:17: note: expanded from macro 'STATIC_ASSERT'
    typedef int STATIC_JOIN(static_assert_failed_at_line_, __LINE__) \
                ^
../../../include/epicsAssert.h:49:27: note: expanded from macro 'STATIC_JOIN'
#define STATIC_JOIN(x, y) STATIC_JOIN2(x, y)
                          ^
../../../include/epicsAssert.h:50:28: note: expanded from macro 'STATIC_JOIN2'
#define STATIC_JOIN2(x, y) x ## y
                           ^
<scratch space>:128:1: note: expanded from here
static_assert_failed_at_line_95
^
1 warning generated.
/Applications/Xcode.app/Contents/Developer/Toolchains/XcodeDefault.xctoolchain/usr/bin/clang -c               -DUNIX      -O3 -g   -Wall       -arch armv7 -arch armv7s -arch arm64 -fno-common -Wno-unused-value   -fno-inline-functions -miphoneos-version-min=8.0 -isysroot /Applications/Xcode.app/Contents/Developer/Platforms/iPhoneOS.platform/Developer/SDKs/iPhoneOS.sdk -fPIC  -I. -I../O.Common -I. -I.. -I../../../include/os/iOS -I../../../include         ../stringoutRecord.c 
../stringoutRecord.c:97:5: warning: unused typedef 'static_assert_failed_at_line_97' [-Wunused-local-typedef]
    STATIC_ASSERT(sizeof(prec->oval)==sizeof(prec->val));
    ^
../../../include/epicsAssert.h:52:17: note: expanded from macro 'STATIC_ASSERT'
    typedef int STATIC_JOIN(static_assert_failed_at_line_, __LINE__) \
                ^
../../../include/epicsAssert.h:49:27: note: expanded from macro 'STATIC_JOIN'
#define STATIC_JOIN(x, y) STATIC_JOIN2(x, y)
                          ^
../../../include/epicsAssert.h:50:28: note: expanded from macro 'STATIC_JOIN2'
#define STATIC_JOIN2(x, y) x ## y
                           ^
<scratch space>:128:1: note: expanded from here
static_assert_failed_at_line_97
^
1 warning generated.
../stringoutRecord.c:97:5: warning: unused typedef 'static_assert_failed_at_line_97' [-Wunused-local-typedef]
    STATIC_ASSERT(sizeof(prec->oval)==sizeof(prec->val));
    ^
../../../include/epicsAssert.h:52:17: note: expanded from macro 'STATIC_ASSERT'
    typedef int STATIC_JOIN(static_assert_failed_at_line_, __LINE__) \
                ^
../../../include/epicsAssert.h:49:27: note: expanded from macro 'STATIC_JOIN'
#define STATIC_JOIN(x, y) STATIC_JOIN2(x, y)
                          ^
../../../include/epicsAssert.h:50:28: note: expanded from macro 'STATIC_JOIN2'
#define STATIC_JOIN2(x, y) x ## y
                           ^
<scratch space>:128:1: note: expanded from here
static_assert_failed_at_line_97
^
1 warning generated.
../stringoutRecord.c:97:5: warning: unused typedef 'static_assert_failed_at_line_97' [-Wunused-local-typedef]
    STATIC_ASSERT(sizeof(prec->oval)==sizeof(prec->val));
    ^
../../../include/epicsAssert.h:52:17: note: expanded from macro 'STATIC_ASSERT'
    typedef int STATIC_JOIN(static_assert_failed_at_line_, __LINE__) \
                ^
../../../include/epicsAssert.h:49:27: note: expanded from macro 'STATIC_JOIN'
#define STATIC_JOIN(x, y) STATIC_JOIN2(x, y)
                          ^
../../../include/epicsAssert.h:50:28: note: expanded from macro 'STATIC_JOIN2'
#define STATIC_JOIN2(x, y) x ## y
                           ^
<scratch space>:128:1: note: expanded from here
static_assert_failed_at_line_97
^
1 warning generated.
/Applications/Xcode.app/Contents/Developer/Toolchains/XcodeDefault.xctoolchain/usr/bin/clang -c               -DUNIX      -O3 -g   -Wall       -arch armv7 -arch armv7s -arch arm64 -fno-common -Wno-unused-value   -fno-inline-functions -miphoneos-version-min=8.0 -isysroot /Applications/Xcode.app/Contents/Developer/Platforms/iPhoneOS.platform/Developer/SDKs/iPhoneOS.sdk -fPIC  -I. -I../O.Common -I. -I.. -I../../../include/os/iOS -I../../../include         ../subRecord.c 
/Applications/Xcode.app/Contents/Developer/Toolchains/XcodeDefault.xctoolchain/usr/bin/clang -c               -DUNIX      -O3 -g   -Wall       -arch armv7 -arch armv7s -arch arm64 -fno-common -Wno-unused-value   -fno-inline-functions -miphoneos-version-min=8.0 -isysroot /Applications/Xcode.app/Contents/Developer/Platforms/iPhoneOS.platform/Developer/SDKs/iPhoneOS.sdk -fPIC  -I. -I../O.Common -I. -I.. -I../../../include/os/iOS -I../../../include         ../subArrayRecord.c 
/Applications/Xcode.app/Contents/Developer/Toolchains/XcodeDefault.xctoolchain/usr/bin/clang -c               -DUNIX      -O3 -g   -Wall       -arch armv7 -arch armv7s -arch arm64 -fno-common -Wno-unused-value   -fno-inline-functions -miphoneos-version-min=8.0 -isysroot /Applications/Xcode.app/Contents/Developer/Platforms/iPhoneOS.platform/Developer/SDKs/iPhoneOS.sdk -fPIC  -I. -I../O.Common -I. -I.. -I../../../include/os/iOS -I../../../include         ../waveformRecord.c 
/Applications/Xcode.app/Contents/Developer/Toolchains/XcodeDefault.xctoolchain/usr/bin/ar -rc    librecIoc.a         aaiRecord.o aaoRecord.o aiRecord.o aoRecord.o aSubRecord.o biRecord.o boRecord.o calcRecord.o calcoutRecord.o compressRecord.o dfanoutRecord.o eventRecord.o fanoutRecord.o histogramRecord.o longinRecord.o longoutRecord.o mbbiRecord.o mbbiDirectRecord.o mbboRecord.o mbboDirectRecord.o permissiveRecord.o selRecord.o seqRecord.o stateRecord.o stringinRecord.o stringoutRecord.o subRecord.o subArrayRecord.o waveformRecord.o
/Applications/Xcode.app/Contents/Developer/Toolchains/XcodeDefault.xctoolchain/usr/bin/ranlib librecIoc.a
/Applications/Xcode.app/Contents/Developer/Toolchains/XcodeDefault.xctoolchain/usr/bin/clang++ -o librecIoc.3.14.12.dylib -dynamiclib -flat_namespace -undefined suppress -install_name <https://jenkins.aps.anl.gov/job/epics-base-3.14-ios/ws/lib/ios-arm/librecIoc.3.14.12.dylib> -compatibility_version 3.14 -current_version 3.14.12 -L<https://jenkins.aps.anl.gov/job/epics-base-3.14-ios/ws/lib/ios-arm>        -arch armv7 -arch armv7s -arch arm64    -miphoneos-version-min=8.0 -isysroot /Applications/Xcode.app/Contents/Developer/Platforms/iPhoneOS.platform/Developer/SDKs/iPhoneOS.sdk -dynamic -Z -L/Applications/Xcode.app/Contents/Developer/Platforms/iPhoneOS.platform/Developer/SDKs/iPhoneOS.sdk/usr/lib -L/Applications/Xcode.app/Contents/Developer/Platforms/iPhoneOS.platform/Developer/SDKs/iPhoneOS.sdk/usr/lib/system             aaiRecord.o aaoRecord.o aiRecord.o aoRecord.o aSubRecord.o biRecord.o boRecord.o calcRecord.o calcoutRecord.o compressRecord.o dfanoutRecord.o eventRecord.o fanoutRecord.o histogramRecord.o longinRecord.o longoutRecord.o mbbiRecord.o mbbiDirectRecord.o mbboRecord.o mbboDirectRecord.o permissiveRecord.o selRecord.o seqRecord.o stateRecord.o stringinRecord.o stringoutRecord.o subRecord.o subArrayRecord.o waveformRecord.o   -lasIoc -ldbIoc -lregistryIoc -ldbStaticIoc -lca -lCom       -lm 
ld: warning: directory not found for option '-L/Applications/Xcode.app/Contents/Developer/Platforms/iPhoneOS.platform/Developer/SDKs/iPhoneOS.sdk/usr/lib/system'
ld: warning: -flat_namespace is deprecated on iOS
ld: warning: directory not found for option '-L/Applications/Xcode.app/Contents/Developer/Platforms/iPhoneOS.platform/Developer/SDKs/iPhoneOS.sdk/usr/lib/system'
ld: warning: -flat_namespace is deprecated on iOS
ld: warning: directory not found for option '-L/Applications/Xcode.app/Contents/Developer/Platforms/iPhoneOS.platform/Developer/SDKs/iPhoneOS.sdk/usr/lib/system'
ld: warning: -flat_namespace is deprecated on iOS
Installing shared library ../../../lib/ios-arm/librecIoc.3.14.12.dylib
ln -s librecIoc.3.14.12.dylib ../../../lib/ios-arm/librecIoc.dylib
Installing library ../../../lib/ios-arm/librecIoc.a
make[3]: Leaving directory '<https://jenkins.aps.anl.gov/job/epics-base-3.14-ios/ws/src/rec/O.ios-arm'>
make[2]: Leaving directory '<https://jenkins.aps.anl.gov/job/epics-base-3.14-ios/ws/src/rec'>
make -C ./misc ios-arm 
make[2]: Entering directory '<https://jenkins.aps.anl.gov/job/epics-base-3.14-ios/ws/src/misc'>
perl ../../bin/darwin-x86/makeMakefile.pl O.ios-arm ../../..
make -C O.darwin-x86 -f ../Makefile TOP=../../.. T_A=darwin-x86
make[3]: Entering directory '<https://jenkins.aps.anl.gov/job/epics-base-3.14-ios/ws/src/misc/O.darwin-x86'>
make[3]: Nothing to be done for 'all'.
make[3]: Leaving directory '<https://jenkins.aps.anl.gov/job/epics-base-3.14-ios/ws/src/misc/O.darwin-x86'>
make -C O.ios-arm -f ../Makefile TOP=../../.. T_A=ios-arm
make[3]: Entering directory '<https://jenkins.aps.anl.gov/job/epics-base-3.14-ios/ws/src/misc/O.ios-arm'>
/Applications/Xcode.app/Contents/Developer/Toolchains/XcodeDefault.xctoolchain/usr/bin/clang -c               -DUNIX      -O3 -g   -Wall       -arch armv7 -arch armv7s -arch arm64 -fno-common -Wno-unused-value   -fno-inline-functions -miphoneos-version-min=8.0 -isysroot /Applications/Xcode.app/Contents/Developer/Platforms/iPhoneOS.platform/Developer/SDKs/iPhoneOS.sdk -fPIC  -I. -I../O.Common -I. -I.. -I../../../include/os/iOS -I../../../include         ../epicsRelease.c 
/Applications/Xcode.app/Contents/Developer/Toolchains/XcodeDefault.xctoolchain/usr/bin/clang -c               -DUNIX      -O3 -g   -Wall       -arch armv7 -arch armv7s -arch arm64 -fno-common -Wno-unused-value   -fno-inline-functions -miphoneos-version-min=8.0 -isysroot /Applications/Xcode.app/Contents/Developer/Platforms/iPhoneOS.platform/Developer/SDKs/iPhoneOS.sdk -fPIC  -I. -I../O.Common -I. -I.. -I../../../include/os/iOS -I../../../include         ../iocInit.c 
/Applications/Xcode.app/Contents/Developer/Toolchains/XcodeDefault.xctoolchain/usr/bin/clang -c               -DUNIX      -O3 -g   -Wall       -arch armv7 -arch armv7s -arch arm64 -fno-common -Wno-unused-value   -fno-inline-functions -miphoneos-version-min=8.0 -isysroot /Applications/Xcode.app/Contents/Developer/Platforms/iPhoneOS.platform/Developer/SDKs/iPhoneOS.sdk -fPIC  -I. -I../O.Common -I. -I.. -I../../../include/os/iOS -I../../../include         ../asSubRecordFunctions.c 
/Applications/Xcode.app/Contents/Developer/Toolchains/XcodeDefault.xctoolchain/usr/bin/clang -c               -DUNIX      -O3 -g   -Wall       -arch armv7 -arch armv7s -arch arm64 -fno-common -Wno-unused-value   -fno-inline-functions -miphoneos-version-min=8.0 -isysroot /Applications/Xcode.app/Contents/Developer/Platforms/iPhoneOS.platform/Developer/SDKs/iPhoneOS.sdk -fPIC  -I. -I../O.Common -I. -I.. -I../../../include/os/iOS -I../../../include         ../miscIocRegister.c 
../miscIocRegister.c:78:5: error: 'system' is unavailable: not available on iOS
    system(args[0].sval);
    ^
/Applications/Xcode.app/Contents/Developer/Platforms/iPhoneOS.platform/Developer/SDKs/iPhoneOS.sdk/usr/include/stdlib.h:195:6: note: 'system' has been explicitly marked unavailable here
int      system(const char *) __DARWIN_ALIAS_C(system);
         ^
../miscIocRegister.c:83:9: error: 'system' is unavailable: not available on iOS
    if (system(NULL))
        ^
/Applications/Xcode.app/Contents/Developer/Platforms/iPhoneOS.platform/Developer/SDKs/iPhoneOS.sdk/usr/include/stdlib.h:195:6: note: 'system' has been explicitly marked unavailable here
int      system(const char *) __DARWIN_ALIAS_C(system);
         ^
2 errors generated.
../../../configure/RULES_BUILD:213: recipe for target 'miscIocRegister.o' failed
make[3]: *** [miscIocRegister.o] Error 1
make[3]: Leaving directory '<https://jenkins.aps.anl.gov/job/epics-base-3.14-ios/ws/src/misc/O.ios-arm'>
../../configure/RULES_ARCHS:65: recipe for target 'ios-arm' failed
make[2]: *** [ios-arm] Error 2
make[2]: Leaving directory '<https://jenkins.aps.anl.gov/job/epics-base-3.14-ios/ws/src/misc'>
../configure/RULES_DIRS:83: recipe for target 'misc.ios-arm' failed
make[1]: *** [misc.ios-arm] Error 2
make[1]: Leaving directory '<https://jenkins.aps.anl.gov/job/epics-base-3.14-ios/ws/src'>
configure/RULES_DIRS:83: recipe for target 'src.ios-arm' failed
make: *** [src.ios-arm] Error 2
Build step 'Execute shell' marked build as failure
[WARNINGS] Skipping publisher since build result is FAILURE

Replies:
Jenkins build is back to normal : epics-base-3.14-ios #201 APS Jenkins
References:
Build failed in Jenkins: epics-base-3.14-ios #199 APS Jenkins

Navigate by Date:
Prev: Build failed in Jenkins: epics-base-3.14-ios #199 APS Jenkins
Next: Jenkins build is back to normal : epics-base-3.14-ios #201 APS Jenkins
Index: 2002  2003  2004  2005  2006  2007  2008  2009  2010  2011  2012  2013  2014  2015  2016  2017  <20182019  2020  2021  2022  2023 
Navigate by Thread:
Prev: Build failed in Jenkins: epics-base-3.14-ios #199 APS Jenkins
Next: Jenkins build is back to normal : epics-base-3.14-ios #201 APS Jenkins
Index: 2002  2003  2004  2005  2006  2007  2008  2009  2010  2011  2012  2013  2014  2015  2016  2017  <20182019  2020  2021  2022  2023 
ANJ, 17 Aug 2018 Valid HTML 4.01! · Home · News · About · Base · Modules · Extensions · Distributions · Download ·
· Search · EPICS V4 · IRMIS · Talk · Bugs · Documents · Links · Licensing ·