Argonne National Laboratory

Experimental Physics and
Industrial Control System

2002  2003  2004  2005  2006  2007  2008  2009  2010  2011  2012  2013  2014  2015  2016  2017  2018  2019  <2020 Index 2002  2003  2004  2005  2006  2007  2008  2009  2010  2011  2012  2013  2014  2015  2016  2017  2018  2019  <2020
<== Date ==> <== Thread ==>

Subject: Build failed in Jenkins: epics-base-7.0-win64-test #151
From: APS Jenkins via Core-talk <core-talk at aps.anl.gov>
To: core-talk at aps.anl.gov
Date: Mon, 23 Mar 2020 13:21:06 -0500 (CDT)
See <https://jenkins.aps.anl.gov/job/epics-base-7.0-win64-test/151/display/redirect>

Changes:


------------------------------------------
[...truncated 10.28 KB...]
make -C ./client tapfiles 
make -C ./template tapfiles 
make -C O.windows-x64 -f ../Makefile TOP=../../../../.. \
    T_A=windows-x64 tapfiles
make -C O.windows-x64 -f ../Makefile TOP=../../../../.. \
    T_A=windows-x64 tapfiles
make[5]: Nothing to be done for 'tapfiles'.
make[5]: Nothing to be done for 'tapfiles'.
make -C ./tools tapfiles 
make -C ./perl tapfiles 
make -C O.windows-x64 -f ../Makefile TOP=../../../../.. \
    T_A=windows-x64 tapfiles
make -C O.windows-x64 -f ../Makefile TOP=../../../../.. \
    T_A=windows-x64 tapfiles
make[5]: Nothing to be done for 'tapfiles'.
make[5]: Nothing to be done for 'tapfiles'.
make -C ./database tapfiles 
make -C ./src tapfiles 
make -C ./tools tapfiles 
make -C ./template tapfiles 
make -C O.windows-x64 -f ../Makefile TOP=../../../../.. \
    T_A=windows-x64 tapfiles
make -C O.windows-x64 -f ../Makefile TOP=../../../../.. \
    T_A=windows-x64 tapfiles
make[5]: Nothing to be done for 'tapfiles'.
make -C ./ioc tapfiles 
make[5]: Nothing to be done for 'tapfiles'.
make -C O.windows-x64 -f ../Makefile TOP=../../../../.. \
    T_A=windows-x64 tapfiles
perl -CSD <https://jenkins.aps.anl.gov/job/epics-base-7.0-win64-test/ws/bin/windows-x64/genVersionHeader.pl>   -t ../../../../.. -N EPICS_VCS_VERSION -V "" ../O.Common/epicsVCS.h
Keeping VCS header ../O.Common/epicsVCS.h
    EPICS_VCS_VERSION = "46fa31020ed4c5d3e405"
make[5]: Nothing to be done for 'tapfiles'.
make -C ./std tapfiles 
make -C O.windows-x64 -f ../Makefile TOP=../../../../.. \
    T_A=windows-x64 tapfiles
make[5]: Nothing to be done for 'tapfiles'.
make -C ./test tapfiles 
make -C ioc/db tapfiles 
make -C ioc/dbtemplate tapfiles 
make -C std/rec tapfiles 
make -C std/link tapfiles 
make -C O.windows-x64 -f ../Makefile TOP=../../../../../.. \
    T_A=windows-x64 tapfiles
make -C O.windows-x64 -f ../Makefile TOP=../../../../../.. \
    T_A=windows-x64 tapfiles
make -C O.windows-x64 -f ../Makefile TOP=../../../../../.. \
    T_A=windows-x64 tapfiles
make -C O.windows-x64 -f ../Makefile TOP=../../../../../.. \
    T_A=windows-x64 tapfiles
perl -CSD lnkStateTest.t -tap > lnkStateTest.tap
perl -CSD msi.t -tap > msi.tap
perl -CSD dbScanTest.t -tap > dbScanTest.tap
perl -CSD arrayOpTest.t -tap > arrayOpTest.tap
make -C std/filters tapfiles 
make -C O.windows-x64 -f ../Makefile TOP=../../../../../.. \
    T_A=windows-x64 tapfiles
perl -CSD lnkCalcTest.t -tap > lnkCalcTest.tap
perl -CSD recMiscTest.t -tap > recMiscTest.tap
perl -CSD dbShutdownTest.t -tap > dbShutdownTest.tap
make -C ./tools tapfiles 
perl -CSD linkRetargetLinkTest.t -tap > linkRetargetLinkTest.tap
make -C O.windows-x64 -f ../Makefile TOP=../../../../.. \
    T_A=windows-x64 tapfiles
perl -CSD tsTest.t -tap > tsTest.tap
perl -CSD Base.t -tap > Base.tap
perl -CSD dbndTest.t -tap > dbndTest.tap
perl -CSD Breaktable.t -tap > Breaktable.tap
perl -CSD arrTest.t -tap > arrTest.tap
perl -CSD DBD.t -tap > DBD.tap
perl -CSD Device.t -tap > Device.tap
perl -CSD syncTest.t -tap > syncTest.tap
perl -CSD Driver.t -tap > Driver.tap
perl -CSD linkInitTest.t -tap > linkInitTest.tap
perl -CSD Function.t -tap > Function.tap
perl -CSD decTest.t -tap > decTest.tap
perl -CSD dbPutLinkTest.t -tap > dbPutLinkTest.tap
dbJLinkInit: lexical error: invalid char in json text.
                                  {"x":bbbb}
                     (right here) ------^

dbJLinkInit: parse error: premature EOF
                                       {"z":{"good":6}
                     (right here) ------^

perl -CSD Menu.t -tap > Menu.tap
perl -CSD Recfield.t -tap > Recfield.tap
perl -CSD compressTest.t -tap > compressTest.tap
perl -CSD asyncSoftTest.t -tap > asyncSoftTest.tap
perl -CSD Recordtype.t -tap > Recordtype.tap
perl -CSD Registrar.t -tap > Registrar.tap
perl -CSD softTest.t -tap > softTest.tap
perl -CSD Variable.t -tap > Variable.tap
perl -CSD dbLockTest.t -tap > dbLockTest.tap
perl -CSD testdbConvert.t -tap > testdbConvert.tap
perl -CSD seqTest.t -tap > seqTest.tap
perl -CSD analogMonitorTest.t -tap > analogMonitorTest.tap
Starting iocInit
perl -CSD asTest.t -tap > asTest.tap
perl -CSD scanEventTest.t -tap > scanEventTest.tap
Starting iocInit
iocRun: All initialization complete
perl -CSD regressTest.t -tap > regressTest.tap
dbConvertJSON: parse error: trailing garbage
                                      0x10
                     (right here) ------^

dbConvertJSON: parse error: trailing garbage
                                      0x10
                     (right here) ------^

dbConvertJSON: parse error: trailing garbage
                                      0x10
                     (right here) ------^

dbConvertJSON: parse error: trailing garbage
                                      0x10
                     (right here) ------^

dbConvertJSON: parse error: trailing garbage
                                      0x10
                     (right here) ------^

dbConvertJSON: parse error: trailing garbage
                                      0x10
                     (right here) ------^

dbConvertJSON: parse error: trailing garbage
                                      0x10
                     (right here) ------^

dbConvertJSON: parse error: trailing garbage
                                      0x10
                     (right here) ------^

perl -CSD simmTest.t -tap > simmTest.tap
perl -CSD mbbioDirectTest.t -tap > mbbioDirectTest.tap
perl -CSD dbStressTest.t -tap > dbStressTest.tap
perl -CSD netget.t -tap > netget.tap
perl -CSD asyncproctest.t -tap > asyncproctest.tap
Starting iocInit
iocRun: All initialization complete
perl -CSD dbStateTest.t -tap > dbStateTest.tap
perl -CSD dbServerTest.t -tap > dbServerTest.tap
dbRegisterServer: Can't redefine 'one'.
dbRegisterServer: Bad server name 'bad name'
dbRegisterServer: Ignoring 'disabled', per environment
dbUnregisterServer: Servers still active!
dbUnregisterServer: 'toolate' not registered.
dbUnregisterServer: 'no-routines' has no stop() method.
perl -CSD dbCaStatsTest.t -tap > dbCaStatsTest.tap
perl -CSD callbackTest.t -tap > callbackTest.tap
perl -CSD dbChannelTest.t -tap > dbChannelTest.tap
perl -CSD callbackParallelTest.t -tap > callbackParallelTest.tap
perl -CSD chfPluginTest.t -tap > chfPluginTest.tap
chfConfigParseStart: plugin pvt alloc failed
perl -CSD dbChArrTest.t -tap > dbChArrTest.tap
Starting iocInit
iocRun: All initialization complete
perl -CSD recGblCheckDeadbandTest.t -tap > recGblCheckDeadbandTest.tap
perl -CSD arrShorthandTest.t -tap > arrShorthandTest.tap
perl -CSD testPutGetTest.t -tap > testPutGetTest.tap
perl -CSD dbStaticTest.t -tap > dbStaticTest.tap
perl -CSD dbCaLinkTest.t -tap > dbCaLinkTest.tap
perl -CSD scanIoTest.t -tap > scanIoTest.tap

C:\jenkins\win64-2\workspace\epics-base-7.0-win64>REM Show test results. Failures should mark the job as unstable. 

C:\jenkins\win64-2\workspace\epics-base-7.0-win64>make -sk test-results   || exit /B 255 
Snippets.tap .. ok
All tests successful.
Files=1, Tests=29,  0 wallclock secs ( 0.08 usr +  0.05 sys =  0.12 CPU)
Result: PASS
epicsUnitTestTest.tap ........ ok
epicsTypesTest.tap ........... ok
epicsInlineTest.tap .......... ok
epicsCalcTest.tap ............ ok
epicsAlgorithmTest.tap ....... ok
epicsMathTest.tap ............ ok
epicsMMIOTest.tap ............ ok
epicsEllTest.tap ............. ok
epicsEnvTest.tap ............. ok
epicsEnvUnsetTest.tap ........ ok
epicsErrlogTest.tap .......... ok
epicsStdioTest.tap ........... ok
epicsStdlibTest.tap .......... ok
epicsSockResolveTest.tap ..... ok
epicsStringTest.tap .......... ok
epicsTimeTest.tap ............ ok
epicsTimeZoneTest.tap ........ ok
epicsThreadTest.tap .......... ok
epicsThreadOnceTest.tap ...... ok
epicsThreadPriorityTest.tap .. ok
epicsThreadPrivateTest.tap ... ok
epicsThreadHooksTest.tap ..... ok
epicsThreadPoolTest.tap ...... ok
epicsExitTest.tap ............ ok
epicsTimerTest.tap ........... ok
ringPointerTest.tap .......... ok
ringBytesTest.tap ............ ok
epicsEventTest.tap ........... 
not ok 18 - epicsEventWaitWithTimeout(0.031250)  delay error -0.000250 sec
not ok 20 - epicsEventWaitWithTimeout(0.007813)  delay error -0.007813 sec
not ok 22 - epicsEventWaitWithTimeout(0.001953)  delay error -0.001953 sec
not ok 23 - epicsEventWaitWithTimeout(0.000977)  delay error -0.000977 sec
not ok 24 - epicsEventWaitWithTimeout(0.000488)  delay error -0.000488 sec
not ok 25 - epicsEventWaitWithTimeout(0.000244)  delay error -0.000244 sec
not ok 26 - epicsEventWaitWithTimeout(0.000122)  delay error -0.000122 sec
not ok 27 - epicsEventWaitWithTimeout(0.000061)  delay error -0.000061 sec
not ok 28 - epicsEventWaitWithTimeout(0.000031)  delay error -0.000031 sec
not ok 29 - epicsEventWaitWithTimeout(0.000015)  delay error -0.000015 sec
not ok 31 - epicsEventWaitWithTimeout(0.000004)  delay error -0.000004 sec
not ok 32 - epicsEventWaitWithTimeout(0.000002)  delay error -0.000002 sec
Failed 12/37 subtests 
epicsMutexTest.tap ........... ok
epicsSpinTest.tap ............ ok
epicsAtomicTest.tap .......... ok
macDefExpandTest.tap ......... ok
cvtFastTest.tap .............. ok
macLibTest.tap ............... ok
aslibtest.tap ................ ok
macLib.tap ................... ok
taskwdTest.tap ............... ok
blockingSockTest.tap ......... ok
epicsMessageQueueTest.tap .... ok
epicsStackTraceTest.tap ...... ok
ipAddrToAsciiTest.tap ........ ok
osiSockTest.tap .............. ok
testexecname.tap ............. ok
iocshTest.tap ................ ok

Test Summary Report
-------------------
epicsMathTest.tap          (Wstat: 0 Tests: 35 Failed: 0)
  TODO passed:   8-9, 11-12, 22-23
epicsEventTest.tap         (Wstat: 0 Tests: 37 Failed: 12)
  Failed tests:  18, 20, 22-29, 31-32
Files=44, Tests=4163,  5 wallclock secs ( 0.77 usr +  0.42 sys =  1.19 CPU)
Result: FAIL
make[4]: *** [../../../../configure/RULES_BUILD:373: test-results] Error 1
make[3]: *** [../../../configure/RULES_ARCHS:58: test-results.windows-x64] Error 2
make[3]: Target 'test-results' not remade because of errors.
make[2]: *** [../../configure/RULES_DIRS:84: test.test-results] Error 2
make[2]: Target 'test-results' not remade because of errors.
make[1]: *** [../configure/RULES_DIRS:84: libcom.test-results] Error 2
make[1]: Target 'test-results' not remade because of errors.
make: *** [configure/RULES_DIRS:84: modules.test-results] Error 2
make: Target 'test-results' not remade because of errors.
Build step 'Execute Windows batch command' marked build as failure

Replies:
Build failed in Jenkins: epics-base-7.0-win64-test #152 APS Jenkins via Core-talk
References:
Build failed in Jenkins: epics-base-7.0-win64-test #150 APS Jenkins via Core-talk

Navigate by Date:
Prev: Jenkins build is back to normal : epics-base-7.0-win64 #108 APS Jenkins via Core-talk
Next: Jenkins build is still unstable: epics-base-7.0-win64s-test #147 APS Jenkins via Core-talk
Index: 2002  2003  2004  2005  2006  2007  2008  2009  2010  2011  2012  2013  2014  2015  2016  2017  2018  2019  <2020
Navigate by Thread:
Prev: Build failed in Jenkins: epics-base-7.0-win64-test #150 APS Jenkins via Core-talk
Next: Build failed in Jenkins: epics-base-7.0-win64-test #152 APS Jenkins via Core-talk
Index: 2002  2003  2004  2005  2006  2007  2008  2009  2010  2011  2012  2013  2014  2015  2016  2017  2018  2019  <2020
ANJ, 23 Mar 2020 Valid HTML 4.01! · Home · News · About · Base · Modules · Extensions · Distributions · Download ·
· Search · EPICS V4 · IRMIS · Talk · Bugs · Documents · Links · Licensing ·