Argonne National Laboratory

Experimental Physics and
Industrial Control System

1994  1995  1996  1997  1998  1999  2000  2001  2002  2003  2004  2005  2006  2007  2008  2009  2010  2011  <20122013  2014  2015  2016  2017  2018  2019  Index 1994  1995  1996  1997  1998  1999  2000  2001  2002  2003  2004  2005  2006  2007  2008  2009  2010  2011  <20122013  2014  2015  2016  2017  2018  2019 
<== Date ==> <== Thread ==>

Subject: SynApps build error : win32-x86
From: stein@aps.anl.gov
To: tech-talk@aps.anl.gov
Date: Tue, 26 Jun 2012 07:48:50 -0500 (CDT)
Greetings all,

  I'm having a maddening error attempting to build synApps_5_6 on a windows machine. Visual Studio 10, GnuWin32 Make (3.81), Strawberry Perl. The following is generated while attempting to build the sequencer support. Note the somewhat crazy mix of forward and backward slashes, the apparent use of double slashes within path names, and (the portion that appears to generate the failure) the lack of any slashes within the path to the "lemon" executable causing the "command not found" error.


Generating code
Finished generating code
Installing created file ../../../bin/win32-x86/snc.exe
perl -MExtUtils::Command -e rm_f ../O.Common/snl.bnf
..\\..\\..\\bin\\win32-x86\\lemon.exe o=. -g ../snl.lem > ../O.Common/snl.bnf.tmp
/usr/bin/sh: ......binwin32-x86lemon.exe: command not found
make[4]: *** [../O.Common/snl.bnf] Error 127
make[4]: Leaving directory `c:/synApps_5_6/support/seq-2-1-3/src/snc/O.win32-x86'
make[3]: *** [install.win32-x86] Error 2
make[3]: Leaving directory `c:/synApps_5_6/support/seq-2-1-3/src/snc'
make[2]: *** [snc.install] Error 2
make[2]: Leaving directory `c:/synApps_5_6/support/seq-2-1-3/src'
make[1]: *** [src.install] Error 2
make[1]: Leaving directory `c:/synApps_5_6/support/seq-2-1-3'
make: *** [c:/synApps_5_6/support/seq-2-1-3.install] Error 2
make: Leaving directory `C:/synApps_5_6/support'

C:\synApps_5_6\support>


Does anyone have an idea what is happening here?

TIA,
--Josh

Replies:
Re: SynApps build error : win32-x86 J. Lewis Muir
RE: SynApps build error : win32-x86 Mark Rivers

Navigate by Date:
Prev: Re: Problems when download synApps IOC Dirk Zimoch
Next: Re: SynApps build error : win32-x86 J. Lewis Muir
Index: 1994  1995  1996  1997  1998  1999  2000  2001  2002  2003  2004  2005  2006  2007  2008  2009  2010  2011  <20122013  2014  2015  2016  2017  2018  2019 
Navigate by Thread:
Prev: Re: 回复: Re: Re: Problems when download synApps IOC Fabian S.
Next: Re: SynApps build error : win32-x86 J. Lewis Muir
Index: 1994  1995  1996  1997  1998  1999  2000  2001  2002  2003  2004  2005  2006  2007  2008  2009  2010  2011  <20122013  2014  2015  2016  2017  2018  2019 
ANJ, 18 Nov 2013 Valid HTML 4.01! · Home · News · About · Base · Modules · Extensions · Distributions · Download ·
· Search · EPICS V4 · IRMIS · Talk · Bugs · Documents · Links · Licensing ·