Argonne National Laboratory

Experimental Physics and
Industrial Control System

1994  1995  1996  1997  1998  1999  2000  2001  2002  2003  2004  2005  2006  2007  2008  2009  2010  2011  2012  2013  2014  2015  2016  2017  <20182019  Index 1994  1995  1996  1997  1998  1999  2000  2001  2002  2003  2004  2005  2006  2007  2008  2009  2010  2011  2012  2013  2014  2015  2016  2017  <20182019 
<== Date ==> <== Thread ==>

Subject: Re: Seq-2.2.5 compilation on windows
From: Mark Rivers <rivers@cars.uchicago.edu>
To: Vishnu Patel <vishnu.patel@rediffmail.com>, techtalk <tech-talk@aps.anl.gov>
Date: Fri, 19 Jan 2018 13:56:19 +0000
What version of Visual Studio are you using?


Mark



________________________________
From: tech-talk-bounces@aps.anl.gov <tech-talk-bounces@aps.anl.gov> on behalf of Vishnu Patel <vishnu.patel@rediffmail.com>
Sent: Friday, January 19, 2018 2:31 AM
To: techtalk
Subject: Seq-2.2.5 compilation on windows

Hi,
  I am trying to develop IOC with base-3.16.1, seq-2.2.5 and asyn4-32 on windows 10.
The epics base compiled , but while compiling seq-2.2.5, getting an error below.


 make[3]: Entering directory `c:/epics/modules/seq-2.2.5/src/lemon/O.win32-x86'
make[3]: Nothing to be done for `install'.
make[3]: Leaving directory `c:/epics/modules/seq-2.2.5/src/lemon/O.win32-x86'
make[2]: Leaving directory `c:/epics/modules/seq-2.2.5/src/lemon'
c:/GnuWin32/bin/make -C ./snc install
make[2]: Entering directory `c:/epics/modules/seq-2.2.5/src/snc'
c:/GnuWin32/bin/make -C O.win32-x86 -f ../Makefile TOP=../../.. \
            T_A=win32-x86 install
make[3]: Entering directory `c:/epics/modules/seq-2.2.5/src/snc/O.win32-x86'
cl               -nologo -D__STDC__=0 -D_CRT_SECURE_NO_DEPRECATE -D_CRT_NONSTDC_NO_DEPRECATE   -Ox -GL -Oy-   -W3        -MD -DEPICS_BUILD_DLL -DEPICS_CALL_DLL   -I. -I../O.Common -I. -I. -I.. -I../../../include/compiler/msvc -I../../../include/os/WIN32 -I../../../include -I../../../../../base-3.16.1/include/compiler/msvc -I../../../../../base-3.16.1/include/os/WIN32 -I../../../../../base-3.16.1/include        -c lexer.c
lexer.c
../snl.re(378): fatal error C1075: the left brace '{' was unmatched at the end of the file
make[3]: *** [lexer.obj] Error 2
make[3]: Leaving directory `c:/epics/modules/seq-2.2.5/src/snc/O.win32-x86'
make[2]: *** [install.win32-x86] Error 2
make[2]: Leaving directory `c:/epics/modules/seq-2.2.5/src/snc'
make[1]: *** [snc.install] Error 2
make[1]: Leaving directory `c:/epics/modules/seq-2.2.5/src'
make: *** [src.install] Error 2
make: Leaving directory `c:/epics/modules/seq-2.2.5'

c:\epics\modules\seq-2.2.5>


Thanks
Vishnu

Replies:
Re: Seq-2.2.5 compilation on windows Vishnu Patel
References:
Seq-2.2.5 compilation on windows Vishnu Patel

Navigate by Date:
Prev: Seq-2.2.5 compilation on windows Vishnu Patel
Next: Re: IOC crash Mark Rivers
Index: 1994  1995  1996  1997  1998  1999  2000  2001  2002  2003  2004  2005  2006  2007  2008  2009  2010  2011  2012  2013  2014  2015  2016  2017  <20182019 
Navigate by Thread:
Prev: Seq-2.2.5 compilation on windows Vishnu Patel
Next: Re: Seq-2.2.5 compilation on windows Vishnu Patel
Index: 1994  1995  1996  1997  1998  1999  2000  2001  2002  2003  2004  2005  2006  2007  2008  2009  2010  2011  2012  2013  2014  2015  2016  2017  <20182019 
ANJ, 19 Jan 2018 Valid HTML 4.01! · Home · News · About · Base · Modules · Extensions · Distributions · Download ·
· Search · EPICS V4 · IRMIS · Talk · Bugs · Documents · Links · Licensing ·