Argonne National Laboratory

Experimental Physics and
Industrial Control System

2002  2003  2004  2005  2006  2007  2008  2009  2010  2011  2012  2013  <20142015  2016  2017  2018  2019  2020  2021  2022  Index 2002  2003  2004  2005  2006  2007  2008  2009  2010  2011  2012  2013  <20142015  2016  2017  2018  2019  2020  2021  2022 
<== Date ==> <== Thread ==>

Subject: Build failed in Jenkins: epics-base-3.15-cyg64 #7
From: APS Jenkins <aps-jenkins@anl.gov>
To: core-talk@aps.anl.gov
Date: Wed, 22 Jan 2014 16:58:21 -0600 (CST)
See <https://jenkins.aps.anl.gov/job/epics-base-3.15-cyg64/7/>

------------------------------------------
[...truncated 39 lines...]
make -C ./tools install 
make[2]: Entering directory '/home/jenkins/workspace/epics-base-3.15-cyg64/src/tools'
perl -CSD ../../src/tools/makeMakefile.pl O.cygwin-x86_64 ../../..
mkdir O.Common
make -C O.cygwin-x86_64 -f ../Makefile TOP=../../.. T_A=cygwin-x86_64 install
make[3]: Entering directory '/home/jenkins/workspace/epics-base-3.15-cyg64/src/tools/O.cygwin-x86_64'
Installing PERL_MODULES file ../../../lib/perl/EPICS/Copy.pm
mkdir ../../../lib
mkdir ../../../lib/perl
mkdir ../../../lib/perl/EPICS
Installing PERL_MODULES file ../../../lib/perl/EPICS/Path.pm
Installing PERL_MODULES file ../../../lib/perl/EPICS/Release.pm
Installing PERL_MODULES file ../../../lib/perl/EPICS/Readfile.pm
Installing PERL_MODULES file ../../../lib/perl/EPICS/Getopts.pm
Installing PERL_MODULES file ../../../lib/perl/EPICS/macLib.pm
Installing PERL_MODULES file ../../../lib/perl/DBD.pm
Installing PERL_MODULES file ../../../lib/perl/DBD/Base.pm
mkdir ../../../lib/perl/DBD
Installing PERL_MODULES file ../../../lib/perl/DBD/Breaktable.pm
Installing PERL_MODULES file ../../../lib/perl/DBD/Device.pm
Installing PERL_MODULES file ../../../lib/perl/DBD/Driver.pm
Installing PERL_MODULES file ../../../lib/perl/DBD/Function.pm
Installing PERL_MODULES file ../../../lib/perl/DBD/Menu.pm
Installing PERL_MODULES file ../../../lib/perl/DBD/Output.pm
Installing PERL_MODULES file ../../../lib/perl/DBD/Parser.pm
Installing PERL_MODULES file ../../../lib/perl/DBD/Recfield.pm
Installing PERL_MODULES file ../../../lib/perl/DBD/Recordtype.pm
Installing PERL_MODULES file ../../../lib/perl/DBD/Registrar.pm
Installing PERL_MODULES file ../../../lib/perl/DBD/Variable.pm
Installing created executable ../../../bin/cygwin-x86_64/convertRelease.pl
mkdir ../../../bin
mkdir ../../../bin/cygwin-x86_64
Installing created executable ../../../bin/cygwin-x86_64/cvsclean.pl
Installing created executable ../../../bin/cygwin-x86_64/dos2unix.pl
Installing created executable ../../../bin/cygwin-x86_64/expandVars.pl
Installing created executable ../../../bin/cygwin-x86_64/fullPathName.pl
Installing created executable ../../../bin/cygwin-x86_64/installEpics.pl
Installing created executable ../../../bin/cygwin-x86_64/makeMakefile.pl
Installing created executable ../../../bin/cygwin-x86_64/makeTestfile.pl
Installing created executable ../../../bin/cygwin-x86_64/mkmf.pl
Installing created executable ../../../bin/cygwin-x86_64/munch.pl
Installing created executable ../../../bin/cygwin-x86_64/replaceVAR.pl
Installing created executable ../../../bin/cygwin-x86_64/useManifestTool.pl
Installing created executable ../../../bin/cygwin-x86_64/dbdToMenuH.pl
Installing created executable ../../../bin/cygwin-x86_64/dbdToRecordtypeH.pl
Installing created executable ../../../bin/cygwin-x86_64/dbdExpand.pl
Installing created executable ../../../bin/cygwin-x86_64/dbdToHtml.pl
Installing created executable ../../../bin/cygwin-x86_64/registerRecordDeviceDriver.pl
make[3]: Leaving directory '/home/jenkins/workspace/epics-base-3.15-cyg64/src/tools/O.cygwin-x86_64'
make[2]: Leaving directory '/home/jenkins/workspace/epics-base-3.15-cyg64/src/tools'
make -C tools/test install 
make[2]: Entering directory '/home/jenkins/workspace/epics-base-3.15-cyg64/src/tools/test'
perl -CSD ../../../bin/cygwin-x86_64/makeMakefile.pl O.cygwin-x86_64 ../../../..
mkdir O.Common
make -C O.cygwin-x86_64 -f ../Makefile TOP=../../../.. T_A=cygwin-x86_64 install
make[3]: Entering directory '/home/jenkins/workspace/epics-base-3.15-cyg64/src/tools/test/O.cygwin-x86_64'
cp ../Breaktable.plt Breaktable.t
cp ../DBD.plt DBD.t
cp ../Device.plt Device.t
cp ../Driver.plt Driver.t
cp ../Function.plt Function.t
cp ../macLib.plt macLib.t
cp ../Menu.plt Menu.t
cp ../Recfield.plt Recfield.t
cp ../Recordtype.plt Recordtype.t
cp ../Registrar.plt Registrar.t
cp ../Variable.plt Variable.t
make[3]: Leaving directory '/home/jenkins/workspace/epics-base-3.15-cyg64/src/tools/test/O.cygwin-x86_64'
make[2]: Leaving directory '/home/jenkins/workspace/epics-base-3.15-cyg64/src/tools/test'
make -C template/base install 
make[2]: Entering directory '/home/jenkins/workspace/epics-base-3.15-cyg64/src/template/base'
perl -CSD ../../../bin/cygwin-x86_64/makeMakefile.pl O.cygwin-x86_64 ../../../..
mkdir O.Common
make -C O.cygwin-x86_64 -f ../Makefile TOP=../../../.. T_A=cygwin-x86_64 install
make[3]: Entering directory '/home/jenkins/workspace/epics-base-3.15-cyg64/src/template/base/O.cygwin-x86_64'
Installing created executable ../../../../bin/cygwin-x86_64/makeBaseApp.pl
Installing ../../../../templates/makeBaseApp/top/Makefile
mkdir ../../../../templates
mkdir ../../../../templates/makeBaseApp
mkdir ../../../../templates/makeBaseApp/top
Installing ../../../../templates/makeBaseApp/top/configure/CONFIG
mkdir ../../../../templates/makeBaseApp/top/configure
Installing ../../../../templates/makeBaseApp/top/configure/CONFIG_SITE
Installing ../../../../templates/makeBaseApp/top/configure/Makefile
Installing ../../../../templates/makeBaseApp/top/configure/RELEASE
Installing ../../../../templates/makeBaseApp/top/configure/RULES
Installing ../../../../templates/makeBaseApp/top/configure/RULES.ioc
Installing ../../../../templates/makeBaseApp/top/configure/RULES_DIRS
Installing ../../../../templates/makeBaseApp/top/configure/RULES_TOP
Installing ../../../../templates/makeBaseApp/top/supportApp/Makefile
mkdir ../../../../templates/makeBaseApp/top/supportApp
Installing ../../../../templates/makeBaseApp/top/supportApp/Db/Makefile
mkdir ../../../../templates/makeBaseApp/top/supportApp/Db
Installing ../../../../templates/makeBaseApp/top/supportApp/src/Makefile
mkdir ../../../../templates/makeBaseApp/top/supportApp/src
Installing ../../../../templates/makeBaseApp/top/supportApp/src/_APPNAME_.dbd
Installing ../../../../templates/makeBaseApp/top/iocApp/Makefile
mkdir ../../../../templates/makeBaseApp/top/iocApp
Installing ../../../../templates/makeBaseApp/top/iocApp/Db/Makefile
mkdir ../../../../templates/makeBaseApp/top/iocApp/Db
Installing ../../../../templates/makeBaseApp/top/iocApp/src/Makefile
mkdir ../../../../templates/makeBaseApp/top/iocApp/src
Installing ../../../../templates/makeBaseApp/top/iocApp/src/_APPNAME_Main.cpp
Installing ../../../../templates/makeBaseApp/top/exampleApp/Makefile
mkdir ../../../../templates/makeBaseApp/top/exampleApp
Installing ../../../../templates/makeBaseApp/top/exampleApp/Db/Makefile
mkdir ../../../../templates/makeBaseApp/top/exampleApp/Db
Installing ../../../../templates/makeBaseApp/top/exampleApp/Db/dbExample1.db
Installing ../../../../templates/makeBaseApp/top/exampleApp/Db/dbExample2.db
Installing ../../../../templates/makeBaseApp/top/exampleApp/Db/dbSubExample.db
Installing ../../../../templates/makeBaseApp/top/exampleApp/Db/user.substitutions
Installing ../../../../templates/makeBaseApp/top/exampleApp/Db/userHost.substitutions
Installing ../../../../templates/makeBaseApp/top/exampleApp/src/Makefile
mkdir ../../../../templates/makeBaseApp/top/exampleApp/src
Installing ../../../../templates/makeBaseApp/top/exampleApp/src/xxxRecord.dbd
Installing ../../../../templates/makeBaseApp/top/exampleApp/src/xxxRecord.c
Installing ../../../../templates/makeBaseApp/top/exampleApp/src/devXxxSoft.c
Installing ../../../../templates/makeBaseApp/top/exampleApp/src/xxxSupport.dbd
Installing ../../../../templates/makeBaseApp/top/exampleApp/src/sncExample.stt
Installing ../../../../templates/makeBaseApp/top/exampleApp/src/sncProgram.st
Installing ../../../../templates/makeBaseApp/top/exampleApp/src/sncExample.dbd
Installing ../../../../templates/makeBaseApp/top/exampleApp/src/dbSubExample.c
Installing ../../../../templates/makeBaseApp/top/exampleApp/src/dbSubExample.dbd
Installing ../../../../templates/makeBaseApp/top/exampleApp/src/_APPNAME_Main.cpp
Installing ../../../../templates/makeBaseApp/top/exampleApp/src/_APPNAME_Hello.c
Installing ../../../../templates/makeBaseApp/top/exampleApp/src/_APPNAME_Hello.dbd
Installing ../../../../templates/makeBaseApp/top/exampleApp/src/initTrace.c
Installing ../../../../templates/makeBaseApp/top/exampleApp/src/initTrace.dbd
Installing ../../../../templates/makeBaseApp/top/exampleBoot/Makefile
mkdir ../../../../templates/makeBaseApp/top/exampleBoot
Installing ../../../../templates/makeBaseApp/top/exampleBoot/nfsCommands@vxWorks
Installing ../../../../templates/makeBaseApp/top/exampleBoot/nfsCommands@RTEMS
Installing ../../../../templates/makeBaseApp/top/exampleBoot/ioc/Makefile@Common
mkdir ../../../../templates/makeBaseApp/top/exampleBoot/ioc
Installing ../../../../templates/makeBaseApp/top/exampleBoot/ioc/Makefile@vxWorks
Installing ../../../../templates/makeBaseApp/top/exampleBoot/ioc/Makefile@win32
Installing ../../../../templates/makeBaseApp/top/exampleBoot/ioc/st.cmd@Common
Installing ../../../../templates/makeBaseApp/top/exampleBoot/ioc/st.cmd@vxWorks
Installing ../../../../templates/makeBaseApp/top/exampleBoot/ioc/st.cmd@RTEMS
Installing ../../../../templates/makeBaseApp/top/exampleBoot/ioc/README@Common
Installing ../../../../templates/makeBaseApp/top/exampleBoot/ioc/README@vxWorks
Installing ../../../../templates/makeBaseApp/top/caClientApp/Makefile
mkdir ../../../../templates/makeBaseApp/top/caClientApp
Installing ../../../../templates/makeBaseApp/top/caClientApp/caExample.c
Installing ../../../../templates/makeBaseApp/top/caClientApp/caMonitor.c
Installing ../../../../templates/makeBaseApp/top/caServerApp/Makefile
mkdir ../../../../templates/makeBaseApp/top/caServerApp
Installing ../../../../templates/makeBaseApp/top/caServerApp/README
Installing ../../../../templates/makeBaseApp/top/caServerApp/exAsyncPV.cc
Installing ../../../../templates/makeBaseApp/top/caServerApp/exChannel.cc
Installing ../../../../templates/makeBaseApp/top/caServerApp/exPV.cc
Installing ../../../../templates/makeBaseApp/top/caServerApp/exScalarPV.cc
Installing ../../../../templates/makeBaseApp/top/caServerApp/exServer.cc
Installing ../../../../templates/makeBaseApp/top/caServerApp/exServer.h
Installing ../../../../templates/makeBaseApp/top/caServerApp/exVectorPV.cc
Installing ../../../../templates/makeBaseApp/top/caServerApp/main.cc
Installing ../../../../templates/makeBaseApp/top/caServerApp/test.adl
Installing ../../../../templates/makeBaseApp/top/caServerApp/vxEntry.cc
Installing ../../../../templates/makeBaseApp/top/iocBoot/Makefile
mkdir ../../../../templates/makeBaseApp/top/iocBoot
Installing ../../../../templates/makeBaseApp/top/iocBoot/nfsCommands@vxWorks
Installing ../../../../templates/makeBaseApp/top/iocBoot/nfsCommands@RTEMS
Installing ../../../../templates/makeBaseApp/top/iocBoot/ioc/Makefile@Common
mkdir ../../../../templates/makeBaseApp/top/iocBoot/ioc
Installing ../../../../templates/makeBaseApp/top/iocBoot/ioc/Makefile@vxWorks
Installing ../../../../templates/makeBaseApp/top/iocBoot/ioc/Makefile@win32
Installing ../../../../templates/makeBaseApp/top/iocBoot/ioc/st.cmd@Common
Installing ../../../../templates/makeBaseApp/top/iocBoot/ioc/st.cmd@Cross
Installing ../../../../templates/makeBaseApp/top/iocBoot/ioc/st.cmd@vxWorks
Installing ../../../../templates/makeBaseApp/top/iocBoot/ioc/st.cmd@RTEMS
make[3]: Leaving directory '/home/jenkins/workspace/epics-base-3.15-cyg64/src/template/base/O.cygwin-x86_64'
make[2]: Leaving directory '/home/jenkins/workspace/epics-base-3.15-cyg64/src/template/base'
make -C template/ext install 
make[2]: Entering directory '/home/jenkins/workspace/epics-base-3.15-cyg64/src/template/ext'
perl -CSD ../../../bin/cygwin-x86_64/makeMakefile.pl O.cygwin-x86_64 ../../../..
mkdir O.Common
make -C O.cygwin-x86_64 -f ../Makefile TOP=../../../.. T_A=cygwin-x86_64 install
make[3]: Entering directory '/home/jenkins/workspace/epics-base-3.15-cyg64/src/template/ext/O.cygwin-x86_64'
Installing created executable ../../../../bin/cygwin-x86_64/makeBaseExt.pl
Installing ../../../../templates/makeBaseExt/top/Makefile
mkdir ../../../../templates/makeBaseExt
mkdir ../../../../templates/makeBaseExt/top
Installing ../../../../templates/makeBaseExt/top/README
Installing ../../../../templates/makeBaseExt/top/configure/CONFIG
mkdir ../../../../templates/makeBaseExt/top/configure
Installing ../../../../templates/makeBaseExt/top/configure/CONFIG_SITE
Installing ../../../../templates/makeBaseExt/top/configure/Makefile
Installing ../../../../templates/makeBaseExt/top/configure/RELEASE
Installing ../../../../templates/makeBaseExt/top/configure/RULES
Installing ../../../../templates/makeBaseExt/top/configure/RULES_DIRS
Installing ../../../../templates/makeBaseExt/top/configure/RULES_TOP
Installing ../../../../templates/makeBaseExt/top/configure/RULES_PYTHON
Installing ../../../../templates/makeBaseExt/top/configure/RULES_IDL
Installing ../../../../templates/makeBaseExt/top/configure/os/CONFIG_SITE.aix-ppc.aix-ppc
mkdir ../../../../templates/makeBaseExt/top/configure/os
Installing ../../../../templates/makeBaseExt/top/configure/os/CONFIG_SITE.solaris-sparc64-gnu.solaris-sparc64-gnu
Installing ../../../../templates/makeBaseExt/top/configure/os/CONFIG_SITE.freebsd-x86_64.freebsd-x86_64
Installing ../../../../templates/makeBaseExt/top/configure/os/CONFIG_SITE.darwin-x86.darwin-x86
Installing ../../../../templates/makeBaseExt/top/configure/os/CONFIG.linux-x86.linux-386
Installing ../../../../templates/makeBaseExt/top/configure/os/CONFIG_SITE.cygwin-x86.cygwin-x86
Installing ../../../../templates/makeBaseExt/top/configure/os/CONFIG_SITE.solaris-x86_64.solaris-x86_64
Installing ../../../../templates/makeBaseExt/top/configure/os/CONFIG_SITE.linux-ppc.linux-ppc
Installing ../../../../templates/makeBaseExt/top/configure/os/CONFIG_SITE.solaris-sparc-debug.solaris-sparc-debug
Installing ../../../../templates/makeBaseExt/top/configure/os/CONFIG_SITE.windows-x64.windows-x64
Installing ../../../../templates/makeBaseExt/top/configure/os/CONFIG_SITE.win32-x86-debug.win32-x86-debug
Installing ../../../../templates/makeBaseExt/top/configure/os/CONFIG_SITE.solaris-sparc.solaris-sparc
Installing ../../../../templates/makeBaseExt/top/configure/os/CONFIG_SITE.win32-x86.win32-x86
Installing ../../../../templates/makeBaseExt/top/configure/os/CONFIG_SITE.linux-x86-debug.linux-x86-debug
Installing ../../../../templates/makeBaseExt/top/configure/os/CONFIG_SITE.win32-x86-cygwin.win32-x86-cygwin
Installing ../../../../templates/makeBaseExt/top/configure/os/CONFIG_SITE.linux-x86.linux-x86
Installing ../../../../templates/makeBaseExt/top/configure/os/CONFIG_SITE.solaris-sparc64.solaris-sparc64
Installing ../../../../templates/makeBaseExt/top/configure/os/CONFIG_SITE.solaris-sparc-gnu.solaris-sparc-gnu
Installing ../../../../templates/makeBaseExt/top/configure/os/CONFIG_SITE.darwin-ppcx86.darwin-ppcx86
Installing ../../../../templates/makeBaseExt/top/configure/os/CONFIG_SITE.Common.Common
Installing ../../../../templates/makeBaseExt/top/configure/os/CONFIG_SITE.solaris-x86-debug.solaris-x86-debug
Installing ../../../../templates/makeBaseExt/top/configure/os/CONFIG_SITE.linux-x86.linux-athlon
Installing ../../../../templates/makeBaseExt/top/configure/os/CONFIG_SITE.solaris-x86.solaris-x86
Installing ../../../../templates/makeBaseExt/top/configure/os/CONFIG_SITE.solaris-x86-gnu.solaris-x86-gnu
Installing ../../../../templates/makeBaseExt/top/configure/os/CONFIG_SITE.aix-ppc-gnu.aix-ppc-gnu
Installing ../../../../templates/makeBaseExt/top/configure/os/CONFIG_SITE.linux-x86_64-debug.linux-x86_64-debug
Installing ../../../../templates/makeBaseExt/top/configure/os/CONFIG_SITE.win32-x86-mingw.win32-x86-mingw
Installing ../../../../templates/makeBaseExt/top/configure/os/CONFIG_SITE.linux-x86_64.linux-x86_64
Installing ../../../../templates/makeBaseExt/top/configure/os/CONFIG_SITE.darwin-ppc.darwin-ppc
Installing ../../../../templates/makeBaseExt/top/src/Makefile
mkdir ../../../../templates/makeBaseExt/top/src
Installing ../../../../templates/makeBaseExt/top/exampleExt/Makefile
mkdir ../../../../templates/makeBaseExt/top/exampleExt
Installing ../../../../templates/makeBaseExt/top/exampleExt/caExample.c
Installing ../../../../templates/makeBaseExt/top/exampleExt/RELEASE_NOTES.HTM
Installing ../../../../templates/makeBaseExt/top/simpleExt/Makefile
mkdir ../../../../templates/makeBaseExt/top/simpleExt
make[3]: Leaving directory '/home/jenkins/workspace/epics-base-3.15-cyg64/src/template/ext/O.cygwin-x86_64'
make[2]: Leaving directory '/home/jenkins/workspace/epics-base-3.15-cyg64/src/template/ext'
make -C ./libCom install 
make[2]: Entering directory '/home/jenkins/workspace/epics-base-3.15-cyg64/src/libCom'
mkdir O.Common
make -C O.cygwin-x86_64 -f ../Makefile TOP=../../.. T_A=cygwin-x86_64 install
make[3]: Entering directory '/home/jenkins/workspace/epics-base-3.15-cyg64/src/libCom'
make[3]: *** O.cygwin-x86_64: Permission denied.  Stop.
make[3]: Leaving directory '/home/jenkins/workspace/epics-base-3.15-cyg64/src/libCom'
../../configure/RULES_ARCHS:65: recipe for target 'install.cygwin-x86_64' failed
make[2]: *** [install.cygwin-x86_64] Error 2
make[2]: Leaving directory '/home/jenkins/workspace/epics-base-3.15-cyg64/src/libCom'
../configure/RULES_DIRS:72: recipe for target 'libCom.install' failed
make[1]: *** [libCom.install] Error 2
make[1]: Leaving directory '/home/jenkins/workspace/epics-base-3.15-cyg64/src'
configure/RULES_DIRS:72: recipe for target 'src.install' failed
make: *** [src.install] Error 2
Build step 'Execute shell' marked build as failure

Replies:
Jenkins build is back to normal : epics-base-3.15-cyg64 #8 APS Jenkins
References:
Build failed in Jenkins: epics-base-3.15-cyg64 #6 APS Jenkins

Navigate by Date:
Prev: Build failed in Jenkins: epics-base-3.15-cyg64 #6 APS Jenkins
Next: Jenkins build is back to normal : epics-base-3.15-cyg64 #8 APS Jenkins
Index: 2002  2003  2004  2005  2006  2007  2008  2009  2010  2011  2012  2013  <20142015  2016  2017  2018  2019  2020  2021  2022 
Navigate by Thread:
Prev: Build failed in Jenkins: epics-base-3.15-cyg64 #6 APS Jenkins
Next: Jenkins build is back to normal : epics-base-3.15-cyg64 #8 APS Jenkins
Index: 2002  2003  2004  2005  2006  2007  2008  2009  2010  2011  2012  2013  <20142015  2016  2017  2018  2019  2020  2021  2022 
ANJ, 16 May 2014 Valid HTML 4.01! · Home · News · About · Base · Modules · Extensions · Distributions · Download ·
· Search · EPICS V4 · IRMIS · Talk · Bugs · Documents · Links · Licensing ·