Argonne National Laboratory

Experimental Physics and
Industrial Control System

2002  2003  2004  2005  2006  2007  2008  2009  2010  2011  2012  2013  2014  <20152016  2017  2018  Index 2002  2003  2004  2005  2006  2007  2008  2009  2010  2011  2012  2013  2014  <20152016  2017  2018 
<== Date ==> <== Thread ==>

Subject: Build failed in Jenkins: epics-base-3.14 #130
From: APS Jenkins <aps-jenkins@anl.gov>
To: core-talk@aps.anl.gov
Date: Tue, 24 Mar 2015 09:27:41 -0500 (CDT)
See <https://jenkins.aps.anl.gov/job/epics-base-3.14/130/changes>

Changes:

[Janet Anderson] Set version number to R3.14.12.5.

------------------------------------------
[...truncated 11 lines...]
[workspace] $ bzr revert
$ bzr revision-info -d <https://jenkins.aps.anl.gov/job/epics-base-3.14/ws/>
info result: bzr revision-info -d <https://jenkins.aps.anl.gov/job/epics-base-3.14/ws/> returned 0. Command output: "12579 jba@aps.anl.gov-20150324135039-eajby0sofkobqdy3
" stderr: ""
[workspace] $ bzr log -v -r revid:anj@aps.anl.gov-20150323205911-dkynf22sco7mzrnx..revid:jba@aps.anl.gov-20150324135039-eajby0sofkobqdy3 --long --show-ids
Getting local revision...
$ bzr revision-info -d <https://jenkins.aps.anl.gov/job/epics-base-3.14/ws/>
info result: bzr revision-info -d <https://jenkins.aps.anl.gov/job/epics-base-3.14/ws/> returned 0. Command output: "12579 jba@aps.anl.gov-20150324135039-eajby0sofkobqdy3
" stderr: ""
RevisionState revno:12579 revid:jba@aps.anl.gov-20150324135039-eajby0sofkobqdy3
[workspace] $ /bin/sh -xe /tmp/hudson3301769216690548232.sh
+ make linux-x86_64
make -C ./configure linux-x86_64 
make[1]: Entering directory `/Jenkins/jenkins/jobs/epics-base-3.14/workspace/configure'
perl ../src/tools/makeMakefile.pl O.linux-x86_64 ../..
mkdir O.Common
make -C O.linux-x86_64 -f ../Makefile TOP=../.. T_A=linux-x86_64
make[2]: Entering directory `/Jenkins/jenkins/jobs/epics-base-3.14/workspace/configure/O.linux-x86_64'
make[2]: Nothing to be done for `all'.
make[2]: Leaving directory `/Jenkins/jenkins/jobs/epics-base-3.14/workspace/configure/O.linux-x86_64'
make[1]: Leaving directory `/Jenkins/jenkins/jobs/epics-base-3.14/workspace/configure'
make -C ./src linux-x86_64 
make[1]: Entering directory `/Jenkins/jenkins/jobs/epics-base-3.14/workspace/src'
make -C ./tools linux-x86_64 
make[2]: Entering directory `/Jenkins/jenkins/jobs/epics-base-3.14/workspace/src/tools'
perl ../../src/tools/makeMakefile.pl O.linux-x86_64 ../../..
mkdir O.Common
make -C O.linux-x86_64 -f ../Makefile TOP=../../.. T_A=linux-x86_64
make[3]: Entering directory `/Jenkins/jenkins/jobs/epics-base-3.14/workspace/src/tools/O.linux-x86_64'
Installing PERL_MODULES file ../../../lib/perl/EPICS/Copy.pm
mkdir ../../../lib
mkdir ../../../lib/perl
mkdir ../../../lib/perl/EPICS
Installing PERL_MODULES file ../../../lib/perl/EPICS/Path.pm
Installing PERL_MODULES file ../../../lib/perl/EPICS/Release.pm
Installing PERL_MODULES file ../../../lib/perl/EPICS/Getopts.pm
Installing script ../../../bin/linux-x86_64/convertRelease.pl
mkdir ../../../bin
mkdir ../../../bin/linux-x86_64
Installing script ../../../bin/linux-x86_64/cvsclean.pl
Installing script ../../../bin/linux-x86_64/dos2unix.pl
Installing script ../../../bin/linux-x86_64/expandVars.pl
Installing script ../../../bin/linux-x86_64/filterWarnings.pl
Installing script ../../../bin/linux-x86_64/fullPathName.pl
Installing script ../../../bin/linux-x86_64/installEpics.pl
Installing script ../../../bin/linux-x86_64/makeIncludeDbd.pl
Installing script ../../../bin/linux-x86_64/makeMakefile.pl
Installing script ../../../bin/linux-x86_64/makeTestfile.pl
Installing script ../../../bin/linux-x86_64/mkmf.pl
Installing script ../../../bin/linux-x86_64/munch.pl
Installing script ../../../bin/linux-x86_64/replaceVAR.pl
Installing script ../../../bin/linux-x86_64/useManifestTool.pl
make[3]: Leaving directory `/Jenkins/jenkins/jobs/epics-base-3.14/workspace/src/tools/O.linux-x86_64'
make[2]: Leaving directory `/Jenkins/jenkins/jobs/epics-base-3.14/workspace/src/tools'
make -C ./makeBaseApp linux-x86_64 
make[2]: Entering directory `/Jenkins/jenkins/jobs/epics-base-3.14/workspace/src/makeBaseApp'
perl ../../bin/linux-x86_64/makeMakefile.pl O.linux-x86_64 ../../..
mkdir O.Common
make -C O.linux-x86_64 -f ../Makefile TOP=../../.. T_A=linux-x86_64
make[3]: Entering directory `/Jenkins/jenkins/jobs/epics-base-3.14/workspace/src/makeBaseApp/O.linux-x86_64'
Installing script ../../../bin/linux-x86_64/makeBaseApp.pl
Installing ../../../templates/makeBaseApp/top/Makefile
mkdir ../../../templates
mkdir ../../../templates/makeBaseApp
mkdir ../../../templates/makeBaseApp/top
Installing ../../../templates/makeBaseApp/top/configure/CONFIG
mkdir ../../../templates/makeBaseApp/top/configure
Installing ../../../templates/makeBaseApp/top/configure/CONFIG_SITE
Installing ../../../templates/makeBaseApp/top/configure/Makefile
Installing ../../../templates/makeBaseApp/top/configure/RELEASE
Installing ../../../templates/makeBaseApp/top/configure/RULES
Installing ../../../templates/makeBaseApp/top/configure/RULES.ioc
Installing ../../../templates/makeBaseApp/top/configure/RULES_DIRS
Installing ../../../templates/makeBaseApp/top/configure/RULES_TOP
Installing ../../../templates/makeBaseApp/top/supportApp/Makefile
mkdir ../../../templates/makeBaseApp/top/supportApp
Installing ../../../templates/makeBaseApp/top/supportApp/Db/Makefile
mkdir ../../../templates/makeBaseApp/top/supportApp/Db
Installing ../../../templates/makeBaseApp/top/supportApp/src/Makefile
mkdir ../../../templates/makeBaseApp/top/supportApp/src
Installing ../../../templates/makeBaseApp/top/supportApp/src/_APPNAME_.dbd
Installing ../../../templates/makeBaseApp/top/iocApp/Makefile
mkdir ../../../templates/makeBaseApp/top/iocApp
Installing ../../../templates/makeBaseApp/top/iocApp/Db/Makefile
mkdir ../../../templates/makeBaseApp/top/iocApp/Db
Installing ../../../templates/makeBaseApp/top/iocApp/src/Makefile
mkdir ../../../templates/makeBaseApp/top/iocApp/src
Installing ../../../templates/makeBaseApp/top/iocApp/src/_APPNAME_Main.cpp
Installing ../../../templates/makeBaseApp/top/exampleApp/Makefile
mkdir ../../../templates/makeBaseApp/top/exampleApp
Installing ../../../templates/makeBaseApp/top/exampleApp/Db/Makefile
mkdir ../../../templates/makeBaseApp/top/exampleApp/Db
Installing ../../../templates/makeBaseApp/top/exampleApp/Db/dbExample1.db
Installing ../../../templates/makeBaseApp/top/exampleApp/Db/dbExample2.db
Installing ../../../templates/makeBaseApp/top/exampleApp/Db/dbSubExample.db
Installing ../../../templates/makeBaseApp/top/exampleApp/Db/user.substitutions
Installing ../../../templates/makeBaseApp/top/exampleApp/Db/userHost.substitutions
Installing ../../../templates/makeBaseApp/top/exampleApp/src/Makefile
mkdir ../../../templates/makeBaseApp/top/exampleApp/src
Installing ../../../templates/makeBaseApp/top/exampleApp/src/xxxRecord.dbd
Installing ../../../templates/makeBaseApp/top/exampleApp/src/xxxRecord.c
Installing ../../../templates/makeBaseApp/top/exampleApp/src/devXxxSoft.c
Installing ../../../templates/makeBaseApp/top/exampleApp/src/xxxSupport.dbd
Installing ../../../templates/makeBaseApp/top/exampleApp/src/sncExample.stt
Installing ../../../templates/makeBaseApp/top/exampleApp/src/sncProgram.st
Installing ../../../templates/makeBaseApp/top/exampleApp/src/sncExample.dbd
Installing ../../../templates/makeBaseApp/top/exampleApp/src/dbSubExample.c
Installing ../../../templates/makeBaseApp/top/exampleApp/src/dbSubExample.dbd
Installing ../../../templates/makeBaseApp/top/exampleApp/src/_APPNAME_Main.cpp
Installing ../../../templates/makeBaseApp/top/exampleApp/src/_APPNAME_Hello.c
Installing ../../../templates/makeBaseApp/top/exampleApp/src/_APPNAME_Hello.dbd
Installing ../../../templates/makeBaseApp/top/exampleApp/src/initTrace.c
Installing ../../../templates/makeBaseApp/top/exampleApp/src/initTrace.dbd
Installing ../../../templates/makeBaseApp/top/exampleBoot/Makefile
mkdir ../../../templates/makeBaseApp/top/exampleBoot
Installing ../../../templates/makeBaseApp/top/exampleBoot/nfsCommands@vxWorks
Installing ../../../templates/makeBaseApp/top/exampleBoot/nfsCommands@RTEMS
Installing ../../../templates/makeBaseApp/top/exampleBoot/ioc/Makefile@Common
mkdir ../../../templates/makeBaseApp/top/exampleBoot/ioc
Installing ../../../templates/makeBaseApp/top/exampleBoot/ioc/Makefile@vxWorks
Installing ../../../templates/makeBaseApp/top/exampleBoot/ioc/Makefile@win32
Installing ../../../templates/makeBaseApp/top/exampleBoot/ioc/Makefile@windows
Installing ../../../templates/makeBaseApp/top/exampleBoot/ioc/Makefile@cygwin
Installing ../../../templates/makeBaseApp/top/exampleBoot/ioc/st.cmd@Common
Installing ../../../templates/makeBaseApp/top/exampleBoot/ioc/st.cmd@vxWorks
Installing ../../../templates/makeBaseApp/top/exampleBoot/ioc/st.cmd@RTEMS
Installing ../../../templates/makeBaseApp/top/exampleBoot/ioc/README@Common
Installing ../../../templates/makeBaseApp/top/exampleBoot/ioc/README@vxWorks
Installing ../../../templates/makeBaseApp/top/caClientApp/Makefile
mkdir ../../../templates/makeBaseApp/top/caClientApp
Installing ../../../templates/makeBaseApp/top/caClientApp/caExample.c
Installing ../../../templates/makeBaseApp/top/caClientApp/caMonitor.c
Installing ../../../templates/makeBaseApp/top/caServerApp/Makefile
mkdir ../../../templates/makeBaseApp/top/caServerApp
Installing ../../../templates/makeBaseApp/top/caServerApp/README
Installing ../../../templates/makeBaseApp/top/caServerApp/exAsyncPV.cc
Installing ../../../templates/makeBaseApp/top/caServerApp/exChannel.cc
Installing ../../../templates/makeBaseApp/top/caServerApp/exPV.cc
Installing ../../../templates/makeBaseApp/top/caServerApp/exScalarPV.cc
Installing ../../../templates/makeBaseApp/top/caServerApp/exServer.cc
Installing ../../../templates/makeBaseApp/top/caServerApp/exServer.h
Installing ../../../templates/makeBaseApp/top/caServerApp/exVectorPV.cc
Installing ../../../templates/makeBaseApp/top/caServerApp/main.cc
Installing ../../../templates/makeBaseApp/top/caServerApp/test.adl
Installing ../../../templates/makeBaseApp/top/caServerApp/vxEntry.cc
Installing ../../../templates/makeBaseApp/top/iocBoot/Makefile
mkdir ../../../templates/makeBaseApp/top/iocBoot
Installing ../../../templates/makeBaseApp/top/iocBoot/nfsCommands@vxWorks
Installing ../../../templates/makeBaseApp/top/iocBoot/nfsCommands@RTEMS
Installing ../../../templates/makeBaseApp/top/iocBoot/ioc/Makefile@Common
mkdir ../../../templates/makeBaseApp/top/iocBoot/ioc
Installing ../../../templates/makeBaseApp/top/iocBoot/ioc/Makefile@vxWorks
Installing ../../../templates/makeBaseApp/top/iocBoot/ioc/Makefile@win32
Installing ../../../templates/makeBaseApp/top/iocBoot/ioc/Makefile@windows
Installing ../../../templates/makeBaseApp/top/iocBoot/ioc/Makefile@cygwin
Installing ../../../templates/makeBaseApp/top/iocBoot/ioc/st.cmd@Common
Installing ../../../templates/makeBaseApp/top/iocBoot/ioc/st.cmd@Cross
Installing ../../../templates/makeBaseApp/top/iocBoot/ioc/st.cmd@vxWorks
Installing ../../../templates/makeBaseApp/top/iocBoot/ioc/st.cmd@RTEMS
make[3]: Leaving directory `/Jenkins/jenkins/jobs/epics-base-3.14/workspace/src/makeBaseApp/O.linux-x86_64'
make[2]: Leaving directory `/Jenkins/jenkins/jobs/epics-base-3.14/workspace/src/makeBaseApp'
make -C ./makeBaseExt linux-x86_64 
make[2]: Entering directory `/Jenkins/jenkins/jobs/epics-base-3.14/workspace/src/makeBaseExt'
perl ../../bin/linux-x86_64/makeMakefile.pl O.linux-x86_64 ../../..
mkdir O.Common
make -C O.linux-x86_64 -f ../Makefile TOP=../../.. T_A=linux-x86_64
make[3]: Entering directory `/Jenkins/jenkins/jobs/epics-base-3.14/workspace/src/makeBaseExt/O.linux-x86_64'
Installing script ../../../bin/linux-x86_64/makeBaseExt.pl
Installing ../../../templates/makeBaseExt/top/Makefile
mkdir ../../../templates/makeBaseExt
mkdir ../../../templates/makeBaseExt/top
Installing ../../../templates/makeBaseExt/top/README
Installing ../../../templates/makeBaseExt/top/configure/CONFIG
mkdir ../../../templates/makeBaseExt/top/configure
Installing ../../../templates/makeBaseExt/top/configure/CONFIG_SITE
Installing ../../../templates/makeBaseExt/top/configure/Makefile
Installing ../../../templates/makeBaseExt/top/configure/RELEASE
Installing ../../../templates/makeBaseExt/top/configure/RULES
Installing ../../../templates/makeBaseExt/top/configure/RULES_DIRS
Installing ../../../templates/makeBaseExt/top/configure/RULES_TOP
Installing ../../../templates/makeBaseExt/top/configure/RULES_PYTHON
Installing ../../../templates/makeBaseExt/top/configure/RULES_IDL
Installing ../../../templates/makeBaseExt/top/configure/os/CONFIG.linux-x86.linux-386
mkdir ../../../templates/makeBaseExt/top/configure/os
Installing ../../../templates/makeBaseExt/top/configure/os/CONFIG_SITE.aix-ppc.aix-ppc
Installing ../../../templates/makeBaseExt/top/configure/os/CONFIG_SITE.aix-ppc-gnu.aix-ppc-gnu
Installing ../../../templates/makeBaseExt/top/configure/os/CONFIG_SITE.Common.Common
Installing ../../../templates/makeBaseExt/top/configure/os/CONFIG_SITE.cygwin-x86.cygwin-x86
Installing ../../../templates/makeBaseExt/top/configure/os/CONFIG_SITE.darwin-ppc.darwin-ppc
Installing ../../../templates/makeBaseExt/top/configure/os/CONFIG_SITE.darwin-ppcx86.darwin-ppcx86
Installing ../../../templates/makeBaseExt/top/configure/os/CONFIG_SITE.darwin-x86.darwin-x86
Installing ../../../templates/makeBaseExt/top/configure/os/CONFIG_SITE.freebsd-x86_64.freebsd-x86_64
Installing ../../../templates/makeBaseExt/top/configure/os/CONFIG_SITE.hpux-parisc-gnu.hpux-parisc-gnu
Installing ../../../templates/makeBaseExt/top/configure/os/CONFIG_SITE.hpux-parisc.hpux-parisc
Installing ../../../templates/makeBaseExt/top/configure/os/CONFIG_SITE.interix-x86.interix-x86
Installing ../../../templates/makeBaseExt/top/configure/os/CONFIG_SITE.linux-ppc.linux-ppc
Installing ../../../templates/makeBaseExt/top/configure/os/CONFIG_SITE.linux-x86_64-debug.linux-x86_64-debug
Installing ../../../templates/makeBaseExt/top/configure/os/CONFIG_SITE.linux-x86_64.linux-x86_64
Installing ../../../templates/makeBaseExt/top/configure/os/CONFIG_SITE.linux-x86-borland.linux-x86-borland
Installing ../../../templates/makeBaseExt/top/configure/os/CONFIG_SITE.linux-x86-debug.linux-x86-debug
Installing ../../../templates/makeBaseExt/top/configure/os/CONFIG_SITE.linux-x86.linux-athlon
Installing ../../../templates/makeBaseExt/top/configure/os/CONFIG_SITE.linux-x86.linux-x86
Installing ../../../templates/makeBaseExt/top/configure/os/CONFIG_SITE.solaris-sparc64-gnu.solaris-sparc64-gnu
Installing ../../../templates/makeBaseExt/top/configure/os/CONFIG_SITE.solaris-sparc64.solaris-sparc64
Installing ../../../templates/makeBaseExt/top/configure/os/CONFIG_SITE.solaris-sparc-debug.solaris-sparc-debug
Installing ../../../templates/makeBaseExt/top/configure/os/CONFIG_SITE.solaris-sparc-gnu.solaris-sparc-gnu
Installing ../../../templates/makeBaseExt/top/configure/os/CONFIG_SITE.solaris-sparc.solaris-sparc
Installing ../../../templates/makeBaseExt/top/configure/os/CONFIG_SITE.solaris-x86_64.solaris-x86_64
Installing ../../../templates/makeBaseExt/top/configure/os/CONFIG_SITE.solaris-x86-debug.solaris-x86-debug
Installing ../../../templates/makeBaseExt/top/configure/os/CONFIG_SITE.solaris-x86-gnu.solaris-x86-gnu
Installing ../../../templates/makeBaseExt/top/configure/os/CONFIG_SITE.solaris-x86.solaris-x86
Installing ../../../templates/makeBaseExt/top/configure/os/CONFIG_SITE.win32-x86-borland.win32-x86-borland
Installing ../../../templates/makeBaseExt/top/configure/os/CONFIG_SITE.win32-x86-cygwin.win32-x86-cygwin
Installing ../../../templates/makeBaseExt/top/configure/os/CONFIG_SITE.win32-x86-debug.win32-x86-debug
Installing ../../../templates/makeBaseExt/top/configure/os/CONFIG_SITE.win32-x86-mingw.win32-x86-mingw
Installing ../../../templates/makeBaseExt/top/configure/os/CONFIG_SITE.win32-x86.win32-x86
Installing ../../../templates/makeBaseExt/top/configure/os/CONFIG_SITE.windows-x64.windows-x64
Installing ../../../templates/makeBaseExt/top/configure/os/CONFIG.win32-x86-borland.win32-x86-borland
Installing ../../../templates/makeBaseExt/top/src/Makefile
mkdir ../../../templates/makeBaseExt/top/src
Installing ../../../templates/makeBaseExt/top/exampleExt/Makefile
mkdir ../../../templates/makeBaseExt/top/exampleExt
Installing ../../../templates/makeBaseExt/top/exampleExt/caExample.c
Installing ../../../templates/makeBaseExt/top/exampleExt/RELEASE_NOTES.HTM
Installing ../../../templates/makeBaseExt/top/simpleExt/Makefile
mkdir ../../../templates/makeBaseExt/top/simpleExt
make[3]: Leaving directory `/Jenkins/jenkins/jobs/epics-base-3.14/workspace/src/makeBaseExt/O.linux-x86_64'
make[2]: Leaving directory `/Jenkins/jenkins/jobs/epics-base-3.14/workspace/src/makeBaseExt'
make -C ./libCom linux-x86_64 
make[2]: Entering directory `/Jenkins/jenkins/jobs/epics-base-3.14/workspace/src/libCom'
perl ../../bin/linux-x86_64/makeMakefile.pl O.linux-x86_64 ../../..
mkdir O.Common
make -C O.linux-x86_64 -f ../Makefile TOP=../../.. T_A=linux-x86_64
make[3]: Entering directory `/Jenkins/jenkins/jobs/epics-base-3.14/workspace/src/libCom/O.linux-x86_64'
perl ../../../src/libCom/misc/makeEpicsVersion.pl ../../../configure/CONFIG_BASE_VERSION ../O.Common 
Variable missing from ../../../configure/CONFIG_BASE_VERSION at ../../../src/libCom/misc/makeEpicsVersion.pl line 37.
Building epicsVersion.h from ../../../configure/CONFIG_BASE_VERSION
make[3]: *** [../O.Common/epicsVersion.h] Error 255
make[3]: Leaving directory `/Jenkins/jenkins/jobs/epics-base-3.14/workspace/src/libCom/O.linux-x86_64'
make[2]: *** [linux-x86_64] Error 2
make[2]: Leaving directory `/Jenkins/jenkins/jobs/epics-base-3.14/workspace/src/libCom'
make[1]: *** [libCom.linux-x86_64] Error 2
make[1]: Leaving directory `/Jenkins/jenkins/jobs/epics-base-3.14/workspace/src'
make: *** [src.linux-x86_64] Error 2
Build step 'Execute shell' marked build as failure
TAP Reports Processing: START
Looking for TAP results report in workspace using pattern: src/**/O.linux-x86_64/*.tap
Did not find any matching files.
[WARNINGS] Skipping publisher since build result is FAILURE

Replies:
Jenkins build is back to normal : epics-base-3.14 #131 APS Jenkins

Navigate by Date:
Prev: Re: ao record convert overflow Schoeneburg, Bernd
Next: Build failed in Jenkins: epics-base-3.14-vx68 #78 APS Jenkins
Index: 2002  2003  2004  2005  2006  2007  2008  2009  2010  2011  2012  2013  2014  <20152016  2017  2018 
Navigate by Thread:
Prev: RE: [Cs-studio-core] EPICS Meeting at FRIB Maxwell, Dylan
Next: Jenkins build is back to normal : epics-base-3.14 #131 APS Jenkins
Index: 2002  2003  2004  2005  2006  2007  2008  2009  2010  2011  2012  2013  2014  <20152016  2017  2018 
ANJ, 16 Dec 2015 Valid HTML 4.01! · Home · News · About · Base · Modules · Extensions · Distributions · Download ·
· Search · EPICS V4 · IRMIS · Talk · Bugs · Documents · Links · Licensing ·