Argonne National Laboratory

Experimental Physics and
Industrial Control System

2002  2003  2004  2005  2006  2007  2008  2009  2010  2011  2012  2013  2014  <20152016  2017  2018  Index 2002  2003  2004  2005  2006  2007  2008  2009  2010  2011  2012  2013  2014  <20152016  2017  2018 
<== Date ==> <== Thread ==>

Subject: Build failed in Jenkins: epics-base-3.14-vx68 #78
From: APS Jenkins <aps-jenkins@anl.gov>
To: core-talk@aps.anl.gov
Date: Tue, 24 Mar 2015 09:27:59 -0500 (CDT)
See <https://jenkins.aps.anl.gov/job/epics-base-3.14-vx68/78/>

------------------------------------------
Started by upstream project "epics-base-3.14" build number 130
originally caused by:
 Started by an SCM change
[EnvInject] - Loading node environment variables.
Building on master in workspace <https://jenkins.aps.anl.gov/job/epics-base-3.14-vx68/ws/>
[workspace] $ /bin/sh -xe /tmp/hudson8397689991831571738.sh
+ make vxWorks-ppc32
make -C ./configure vxWorks-ppc32 
make[1]: Entering directory `/Jenkins/jenkins/jobs/epics-base-3.14/workspace/configure'
perl ../src/tools/makeMakefile.pl O.vxWorks-ppc32 ../..
make -C O.linux-x86_64 -f ../Makefile TOP=../.. T_A=linux-x86_64
make[2]: Entering directory `/Jenkins/jenkins/jobs/epics-base-3.14/workspace/configure/O.linux-x86_64'
make[2]: Nothing to be done for `all'.
make[2]: Leaving directory `/Jenkins/jenkins/jobs/epics-base-3.14/workspace/configure/O.linux-x86_64'
make -C O.vxWorks-ppc32 -f ../Makefile TOP=../.. T_A=vxWorks-ppc32
make[2]: Entering directory `/Jenkins/jenkins/jobs/epics-base-3.14/workspace/configure/O.vxWorks-ppc32'
make[2]: Nothing to be done for `all'.
make[2]: Leaving directory `/Jenkins/jenkins/jobs/epics-base-3.14/workspace/configure/O.vxWorks-ppc32'
make[1]: Leaving directory `/Jenkins/jenkins/jobs/epics-base-3.14/workspace/configure'
make -C ./src vxWorks-ppc32 
make[1]: Entering directory `/Jenkins/jenkins/jobs/epics-base-3.14/workspace/src'
make -C ./tools vxWorks-ppc32 
make[2]: Entering directory `/Jenkins/jenkins/jobs/epics-base-3.14/workspace/src/tools'
perl ../../src/tools/makeMakefile.pl O.vxWorks-ppc32 ../../..
make -C O.linux-x86_64 -f ../Makefile TOP=../../.. T_A=linux-x86_64
make[3]: Entering directory `/Jenkins/jenkins/jobs/epics-base-3.14/workspace/src/tools/O.linux-x86_64'
make[3]: Nothing to be done for `all'.
make[3]: Leaving directory `/Jenkins/jenkins/jobs/epics-base-3.14/workspace/src/tools/O.linux-x86_64'
make -C O.vxWorks-ppc32 -f ../Makefile TOP=../../.. T_A=vxWorks-ppc32
make[3]: Entering directory `/Jenkins/jenkins/jobs/epics-base-3.14/workspace/src/tools/O.vxWorks-ppc32'
make[3]: Nothing to be done for `all'.
make[3]: Leaving directory `/Jenkins/jenkins/jobs/epics-base-3.14/workspace/src/tools/O.vxWorks-ppc32'
make[2]: Leaving directory `/Jenkins/jenkins/jobs/epics-base-3.14/workspace/src/tools'
make -C ./makeBaseApp vxWorks-ppc32 
make[2]: Entering directory `/Jenkins/jenkins/jobs/epics-base-3.14/workspace/src/makeBaseApp'
perl ../../bin/linux-x86_64/makeMakefile.pl O.vxWorks-ppc32 ../../..
make -C O.linux-x86_64 -f ../Makefile TOP=../../.. T_A=linux-x86_64
make[3]: Entering directory `/Jenkins/jenkins/jobs/epics-base-3.14/workspace/src/makeBaseApp/O.linux-x86_64'
make[3]: Nothing to be done for `all'.
make[3]: Leaving directory `/Jenkins/jenkins/jobs/epics-base-3.14/workspace/src/makeBaseApp/O.linux-x86_64'
make -C O.vxWorks-ppc32 -f ../Makefile TOP=../../.. T_A=vxWorks-ppc32
make[3]: Entering directory `/Jenkins/jenkins/jobs/epics-base-3.14/workspace/src/makeBaseApp/O.vxWorks-ppc32'
make[3]: Nothing to be done for `all'.
make[3]: Leaving directory `/Jenkins/jenkins/jobs/epics-base-3.14/workspace/src/makeBaseApp/O.vxWorks-ppc32'
make[2]: Leaving directory `/Jenkins/jenkins/jobs/epics-base-3.14/workspace/src/makeBaseApp'
make -C ./makeBaseExt vxWorks-ppc32 
make[2]: Entering directory `/Jenkins/jenkins/jobs/epics-base-3.14/workspace/src/makeBaseExt'
perl ../../bin/linux-x86_64/makeMakefile.pl O.vxWorks-ppc32 ../../..
make -C O.linux-x86_64 -f ../Makefile TOP=../../.. T_A=linux-x86_64
make[3]: Entering directory `/Jenkins/jenkins/jobs/epics-base-3.14/workspace/src/makeBaseExt/O.linux-x86_64'
make[3]: Nothing to be done for `all'.
make[3]: Leaving directory `/Jenkins/jenkins/jobs/epics-base-3.14/workspace/src/makeBaseExt/O.linux-x86_64'
make -C O.vxWorks-ppc32 -f ../Makefile TOP=../../.. T_A=vxWorks-ppc32
make[3]: Entering directory `/Jenkins/jenkins/jobs/epics-base-3.14/workspace/src/makeBaseExt/O.vxWorks-ppc32'
make[3]: Nothing to be done for `all'.
make[3]: Leaving directory `/Jenkins/jenkins/jobs/epics-base-3.14/workspace/src/makeBaseExt/O.vxWorks-ppc32'
make[2]: Leaving directory `/Jenkins/jenkins/jobs/epics-base-3.14/workspace/src/makeBaseExt'
make -C ./libCom vxWorks-ppc32 
make[2]: Entering directory `/Jenkins/jenkins/jobs/epics-base-3.14/workspace/src/libCom'
perl ../../bin/linux-x86_64/makeMakefile.pl O.vxWorks-ppc32 ../../..
make -C O.linux-x86_64 -f ../Makefile TOP=../../.. T_A=linux-x86_64
make[3]: Entering directory `/Jenkins/jenkins/jobs/epics-base-3.14/workspace/src/libCom/O.linux-x86_64'
perl ../../../src/libCom/misc/makeEpicsVersion.pl ../../../configure/CONFIG_BASE_VERSION ../O.Common 
Variable missing from ../../../configure/CONFIG_BASE_VERSION at ../../../src/libCom/misc/makeEpicsVersion.pl line 37.
Building epicsVersion.h from ../../../configure/CONFIG_BASE_VERSION
make[3]: *** [../O.Common/epicsVersion.h] Error 255
make[3]: Leaving directory `/Jenkins/jenkins/jobs/epics-base-3.14/workspace/src/libCom/O.linux-x86_64'
make[2]: *** [linux-x86_64] Error 2
make[2]: Leaving directory `/Jenkins/jenkins/jobs/epics-base-3.14/workspace/src/libCom'
make[1]: *** [libCom.vxWorks-ppc32] Error 2
make[1]: Leaving directory `/Jenkins/jenkins/jobs/epics-base-3.14/workspace/src'
make: *** [src.vxWorks-ppc32] Error 2
Build step 'Execute shell' marked build as failure
[WARNINGS] Skipping publisher since build result is FAILURE

Replies:
Jenkins build is back to normal : epics-base-3.14-vx68 #79 APS Jenkins

Navigate by Date:
Prev: Build failed in Jenkins: epics-base-3.14 #130 APS Jenkins
Next: Build failed in Jenkins: epics-base-3.14-vx69 #78 APS Jenkins
Index: 2002  2003  2004  2005  2006  2007  2008  2009  2010  2011  2012  2013  2014  <20152016  2017  2018 
Navigate by Thread:
Prev: Jenkins build is back to normal : epics-base-3.14 #131 APS Jenkins
Next: Jenkins build is back to normal : epics-base-3.14-vx68 #79 APS Jenkins
Index: 2002  2003  2004  2005  2006  2007  2008  2009  2010  2011  2012  2013  2014  <20152016  2017  2018 
ANJ, 16 Dec 2015 Valid HTML 4.01! · Home · News · About · Base · Modules · Extensions · Distributions · Download ·
· Search · EPICS V4 · IRMIS · Talk · Bugs · Documents · Links · Licensing ·