Argonne National Laboratory

Experimental Physics and
Industrial Control System

2002  2003  2004  2005  2006  2007  2008  2009  2010  2011  2012  2013  2014  2015  2016  2017  <20182019  2020  Index 2002  2003  2004  2005  2006  2007  2008  2009  2010  2011  2012  2013  2014  2015  2016  2017  <20182019  2020 
<== Date ==> <== Thread ==>

Subject: Problem building base with parallel make on Visual Studio 2010
From: Mark Rivers <rivers@cars.uchicago.edu>
To: 'Andrew Johnson' <anj@aps.anl.gov>, "'core-talk@aps.anl.gov'" <core-talk@aps.anl.gov>
Date: Wed, 3 Jan 2018 14:44:56 +0000

I sometimes get the following error when building base 7.0.1.1 on Visual Studio (2010, 2017)

 

I do the following:

 

make –sj clean

make –sj8

 

Appending PVScalar.obj

Appending PVField.obj

Appending FieldCreateFactory.obj

Appending TypeFunc.obj

Appending valueBuilder.obj

Appending pvdVersion.obj

Appending reftrack.obj

Appending debugPtr.obj

Appending pvUnitTest.obj

Appending parseToPOD.obj

Appending typeCast.obj

Appending localStaticLock.obj

Appending status.obj

Appending timer.obj

Appending timeFunction.obj

Appending executor.obj

Appending event.obj

Appending serializeHelper.obj

Appending epicsException.obj

Appending bitSet.obj

Appending byteBuffer.obj

make[4]: *** O.windows-x64-static: Permission denied.  Stop.

H:/epics-devel/base-7.0.1/configure/RULES_ARCHS:58: recipe for target 'install.windows-x64-static' failed

make[3]: *** [install.windows-x64-static] Error 2

H:/epics-devel/base-7.0.1/configure/RULES_DIRS:84: recipe for target 'testApp.install' failed

make[2]: *** [testApp.install] Error 2

make[2]: *** Waiting for unfinished jobs....

unittest.cpp

H:\epics-devel\base-7.0.1\include\pv/pvData.h(534) : warning C4800: 'char' : forcing value to bool 'true' or 'false' (performance warning)

H:\epics-devel\base-7.0.1\include\pv/pvData.h(583) : warning C4250: 'epics::pvData::PVString' : inherits 'epics::pvData::PVScalarValue<T>::epics::pvData::PVScalarValue<T>::deserial

ize' via dominance

        with

        [

            T=std::string

        ]

        H:\epics-devel\base-7.0.1\include\pv/pvData.h(488) : see declaration of 'epics::pvData::PVScalarValue<T>::deserialize'

        with

        [

            T=std::string

        ]

../configure/RULES_DIRS:84: recipe for target 'pvData.install' failed

make[1]: *** [pvData.install] Error 2

make[1]: *** Waiting for unfinished jobs....

H:/epics-devel/base-7.0.1/bin/windows-x64-static/e_flex.exe: fatal internal error, error occurred when deleting temporary action file

H:/epics-devel/base-7.0.1/bin/windows-x64-static/e_flex.exe: fatal internal error, error occurred when closing skeleton file

H:/epics-devel/base-7.0.1/bin/windows-x64-static/e_flex.exe: fatal internal error, error occurred when closing skeleton file

H:/epics-devel/base-7.0.1/bin/windows-x64-static/e_flex.exe: fatal internal error, error occurred when closing skeleton file

H:/epics-devel/base-7.0.1/bin/windows-x64-static/e_flex.exe: fatal internal error, error occurred when closing skeleton file

H:/epics-devel/base-7.0.1/bin/windows-x64-static/e_flex.exe: fatal internal error, error occurred when closing skeleton file

H:/epics-devel/base-7.0.1/bin/windows-x64-static/e_flex.exe: fatal internal error, error occurred when closing skeleton file

H:/epics-devel/base-7.0.1/bin/windows-x64-static/e_flex.exe: fatal internal error, error occurred when closing skeleton file

H:/epics-devel/base-7.0.1/bin/windows-x64-static/e_flex.exe: fatal internal error, error occurred when closing skeleton file

H:/epics-devel/base-7.0.1/bin/windows-x64-static/e_flex.exe: fatal internal error, error occurred when closing skeleton file

H:/epics-devel/base-7.0.1/bin/windows-x64-static/e_flex.exe: fatal internal error, error occurred when closing skeleton file

H:/epics-devel/base-7.0.1/bin/windows-x64-static/e_flex.exe: fatal internal error, error occurred when closing skeleton file

H:/epics-devel/base-7.0.1/bin/windows-x64-static/e_flex.exe: fatal internal error, error occurred when closing skeleton file

H:/epics-devel/base-7.0.1/bin/windows-x64-static/e_flex.exe: fatal internal error, error occurred when closing skeleton file

H:/epics-devel/base-7.0.1/bin/windows-x64-static/e_flex.exe: fatal internal error, error occurred when closing skeleton file♪◙H:/epics-devel/base-7.0.1/bin/windows-x64-static/e_fle

x.exe: fatal internal error, error occurred when closing skeleton file

H:/epics-devel/base-7.0.1/bin/windows-x64-static/e_flex.exe: fatal internal error, error occurred when closing skeleton file

H:/epics-devel/base-7.0.1/bin/windows-x64-static/e_flex.exe: fatal internal error, error occurred when closing skeleton file

H:/epics-devel/base-7.0.1/bin/windows-x64-static/e_flex.exe: fatal internal error, error occurred when closing skeleton file

H:/epics-devel/base-7.0.1/bin/windows-x64-static/e_flex.exe: fatal internal error, error occurred when closing skeleton file

H:/epics-devel/base-7.0.1/bin/windows-x64-static/e_flex.exe: fatal internal error, error occurred when closing skeleton file

H:/epics-devel/base-7.0.1/bin/windows-x64-static/e_flex.exe: fatal internal error, error occurred when closing skeleton file

H:/epics-devel/base-7.0.1/bin/windows-x64-static/e_flex.exe: fatal internal error, error occurred when closing skeleton file

H:/epics-devel/base-7.0.1/bin/windows-x64-static/e_flex.exe: fatal internal error, error occurred when closing skeleton file♪◙H:/epics-devel/base-7.0.1/bin/windows-x64-static/e_fle

x.exe: fatal internal error, error occurred when closing skeleton file

H:/epics-devel/base-7.0.1/bin/windows-x64-static/e_flex.exe: fatal internal error, error occurred when closing skeleton file

H:/epics-devel/base-7.0.1/bin/windows-x64-static/e_flex.exe: fatal internal error, error occurred when closing skeleton file

H:/epics-devel/base-7.0.1/bin/windows-x64-static/e_flex.exe: fatal internal error, error occurred when closing skeleton file

H:/epics-devel/base-7.0.1/bin/windows-x64-static/e_flex.exe: fatal internal error, error occurred when closing skeleton file

H:/epics-devel/base-7.0.1/bin/windows-x64-static/e_flex.exe: fatal internal error, error occurred when closing skeleton file

H:/epics-devel/base-7.0.1/bin/windows-x64-static/e_flex.exe: fatal internal error, error occurred when closing skeleton file

H:/epics-devel/base-7.0.1/bin/windows-x64-static/e_flex.exe: fatal internal error, error occurred when closing skeleton file

H:/epics-devel/base-7.0.1/bin/windows-x64-static/e_flex.exe: fatal internal error, error occurred when closing skeleton file

H:/epics-devel/base-7.0.1/bin/windows-x64-static/e_flex.exe: fatal internal error, error occurred when closing skeleton file

H:/epics-devel/base-7.0.1/bin/windows-x64-static/e_flex.exe: fatal internal error, error occurred when closing skeleton file

H:/epics-devel/base-7.0.1/bin/windows-x64-static/e_flex.exe: fatal internal error, error occurred when closing skeleton file

H:/epics-devel/base-7.0.1/bin/windows-x64-static/e_flex.exe: fatal internal error, error occurred when closing skeleton file

 

It looks like perhaps 2 make threads are trying to access the same temporary file?

 

Mark

 


Replies:
RE: Problem building base with parallel make on Visual Studio 2010 Mark Rivers

Navigate by Date:
Prev: Re: Problem building example application on windows-x64 Andrew Johnson
Next: RE: Problem building base with parallel make on Visual Studio 2010 Mark Rivers
Index: 2002  2003  2004  2005  2006  2007  2008  2009  2010  2011  2012  2013  2014  2015  2016  2017  <20182019  2020 
Navigate by Thread:
Prev: Re: Problem building example application on windows-x64 Andrew Johnson
Next: RE: Problem building base with parallel make on Visual Studio 2010 Mark Rivers
Index: 2002  2003  2004  2005  2006  2007  2008  2009  2010  2011  2012  2013  2014  2015  2016  2017  <20182019  2020 
ANJ, 03 Jan 2018 Valid HTML 4.01! · Home · News · About · Base · Modules · Extensions · Distributions · Download ·
· Search · EPICS V4 · IRMIS · Talk · Bugs · Documents · Links · Licensing ·