Argonne National Laboratory

Experimental Physics and
Industrial Control System

2002  2003  2004  2005  2006  2007  2008  2009  2010  2011  2012  2013  2014  2015  2016  2017  <20182019  2020  Index 2002  2003  2004  2005  2006  2007  2008  2009  2010  2011  2012  2013  2014  2015  2016  2017  <20182019  2020 
<== Date ==> <== Thread ==>

Subject: Build failed in Jenkins: epics-base-3.16-mac-test #178
From: APS Jenkins <aps-jenkins@anl.gov>
To: core-talk@aps.anl.gov
Date: Fri, 19 Jan 2018 00:52:36 -0600 (CST)
See <https://jenkins.aps.anl.gov/job/epics-base-3.16-mac-test/178/display/redirect>

------------------------------------------
Started by upstream project "epics-base-3.16-mac" build number 193
originally caused by:
 Started by upstream project "epics-base-3.16" build number 196
 originally caused by:
  Started by an SCM change
[EnvInject] - Loading node environment variables.
Building remotely on mac-1 (mac) in workspace <https://jenkins.aps.anl.gov/job/epics-base-3.16-mac-test/ws/>
[epics-base-3.16-mac] $ /bin/sh -xe /var/folders/6f/2q91ldsx2rncqbx80st_4r700000gn/T/jenkins735389891096601360.sh
+ make -s clean-tests CROSS_COMPILER_TARGET_ARCHS=
+ ulimit -c unlimited
+ make -sj tapfiles CROSS_COMPILER_TARGET_ARCHS=
epicsAtomicTest(79439,0x700000081000) malloc: *** error for object 0x7fff3a5002b0: pointer being freed was not allocated
*** set a breakpoint in malloc_error_break to debug
epicsAtomicTest(79439,0x700000187000) malloc: *** error for object 0x7fff3a5002b8: incorrect checksum for freed object - object was probably modified after being freed.
*** set a breakpoint in malloc_error_break to debug
/bin/sh: line 1: 79439 Abort trap: 6           perl -CSD epicsAtomicTest.t -tap > epicsAtomicTest.tap
log client: connected to log server at "127.0.0.1:62445"
Starting iocInit
chfConfigParseStart: plugin pvt alloc failed
iocRun: All initialization complete
Starting iocInit
dbConvertJSON: parse error: trailing garbage
                                      0x10
                     (right here) ------^

dbConvertJSON: parse error: trailing garbage
                                      0x10
                     (right here) ------^

dbConvertJSON: parse error: trailing garbage
                                      0x10
                     (right here) ------^

dbConvertJSON: parse error: trailing garbage
                                      0x10
                     (right here) ------^

dbConvertJSON: parse error: trailing garbage
                                      0x10
                     (right here) ------^

dbConvertJSON: parse error: trailing garbage
                                      0x10
                     (right here) ------^

dbConvertJSON: parse error: trailing garbage
                                      0x10
                     (right here) ------^

dbConvertJSON: parse error: trailing garbage
                                      0x10
                     (right here) ------^

dbJLinkInit: lexical error: invalid char in json text.
                                  {"x":bbbb}
                     (right here) ------^

dbJLinkInit: parse error: premature EOF
                                       {"z":{"good":6}
                     (right here) ------^

+ make -s test-results CROSS_COMPILER_TARGET_ARCHS=
Base.tap ........ ok
Breaktable.tap .. ok
DBD.tap ......... ok
Device.tap ...... ok
Driver.tap ...... ok
Function.tap .... ok
macLib.tap ...... ok
Menu.tap ........ ok
Recfield.tap .... ok
Recordtype.tap .. ok
Registrar.tap ... ok
Snippets.tap .... ok
Variable.tap .... ok
All tests successful.
Files=13, Tests=351,  1 wallclock secs ( 0.05 usr  0.02 sys +  0.01 cusr  0.02 csys =  0.10 CPU)
Result: PASS
epicsUnitTestTest.tap ........ ok
epicsTypesTest.tap ........... ok
epicsInlineTest.tap .......... ok
epicsCalcTest.tap ............ ok
epicsAlgorithmTest.tap ....... ok
epicsMathTest.tap ............ ok
epicsMMIOTest.tap ............ ok
epicsEllTest.tap ............. ok
epicsEnvTest.tap ............. ok
epicsErrlogTest.tap .......... ok
epicsStdioTest.tap ........... ok
epicsStdlibTest.tap .......... ok
epicsSockResolveTest.tap ..... ok
epicsStringTest.tap .......... ok
epicsTimeTest.tap ............ ok
epicsTimeZoneTest.tap ........ ok
epicsThreadTest.tap .......... ok
epicsThreadOnceTest.tap ...... ok
epicsThreadPriorityTest.tap .. ok
epicsThreadPrivateTest.tap ... ok
epicsThreadHooksTest.tap ..... ok
epicsThreadPoolTest.tap ...... ok
epicsExitTest.tap ............ ok
epicsTimerTest.tap ........... ok
ringPointerTest.tap .......... ok
ringBytesTest.tap ............ ok
epicsEventTest.tap ........... ok
epicsMutexTest.tap ........... ok
epicsSpinTest.tap ............ ok
epicsAtomicTest.tap .......... 
Failed 29/50 subtests 
macDefExpandTest.tap ......... ok
cvtFastTest.tap .............. ok
macLibTest.tap ............... ok
taskwdTest.tap ............... ok
blockingSockTest.tap ......... ok
epicsMessageQueueTest.tap .... ok
epicsStackTraceTest.tap ...... ok
ipAddrToAsciiTest.tap ........ ok
osiSockTest.tap .............. ok
yajlTest.tap ................. ok

Test Summary Report
-------------------
epicsAtomicTest.tap        (Wstat: 0 Tests: 21 Failed: 0)
  Parse errors: Bad plan.  You planned 50 tests but ran 21.
Files=40, Tests=4006,  0 wallclock secs ( 0.29 usr  0.05 sys +  0.04 cusr  0.05 csys =  0.43 CPU)
Result: FAIL
../../../../configure/RULES_BUILD:350: recipe for target 'test-results' failed
make[3]: *** [test-results] Error 1
../../../configure/RULES_ARCHS:58: recipe for target 'test-results.darwin-x86' failed
make[2]: *** [test-results.darwin-x86] Error 2
../configure/RULES_DIRS:84: recipe for target 'libCom/test.test-results' failed
make[1]: *** [libCom/test.test-results] Error 2
configure/RULES_DIRS:84: recipe for target 'src.test-results' failed
make: *** [src.test-results] Error 2
Build step 'Execute shell' marked build as failure
TAP Reports Processing: START
Looking for TAP results report in workspace using pattern: src/**/O.darwin-x86/*.tap
Saving reports...
TAP Reports Processing: FINISH

Navigate by Date:
Prev: Build failed in Jenkins: epics-base-3.14-win64 #233 APS Jenkins
Next: Jenkins build is back to normal : epics-base-3.14-win32 #264 APS Jenkins
Index: 2002  2003  2004  2005  2006  2007  2008  2009  2010  2011  2012  2013  2014  2015  2016  2017  <20182019  2020 
Navigate by Thread:
Prev: Jenkins build is back to normal : epics-base-3.14-win64 #234 APS Jenkins
Next: Jenkins build is back to normal : epics-base-3.16-mac-test #180 APS Jenkins
Index: 2002  2003  2004  2005  2006  2007  2008  2009  2010  2011  2012  2013  2014  2015  2016  2017  <20182019  2020 
ANJ, 19 Jan 2018 Valid HTML 4.01! · Home · News · About · Base · Modules · Extensions · Distributions · Download ·
· Search · EPICS V4 · IRMIS · Talk · Bugs · Documents · Links · Licensing ·