Argonne National Laboratory

Experimental Physics and
Industrial Control System

2002  2003  2004  2005  2006  2007  2008  2009  2010  2011  2012  2013  2014  2015  2016  2017  <20182019  2020  2021  Index 2002  2003  2004  2005  2006  2007  2008  2009  2010  2011  2012  2013  2014  2015  2016  2017  <20182019  2020  2021 
<== Date ==> <== Thread ==>

Subject: Build failed in Jenkins: epics-base-3.16-mac-test #211
From: APS Jenkins <aps-jenkins@anl.gov>
To: core-talk@aps.anl.gov
Date: Sat, 4 Aug 2018 13:53:11 -0500 (CDT)
See <https://jenkins.aps.anl.gov/job/epics-base-3.16-mac-test/211/display/redirect>

------------------------------------------
Started by upstream project "epics-base-3.16-mac" build number 219
originally caused by:
 Started by upstream project "epics-base-3.16" build number 222
 originally caused by:
  Started by an SCM change
[EnvInject] - Loading node environment variables.
Building remotely on mac-1 (mac) in workspace <https://jenkins.aps.anl.gov/job/epics-base-3.16-mac-test/ws/>
[epics-base-3.16-mac] $ /bin/sh -xe /var/folders/6f/2q91ldsx2rncqbx80st_4r700000gn/T/jenkins75004079971626108.sh
+ make -s clean-tests CROSS_COMPILER_TARGET_ARCHS=
+ ulimit -c unlimited
+ make -sj tapfiles CROSS_COMPILER_TARGET_ARCHS=
epicsAtomicTest(19669,0x700000081000) malloc: *** error for object 0x7fd900d002b0: pointer being freed was not allocated
*** set a breakpoint in malloc_error_break to debug
/bin/sh: line 1: 19669 Abort trap: 6           perl -CSD epicsAtomicTest.t -tap > epicsAtomicTest.tap
log client: connected to log server at "127.0.0.1:52047"
Starting iocInit
chfConfigParseStart: plugin pvt alloc failed
iocRun: All initialization complete
Starting iocInit
Starting iocInit
iocRun: All initialization complete
dbConvertJSON: parse error: trailing garbage
                                      0x10
                     (right here) ------^

dbConvertJSON: parse error: trailing garbage
                                      0x10
                     (right here) ------^

dbConvertJSON: parse error: trailing garbage
                                      0x10
                     (right here) ------^

dbConvertJSON: parse error: trailing garbage
                                      0x10
                     (right here) ------^

dbConvertJSON: parse error: trailing garbage
                                      0x10
                     (right here) ------^

dbConvertJSON: parse error: trailing garbage
                                      0x10
                     (right here) ------^

dbConvertJSON: parse error: trailing garbage
                                      0x10
                     (right here) ------^

dbConvertJSON: parse error: trailing garbage
                                      0x10
                     (right here) ------^

dbJLinkInit: lexical error: invalid char in json text.
                                  {"x":bbbb}
                     (right here) ------^

dbJLinkInit: parse error: premature EOF
                                       {"z":{"good":6}
                     (right here) ------^

+ make -s test-results CROSS_COMPILER_TARGET_ARCHS=
Base.tap ........ ok
Breaktable.tap .. ok
DBD.tap ......... ok
Device.tap ...... ok
Driver.tap ...... ok
Function.tap .... ok
macLib.tap ...... ok
Menu.tap ........ ok
Recfield.tap .... ok
Recordtype.tap .. ok
Registrar.tap ... ok
Snippets.tap .... ok
Variable.tap .... ok
All tests successful.
Files=13, Tests=351,  0 wallclock secs ( 0.07 usr  0.02 sys +  0.05 cusr  0.04 csys =  0.18 CPU)
Result: PASS
epicsUnitTestTest.tap ........ ok
epicsTypesTest.tap ........... ok
epicsInlineTest.tap .......... ok
epicsCalcTest.tap ............ ok
epicsAlgorithmTest.tap ....... ok
epicsMathTest.tap ............ ok
epicsMMIOTest.tap ............ ok
epicsEllTest.tap ............. ok
epicsEnvTest.tap ............. ok
epicsErrlogTest.tap .......... ok
epicsStdioTest.tap ........... ok
epicsStdlibTest.tap .......... ok
epicsSockResolveTest.tap ..... ok
epicsStringTest.tap .......... ok
epicsTimeTest.tap ............ ok
epicsTimeZoneTest.tap ........ ok
epicsThreadTest.tap .......... ok
epicsThreadOnceTest.tap ...... ok
epicsThreadPriorityTest.tap .. ok
epicsThreadPrivateTest.tap ... ok
epicsThreadHooksTest.tap ..... ok
epicsThreadPoolTest.tap ...... ok
epicsExitTest.tap ............ ok
epicsTimerTest.tap ........... ok
ringPointerTest.tap .......... ok
ringBytesTest.tap ............ ok
epicsEventTest.tap ........... ok
epicsMutexTest.tap ........... ok
epicsSpinTest.tap ............ ok
epicsAtomicTest.tap .......... 
Failed 21/50 subtests 
macDefExpandTest.tap ......... ok
cvtFastTest.tap .............. ok
macLibTest.tap ............... ok
taskwdTest.tap ............... ok
blockingSockTest.tap ......... ok
epicsMessageQueueTest.tap .... ok
epicsStackTraceTest.tap ...... ok
ipAddrToAsciiTest.tap ........ ok
osiSockTest.tap .............. ok
yajlTest.tap ................. ok

Test Summary Report
-------------------
epicsAtomicTest.tap        (Wstat: 0 Tests: 29 Failed: 0)
  Parse errors: Bad plan.  You planned 50 tests but ran 29.
Files=40, Tests=4014,  1 wallclock secs ( 0.33 usr  0.08 sys +  0.16 cusr  0.15 csys =  0.72 CPU)
Result: FAIL
../../../../configure/RULES_BUILD:356: recipe for target 'test-results' failed
make[3]: *** [test-results] Error 1
../../../configure/RULES_ARCHS:58: recipe for target 'test-results.darwin-x86' failed
make[2]: *** [test-results.darwin-x86] Error 2
../configure/RULES_DIRS:84: recipe for target 'libCom/test.test-results' failed
make[1]: *** [libCom/test.test-results] Error 2
configure/RULES_DIRS:84: recipe for target 'src.test-results' failed
make: *** [src.test-results] Error 2
Build step 'Execute shell' marked build as failure
TAP Reports Processing: START
Looking for TAP results report in workspace using pattern: src/**/O.darwin-x86/*.tap
Saving reports...
TAP Reports Processing: FINISH

Replies:
Jenkins build is back to normal : epics-base-3.16-mac-test #212 APS Jenkins

Navigate by Date:
Prev: Jenkins build is back to normal : epics-base-3.14-win64s #255 APS Jenkins
Next: Jenkins build is back to normal : epics-base-3.16-mac-test #212 APS Jenkins
Index: 2002  2003  2004  2005  2006  2007  2008  2009  2010  2011  2012  2013  2014  2015  2016  2017  <20182019  2020  2021 
Navigate by Thread:
Prev: Jenkins build is back to normal : epics-base-3.14-win64s #255 APS Jenkins
Next: Jenkins build is back to normal : epics-base-3.16-mac-test #212 APS Jenkins
Index: 2002  2003  2004  2005  2006  2007  2008  2009  2010  2011  2012  2013  2014  2015  2016  2017  <20182019  2020  2021 
ANJ, 04 Aug 2018 Valid HTML 4.01! · Home · News · About · Base · Modules · Extensions · Distributions · Download ·
· Search · EPICS V4 · IRMIS · Talk · Bugs · Documents · Links · Licensing ·