Argonne National Laboratory

Experimental Physics and
Industrial Control System

2002  2003  2004  2005  2006  2007  2008  2009  2010  2011  2012  2013  2014  2015  2016  2017  2018  <20192020  Index 2002  2003  2004  2005  2006  2007  2008  2009  2010  2011  2012  2013  2014  2015  2016  2017  2018  <20192020 
<== Date ==> <== Thread ==>

Subject: Build failed in Jenkins: epics-7.0 » linux64 #99
From: APS Jenkins via Core-talk <core-talk@aps.anl.gov>
To: core-talk@aps.anl.gov
Date: Mon, 11 Mar 2019 20:34:08 -0500 (CDT)
See <https://jenkins.aps.anl.gov/job/epics-7.0/OS=linux64/99/display/redirect?page=changes>

Changes:

[Michael Davidsaver] iocsh epicsMutexShowAll accepts 2 arguments

------------------------------------------
[...truncated 1.89 MB...]
make[4]: Entering directory '/Jenkins/jenkins/jobs/epics-7.0/workspace/OS/linux64/modules/pva2pva/pdbApp/O.linux-x86_64'
/usr/bin/g++ -o softIocPVA  -L/Jenkins/jenkins/jobs/epics-7.0/workspace/OS/linux64/lib/linux-x86_64 -Wl,-rpath,/Jenkins/jenkins/jobs/epics-7.0/workspace/OS/linux64/lib/linux-x86_64           -rdynamic -m64         softMain.o softIocPVA_registerRecordDeviceDriver.o    -lqsrv -lpvAccessIOC -lpvAccessCA -lpvAccess -lpvData -ldbRecStd -ldbCore -lca -lCom   
make[4]: Leaving directory '/Jenkins/jenkins/jobs/epics-7.0/workspace/OS/linux64/modules/pva2pva/pdbApp/O.linux-x86_64'
/Jenkins/jenkins/bin/make -C ./testApp install.linux-x86_64 
make[3]: Entering directory '/Jenkins/jenkins/jobs/epics-7.0/workspace/OS/linux64/modules/pva2pva/testApp'
perl -CSD /Jenkins/jenkins/jobs/epics-7.0/workspace/OS/linux64/bin/linux-x86_64/makeMakefile.pl O.linux-x86_64 ../..
make[3]: Leaving directory '/Jenkins/jenkins/jobs/epics-7.0/workspace/OS/linux64/modules/pva2pva/testApp'
make[3]: Entering directory '/Jenkins/jenkins/jobs/epics-7.0/workspace/OS/linux64/modules/pva2pva/testApp'
perl -CSD /Jenkins/jenkins/jobs/epics-7.0/workspace/OS/linux64/bin/linux-x86_64/makeMakefile.pl O.vxWorks-ppc32 ../..
make[3]: Leaving directory '/Jenkins/jenkins/jobs/epics-7.0/workspace/OS/linux64/modules/pva2pva/testApp'
make[3]: Entering directory '/Jenkins/jenkins/jobs/epics-7.0/workspace/OS/linux64/modules/pva2pva/testApp'
perl -CSD /Jenkins/jenkins/jobs/epics-7.0/workspace/OS/linux64/bin/linux-x86_64/makeMakefile.pl O.vxWorks-ppc32sf ../..
make[3]: Leaving directory '/Jenkins/jenkins/jobs/epics-7.0/workspace/OS/linux64/modules/pva2pva/testApp'
make[3]: Entering directory '/Jenkins/jenkins/jobs/epics-7.0/workspace/OS/linux64/modules/pva2pva/testApp'
perl -CSD /Jenkins/jenkins/jobs/epics-7.0/workspace/OS/linux64/bin/linux-x86_64/makeMakefile.pl O.RTEMS-uC5282 ../..
make[3]: Leaving directory '/Jenkins/jenkins/jobs/epics-7.0/workspace/OS/linux64/modules/pva2pva/testApp'
make[3]: Entering directory '/Jenkins/jenkins/jobs/epics-7.0/workspace/OS/linux64/modules/pva2pva/testApp'
mkdir -p O.Common
make[3]: Leaving directory '/Jenkins/jenkins/jobs/epics-7.0/workspace/OS/linux64/modules/pva2pva/testApp'
/Jenkins/jenkins/bin/make -C O.linux-x86_64 -f ../Makefile TOP=../.. \
    T_A=linux-x86_64 install
make[4]: Entering directory '/Jenkins/jenkins/jobs/epics-7.0/workspace/OS/linux64/modules/pva2pva/testApp/O.linux-x86_64'
/usr/bin/g++  -D_GNU_SOURCE -D_DEFAULT_SOURCE         -DUSE_TYPED_RSET -I../../pdbApp -I../../p2pApp -I../../common   -D_X86_64_  -DUNIX  -Dlinux     -O3 -g   -Wall      -mtune=generic      -m64  -I. -I../O.Common -I. -I. -I.. -I/Jenkins/jenkins/jobs/epics-7.0/workspace/OS/linux64/include/compiler/gcc -I/Jenkins/jenkins/jobs/epics-7.0/workspace/OS/linux64/include/os/Linux -I/Jenkins/jenkins/jobs/epics-7.0/workspace/OS/linux64/include -I/Jenkins/jenkins/jobs/epics-7.0/workspace/OS/linux64/include/compiler/gcc -I/Jenkins/jenkins/jobs/epics-7.0/workspace/OS/linux64/include/os/Linux -I/Jenkins/jenkins/jobs/epics-7.0/workspace/OS/linux64/include        -MM -MF check_consist.d  ../check_consist.cpp
make[4]: Leaving directory '/Jenkins/jenkins/jobs/epics-7.0/workspace/OS/linux64/modules/pva2pva/testApp/O.linux-x86_64'
make[4]: Entering directory '/Jenkins/jenkins/jobs/epics-7.0/workspace/OS/linux64/modules/pva2pva/testApp/O.linux-x86_64'
/usr/bin/g++  -D_GNU_SOURCE -D_DEFAULT_SOURCE         -DUSE_TYPED_RSET -I../../pdbApp -I../../p2pApp -I../../common   -D_X86_64_  -DUNIX  -Dlinux     -O3 -g   -Wall      -mtune=generic      -m64  -I. -I../O.Common -I. -I. -I.. -I/Jenkins/jenkins/jobs/epics-7.0/workspace/OS/linux64/include/compiler/gcc -I/Jenkins/jenkins/jobs/epics-7.0/workspace/OS/linux64/include/os/Linux -I/Jenkins/jenkins/jobs/epics-7.0/workspace/OS/linux64/include -I/Jenkins/jenkins/jobs/epics-7.0/workspace/OS/linux64/include/compiler/gcc -I/Jenkins/jenkins/jobs/epics-7.0/workspace/OS/linux64/include/os/Linux -I/Jenkins/jenkins/jobs/epics-7.0/workspace/OS/linux64/include        -MM -MF testdbf_copy.d  ../testdbf_copy.cpp
make[4]: Leaving directory '/Jenkins/jenkins/jobs/epics-7.0/workspace/OS/linux64/modules/pva2pva/testApp/O.linux-x86_64'
make[4]: Entering directory '/Jenkins/jenkins/jobs/epics-7.0/workspace/OS/linux64/modules/pva2pva/testApp/O.linux-x86_64'
/usr/bin/g++  -D_GNU_SOURCE -D_DEFAULT_SOURCE         -DUSE_TYPED_RSET -I../../pdbApp -I../../p2pApp -I../../common   -D_X86_64_  -DUNIX  -Dlinux     -O3 -g   -Wall      -mtune=generic      -m64  -I. -I../O.Common -I. -I. -I.. -I/Jenkins/jenkins/jobs/epics-7.0/workspace/OS/linux64/include/compiler/gcc -I/Jenkins/jenkins/jobs/epics-7.0/workspace/OS/linux64/include/os/Linux -I/Jenkins/jenkins/jobs/epics-7.0/workspace/OS/linux64/include -I/Jenkins/jenkins/jobs/epics-7.0/workspace/OS/linux64/include/compiler/gcc -I/Jenkins/jenkins/jobs/epics-7.0/workspace/OS/linux64/include/os/Linux -I/Jenkins/jenkins/jobs/epics-7.0/workspace/OS/linux64/include        -MM -MF testgroupconfig.d  ../testgroupconfig.cpp
make[4]: Leaving directory '/Jenkins/jenkins/jobs/epics-7.0/workspace/OS/linux64/modules/pva2pva/testApp/O.linux-x86_64'
make[4]: Entering directory '/Jenkins/jenkins/jobs/epics-7.0/workspace/OS/linux64/modules/pvDatabase/test/O.linux-x86_64'
/usr/bin/g++  -D_GNU_SOURCE -D_DEFAULT_SOURCE           -D_X86_64_  -DUNIX  -Dlinux     -O3 -g   -Wall      -mtune=generic      -m64  -I. -I../O.Common -I. -I. -I.. -I../../test/src -I/Jenkins/jenkins/jobs/epics-7.0/workspace/OS/linux64/include/compiler/gcc -I/Jenkins/jenkins/jobs/epics-7.0/workspace/OS/linux64/include/os/Linux -I/Jenkins/jenkins/jobs/epics-7.0/workspace/OS/linux64/include -I/Jenkins/jenkins/jobs/epics-7.0/workspace/OS/linux64/include/compiler/gcc -I/Jenkins/jenkins/jobs/epics-7.0/workspace/OS/linux64/include/os/Linux -I/Jenkins/jenkins/jobs/epics-7.0/workspace/OS/linux64/include        -c ../../test/src/testPVRecord.cpp
make[4]: Leaving directory '/Jenkins/jenkins/jobs/epics-7.0/workspace/OS/linux64/modules/pvDatabase/test/O.linux-x86_64'
make[4]: Entering directory '/Jenkins/jenkins/jobs/epics-7.0/workspace/OS/linux64/modules/pva2pva/testApp/O.linux-x86_64'
/usr/bin/g++  -D_GNU_SOURCE -D_DEFAULT_SOURCE         -DUSE_TYPED_RSET -I../../pdbApp -I../../p2pApp -I../../common   -D_X86_64_  -DUNIX  -Dlinux     -O3 -g   -Wall      -mtune=generic      -m64  -I. -I../O.Common -I. -I. -I.. -I/Jenkins/jenkins/jobs/epics-7.0/workspace/OS/linux64/include/compiler/gcc -I/Jenkins/jenkins/jobs/epics-7.0/workspace/OS/linux64/include/os/Linux -I/Jenkins/jenkins/jobs/epics-7.0/workspace/OS/linux64/include -I/Jenkins/jenkins/jobs/epics-7.0/workspace/OS/linux64/include/compiler/gcc -I/Jenkins/jenkins/jobs/epics-7.0/workspace/OS/linux64/include/os/Linux -I/Jenkins/jenkins/jobs/epics-7.0/workspace/OS/linux64/include        -MM -MF testpvalink.d  ../testpvalink.cpp
make[4]: Leaving directory '/Jenkins/jenkins/jobs/epics-7.0/workspace/OS/linux64/modules/pva2pva/testApp/O.linux-x86_64'
make[4]: Entering directory '/Jenkins/jenkins/jobs/epics-7.0/workspace/OS/linux64/modules/pvaClient/src/O.linux-x86_64'
/usr/bin/g++  -D_GNU_SOURCE -D_DEFAULT_SOURCE           -D_X86_64_  -DUNIX  -Dlinux     -O3 -g   -Wall      -mtune=generic      -m64 -fPIC -I. -I../O.Common -I. -I. -I.. -I/Jenkins/jenkins/jobs/epics-7.0/workspace/OS/linux64/include/compiler/gcc -I/Jenkins/jenkins/jobs/epics-7.0/workspace/OS/linux64/include/os/Linux -I/Jenkins/jenkins/jobs/epics-7.0/workspace/OS/linux64/include -I/Jenkins/jenkins/jobs/epics-7.0/workspace/OS/linux64/include/compiler/gcc -I/Jenkins/jenkins/jobs/epics-7.0/workspace/OS/linux64/include/os/Linux -I/Jenkins/jenkins/jobs/epics-7.0/workspace/OS/linux64/include        -c ../pvaClientNTMultiData.cpp
make[4]: Leaving directory '/Jenkins/jenkins/jobs/epics-7.0/workspace/OS/linux64/modules/pvaClient/src/O.linux-x86_64'
make[4]: Entering directory '/Jenkins/jenkins/jobs/epics-7.0/workspace/OS/linux64/modules/pva2pva/testApp/O.linux-x86_64'
perl -CSD /Jenkins/jenkins/jobs/epics-7.0/workspace/OS/linux64/bin/linux-x86_64/dbdExpand.pl   -I. -I.. -I../O.Common -I/Jenkins/jenkins/jobs/epics-7.0/workspace/OS/linux64/dbd -I/Jenkins/jenkins/jobs/epics-7.0/workspace/OS/linux64/dbd -o pvaLinkTestIoc.dbd base.dbd qsrv.dbd
make[4]: Leaving directory '/Jenkins/jenkins/jobs/epics-7.0/workspace/OS/linux64/modules/pva2pva/testApp/O.linux-x86_64'
make[4]: Entering directory '/Jenkins/jenkins/jobs/epics-7.0/workspace/OS/linux64/modules/pvDatabase/test/O.linux-x86_64'
/usr/bin/g++  -D_GNU_SOURCE -D_DEFAULT_SOURCE           -D_X86_64_  -DUNIX  -Dlinux     -O3 -g   -Wall      -mtune=generic      -m64  -I. -I../O.Common -I. -I. -I.. -I../../test/src -I/Jenkins/jenkins/jobs/epics-7.0/workspace/OS/linux64/include/compiler/gcc -I/Jenkins/jenkins/jobs/epics-7.0/workspace/OS/linux64/include/os/Linux -I/Jenkins/jenkins/jobs/epics-7.0/workspace/OS/linux64/include -I/Jenkins/jenkins/jobs/epics-7.0/workspace/OS/linux64/include/compiler/gcc -I/Jenkins/jenkins/jobs/epics-7.0/workspace/OS/linux64/include/os/Linux -I/Jenkins/jenkins/jobs/epics-7.0/workspace/OS/linux64/include        -c ../../test/src/testExampleRecord.cpp
make[4]: Leaving directory '/Jenkins/jenkins/jobs/epics-7.0/workspace/OS/linux64/modules/pvDatabase/test/O.linux-x86_64'
make[4]: Entering directory '/Jenkins/jenkins/jobs/epics-7.0/workspace/OS/linux64/modules/pva2pva/testApp/O.linux-x86_64'
perl -CSD /Jenkins/jenkins/jobs/epics-7.0/workspace/OS/linux64/bin/linux-x86_64/dbdExpand.pl   -I. -I.. -I../O.Common -I/Jenkins/jenkins/jobs/epics-7.0/workspace/OS/linux64/dbd -I/Jenkins/jenkins/jobs/epics-7.0/workspace/OS/linux64/dbd -o p2pTestIoc.dbd base.dbd
make[4]: Leaving directory '/Jenkins/jenkins/jobs/epics-7.0/workspace/OS/linux64/modules/pva2pva/testApp/O.linux-x86_64'
make[4]: Entering directory '/Jenkins/jenkins/jobs/epics-7.0/workspace/OS/linux64/modules/pva2pva/testApp/O.linux-x86_64'
/usr/bin/g++  -D_GNU_SOURCE -D_DEFAULT_SOURCE         -DUSE_TYPED_RSET -I../../pdbApp -I../../p2pApp -I../../common   -D_X86_64_  -DUNIX  -Dlinux     -O3 -g   -Wall      -mtune=generic      -m64  -I. -I../O.Common -I. -I. -I.. -I/Jenkins/jenkins/jobs/epics-7.0/workspace/OS/linux64/include/compiler/gcc -I/Jenkins/jenkins/jobs/epics-7.0/workspace/OS/linux64/include/os/Linux -I/Jenkins/jenkins/jobs/epics-7.0/workspace/OS/linux64/include -I/Jenkins/jenkins/jobs/epics-7.0/workspace/OS/linux64/include/compiler/gcc -I/Jenkins/jenkins/jobs/epics-7.0/workspace/OS/linux64/include/os/Linux -I/Jenkins/jenkins/jobs/epics-7.0/workspace/OS/linux64/include        -MM -MF testpdb.d  ../testpdb.cpp
make[4]: Leaving directory '/Jenkins/jenkins/jobs/epics-7.0/workspace/OS/linux64/modules/pva2pva/testApp/O.linux-x86_64'
make[4]: Entering directory '/Jenkins/jenkins/jobs/epics-7.0/workspace/OS/linux64/modules/pva2pva/testApp/O.linux-x86_64'
/usr/bin/g++  -D_GNU_SOURCE -D_DEFAULT_SOURCE         -DUSE_TYPED_RSET -I../../pdbApp -I../../p2pApp -I../../common   -D_X86_64_  -DUNIX  -Dlinux     -O3 -g   -Wall      -mtune=generic      -m64  -I. -I../O.Common -I. -I. -I.. -I/Jenkins/jenkins/jobs/epics-7.0/workspace/OS/linux64/include/compiler/gcc -I/Jenkins/jenkins/jobs/epics-7.0/workspace/OS/linux64/include/os/Linux -I/Jenkins/jenkins/jobs/epics-7.0/workspace/OS/linux64/include -I/Jenkins/jenkins/jobs/epics-7.0/workspace/OS/linux64/include/compiler/gcc -I/Jenkins/jenkins/jobs/epics-7.0/workspace/OS/linux64/include/os/Linux -I/Jenkins/jenkins/jobs/epics-7.0/workspace/OS/linux64/include        -MM -MF testpvif.d  ../testpvif.cpp
make[4]: Leaving directory '/Jenkins/jenkins/jobs/epics-7.0/workspace/OS/linux64/modules/pva2pva/testApp/O.linux-x86_64'
make[4]: Entering directory '/Jenkins/jenkins/jobs/epics-7.0/workspace/OS/linux64/modules/pva2pva/testApp/O.linux-x86_64'
/usr/bin/g++  -D_GNU_SOURCE -D_DEFAULT_SOURCE         -DUSE_TYPED_RSET -I../../pdbApp -I../../p2pApp -I../../common   -D_X86_64_  -DUNIX  -Dlinux     -O3 -g   -Wall      -mtune=generic      -m64  -I. -I../O.Common -I. -I. -I.. -I/Jenkins/jenkins/jobs/epics-7.0/workspace/OS/linux64/include/compiler/gcc -I/Jenkins/jenkins/jobs/epics-7.0/workspace/OS/linux64/include/os/Linux -I/Jenkins/jenkins/jobs/epics-7.0/workspace/OS/linux64/include -I/Jenkins/jenkins/jobs/epics-7.0/workspace/OS/linux64/include/compiler/gcc -I/Jenkins/jenkins/jobs/epics-7.0/workspace/OS/linux64/include/os/Linux -I/Jenkins/jenkins/jobs/epics-7.0/workspace/OS/linux64/include        -MM -MF testtest.d  ../testtest.cpp
make[4]: Leaving directory '/Jenkins/jenkins/jobs/epics-7.0/workspace/OS/linux64/modules/pva2pva/testApp/O.linux-x86_64'
make[4]: Entering directory '/Jenkins/jenkins/jobs/epics-7.0/workspace/OS/linux64/modules/pva2pva/testApp/O.linux-x86_64'
/usr/bin/g++  -D_GNU_SOURCE -D_DEFAULT_SOURCE         -DUSE_TYPED_RSET -I../../pdbApp -I../../p2pApp -I../../common   -D_X86_64_  -DUNIX  -Dlinux     -O3 -g   -Wall      -mtune=generic      -m64  -I. -I../O.Common -I. -I. -I.. -I/Jenkins/jenkins/jobs/epics-7.0/workspace/OS/linux64/include/compiler/gcc -I/Jenkins/jenkins/jobs/epics-7.0/workspace/OS/linux64/include/os/Linux -I/Jenkins/jenkins/jobs/epics-7.0/workspace/OS/linux64/include -I/Jenkins/jenkins/jobs/epics-7.0/workspace/OS/linux64/include/compiler/gcc -I/Jenkins/jenkins/jobs/epics-7.0/workspace/OS/linux64/include/os/Linux -I/Jenkins/jenkins/jobs/epics-7.0/workspace/OS/linux64/include        -MM -MF testweak.d  ../testweak.cpp
make[4]: Leaving directory '/Jenkins/jenkins/jobs/epics-7.0/workspace/OS/linux64/modules/pva2pva/testApp/O.linux-x86_64'
make[4]: Entering directory '/Jenkins/jenkins/jobs/epics-7.0/workspace/OS/linux64/modules/pva2pva/testApp/O.linux-x86_64'
/usr/bin/g++  -D_GNU_SOURCE -D_DEFAULT_SOURCE         -DUSE_TYPED_RSET -I../../pdbApp -I../../p2pApp -I../../common   -D_X86_64_  -DUNIX  -Dlinux     -O3 -g   -Wall      -mtune=generic      -m64  -I. -I../O.Common -I. -I. -I.. -I/Jenkins/jenkins/jobs/epics-7.0/workspace/OS/linux64/include/compiler/gcc -I/Jenkins/jenkins/jobs/epics-7.0/workspace/OS/linux64/include/os/Linux -I/Jenkins/jenkins/jobs/epics-7.0/workspace/OS/linux64/include -I/Jenkins/jenkins/jobs/epics-7.0/workspace/OS/linux64/include/compiler/gcc -I/Jenkins/jenkins/jobs/epics-7.0/workspace/OS/linux64/include/os/Linux -I/Jenkins/jenkins/jobs/epics-7.0/workspace/OS/linux64/include        -MM -MF utilitiesx.d  ../utilitiesx.cpp
make[4]: Leaving directory '/Jenkins/jenkins/jobs/epics-7.0/workspace/OS/linux64/modules/pva2pva/testApp/O.linux-x86_64'
make[4]: Entering directory '/Jenkins/jenkins/jobs/epics-7.0/workspace/OS/linux64/modules/pvaClient/src/O.linux-x86_64'
/usr/bin/g++  -D_GNU_SOURCE -D_DEFAULT_SOURCE           -D_X86_64_  -DUNIX  -Dlinux     -O3 -g   -Wall      -mtune=generic      -m64 -fPIC -I. -I../O.Common -I. -I. -I.. -I/Jenkins/jenkins/jobs/epics-7.0/workspace/OS/linux64/include/compiler/gcc -I/Jenkins/jenkins/jobs/epics-7.0/workspace/OS/linux64/include/os/Linux -I/Jenkins/jenkins/jobs/epics-7.0/workspace/OS/linux64/include -I/Jenkins/jenkins/jobs/epics-7.0/workspace/OS/linux64/include/compiler/gcc -I/Jenkins/jenkins/jobs/epics-7.0/workspace/OS/linux64/include/os/Linux -I/Jenkins/jenkins/jobs/epics-7.0/workspace/OS/linux64/include        -c ../pvaClientNTMultiGet.cpp
make[4]: Leaving directory '/Jenkins/jenkins/jobs/epics-7.0/workspace/OS/linux64/modules/pvaClient/src/O.linux-x86_64'
make[4]: Entering directory '/Jenkins/jenkins/jobs/epics-7.0/workspace/OS/linux64/modules/pvaClient/src/O.linux-x86_64'
/usr/bin/g++  -D_GNU_SOURCE -D_DEFAULT_SOURCE           -D_X86_64_  -DUNIX  -Dlinux     -O3 -g   -Wall      -mtune=generic      -m64 -fPIC -I. -I../O.Common -I. -I. -I.. -I/Jenkins/jenkins/jobs/epics-7.0/workspace/OS/linux64/include/compiler/gcc -I/Jenkins/jenkins/jobs/epics-7.0/workspace/OS/linux64/include/os/Linux -I/Jenkins/jenkins/jobs/epics-7.0/workspace/OS/linux64/include -I/Jenkins/jenkins/jobs/epics-7.0/workspace/OS/linux64/include/compiler/gcc -I/Jenkins/jenkins/jobs/epics-7.0/workspace/OS/linux64/include/os/Linux -I/Jenkins/jenkins/jobs/epics-7.0/workspace/OS/linux64/include        -c ../pvaClientNTMultiMonitor.cpp
make[4]: Leaving directory '/Jenkins/jenkins/jobs/epics-7.0/workspace/OS/linux64/modules/pvaClient/src/O.linux-x86_64'
make[4]: Entering directory '/Jenkins/jenkins/jobs/epics-7.0/workspace/OS/linux64/modules/pva2pva/testApp/O.linux-x86_64'
perl -CSD /Jenkins/jenkins/jobs/epics-7.0/workspace/OS/linux64/bin/linux-x86_64/registerRecordDeviceDriver.pl   -I. -I.. -I../O.Common -I/Jenkins/jenkins/jobs/epics-7.0/workspace/OS/linux64/dbd -I/Jenkins/jenkins/jobs/epics-7.0/workspace/OS/linux64/dbd    -o pvaLinkTestIoc_registerRecordDeviceDriver.cpp ../O.Common/pvaLinkTestIoc.dbd pvaLinkTestIoc_registerRecordDeviceDriver /Jenkins/jenkins/jobs/epics-7.0/workspace/OS/linux64
make[4]: Leaving directory '/Jenkins/jenkins/jobs/epics-7.0/workspace/OS/linux64/modules/pva2pva/testApp/O.linux-x86_64'
make[4]: Entering directory '/Jenkins/jenkins/jobs/epics-7.0/workspace/OS/linux64/modules/pvDatabase/test/O.linux-x86_64'
/usr/bin/g++  -D_GNU_SOURCE -D_DEFAULT_SOURCE           -D_X86_64_  -DUNIX  -Dlinux     -O3 -g   -Wall      -mtune=generic      -m64  -I. -I../O.Common -I. -I. -I.. -I../../test/src -I/Jenkins/jenkins/jobs/epics-7.0/workspace/OS/linux64/include/compiler/gcc -I/Jenkins/jenkins/jobs/epics-7.0/workspace/OS/linux64/include/os/Linux -I/Jenkins/jenkins/jobs/epics-7.0/workspace/OS/linux64/include -I/Jenkins/jenkins/jobs/epics-7.0/workspace/OS/linux64/include/compiler/gcc -I/Jenkins/jenkins/jobs/epics-7.0/workspace/OS/linux64/include/os/Linux -I/Jenkins/jenkins/jobs/epics-7.0/workspace/OS/linux64/include        -c ../../test/src/testLocalProvider.cpp
make[4]: Leaving directory '/Jenkins/jenkins/jobs/epics-7.0/workspace/OS/linux64/modules/pvDatabase/test/O.linux-x86_64'
make[4]: Entering directory '/Jenkins/jenkins/jobs/epics-7.0/workspace/OS/linux64/modules/pva2pva/testApp/O.linux-x86_64'
perl -CSD /Jenkins/jenkins/jobs/epics-7.0/workspace/OS/linux64/bin/linux-x86_64/registerRecordDeviceDriver.pl   -I. -I.. -I../O.Common -I/Jenkins/jenkins/jobs/epics-7.0/workspace/OS/linux64/dbd -I/Jenkins/jenkins/jobs/epics-7.0/workspace/OS/linux64/dbd    -o p2pTestIoc_registerRecordDeviceDriver.cpp ../O.Common/p2pTestIoc.dbd p2pTestIoc_registerRecordDeviceDriver /Jenkins/jenkins/jobs/epics-7.0/workspace/OS/linux64
make[4]: Leaving directory '/Jenkins/jenkins/jobs/epics-7.0/workspace/OS/linux64/modules/pva2pva/testApp/O.linux-x86_64'
make[4]: Entering directory '/Jenkins/jenkins/jobs/epics-7.0/workspace/OS/linux64/modules/pva2pva/testApp/O.linux-x86_64'
/usr/bin/g++  -D_GNU_SOURCE -D_DEFAULT_SOURCE         -DUSE_TYPED_RSET -I../../pdbApp -I../../p2pApp -I../../common   -D_X86_64_  -DUNIX  -Dlinux     -O3 -g   -Wall      -mtune=generic      -m64  -I. -I../O.Common -I. -I. -I.. -I/Jenkins/jenkins/jobs/epics-7.0/workspace/OS/linux64/include/compiler/gcc -I/Jenkins/jenkins/jobs/epics-7.0/workspace/OS/linux64/include/os/Linux -I/Jenkins/jenkins/jobs/epics-7.0/workspace/OS/linux64/include -I/Jenkins/jenkins/jobs/epics-7.0/workspace/OS/linux64/include/compiler/gcc -I/Jenkins/jenkins/jobs/epics-7.0/workspace/OS/linux64/include/os/Linux -I/Jenkins/jenkins/jobs/epics-7.0/workspace/OS/linux64/include        -MM -MF pvaLinkTestIoc_registerRecordDeviceDriver.d  pvaLinkTestIoc_registerRecordDeviceDriver.cpp
make[4]: Leaving directory '/Jenkins/jenkins/jobs/epics-7.0/workspace/OS/linux64/modules/pva2pva/testApp/O.linux-x86_64'
make[4]: Entering directory '/Jenkins/jenkins/jobs/epics-7.0/workspace/OS/linux64/modules/pva2pva/testApp/O.linux-x86_64'
/usr/bin/g++  -D_GNU_SOURCE -D_DEFAULT_SOURCE         -DUSE_TYPED_RSET -I../../pdbApp -I../../p2pApp -I../../common   -D_X86_64_  -DUNIX  -Dlinux     -O3 -g   -Wall      -mtune=generic      -m64  -I. -I../O.Common -I. -I. -I.. -I/Jenkins/jenkins/jobs/epics-7.0/workspace/OS/linux64/include/compiler/gcc -I/Jenkins/jenkins/jobs/epics-7.0/workspace/OS/linux64/include/os/Linux -I/Jenkins/jenkins/jobs/epics-7.0/workspace/OS/linux64/include -I/Jenkins/jenkins/jobs/epics-7.0/workspace/OS/linux64/include/compiler/gcc -I/Jenkins/jenkins/jobs/epics-7.0/workspace/OS/linux64/include/os/Linux -I/Jenkins/jenkins/jobs/epics-7.0/workspace/OS/linux64/include        -MM -MF p2pTestIoc_registerRecordDeviceDriver.d  p2pTestIoc_registerRecordDeviceDriver.cpp
make[4]: Leaving directory '/Jenkins/jenkins/jobs/epics-7.0/workspace/OS/linux64/modules/pva2pva/testApp/O.linux-x86_64'
make[4]: Entering directory '/Jenkins/jenkins/jobs/epics-7.0/workspace/OS/linux64/modules/pvDatabase/test/O.linux-x86_64'
/usr/bin/g++ -o testPlugin  -L/Jenkins/jenkins/jobs/epics-7.0/workspace/OS/linux64/lib/linux-x86_64 -Wl,-rpath,/Jenkins/jenkins/jobs/epics-7.0/workspace/OS/linux64/lib/linux-x86_64           -rdynamic -m64         testPlugin.o    -lpvDatabase -lpvAccessIOC -lpvAccessCA -lpvAccess -lpvData -ldbRecStd -ldbCore -lca -lCom   
make[4]: Leaving directory '/Jenkins/jenkins/jobs/epics-7.0/workspace/OS/linux64/modules/pvDatabase/test/O.linux-x86_64'
make[4]: Entering directory '/Jenkins/jenkins/jobs/epics-7.0/workspace/OS/linux64/modules/pvDatabase/test/O.linux-x86_64'
/usr/bin/g++  -D_GNU_SOURCE -D_DEFAULT_SOURCE           -D_X86_64_  -DUNIX  -Dlinux     -O3 -g   -Wall      -mtune=generic      -m64  -I. -I../O.Common -I. -I. -I.. -I../../test/src -I/Jenkins/jenkins/jobs/epics-7.0/workspace/OS/linux64/include/compiler/gcc -I/Jenkins/jenkins/jobs/epics-7.0/workspace/OS/linux64/include/os/Linux -I/Jenkins/jenkins/jobs/epics-7.0/workspace/OS/linux64/include -I/Jenkins/jenkins/jobs/epics-7.0/workspace/OS/linux64/include/compiler/gcc -I/Jenkins/jenkins/jobs/epics-7.0/workspace/OS/linux64/include/os/Linux -I/Jenkins/jenkins/jobs/epics-7.0/workspace/OS/linux64/include        -c ../../test/src/testPVAServer.cpp
make[4]: Leaving directory '/Jenkins/jenkins/jobs/epics-7.0/workspace/OS/linux64/modules/pvDatabase/test/O.linux-x86_64'
make[4]: Entering directory '/Jenkins/jenkins/jobs/epics-7.0/workspace/OS/linux64/modules/pvDatabase/test/O.linux-x86_64'
/usr/bin/g++ -o testPVCopy  -L/Jenkins/jenkins/jobs/epics-7.0/workspace/OS/linux64/lib/linux-x86_64 -Wl,-rpath,/Jenkins/jenkins/jobs/epics-7.0/workspace/OS/linux64/lib/linux-x86_64           -rdynamic -m64         testPVCopy.o    -lpvDatabase -lpvAccessIOC -lpvAccessCA -lpvAccess -lpvData -ldbRecStd -ldbCore -lca -lCom   
make[4]: Leaving directory '/Jenkins/jenkins/jobs/epics-7.0/workspace/OS/linux64/modules/pvDatabase/test/O.linux-x86_64'
make[4]: Entering directory '/Jenkins/jenkins/jobs/epics-7.0/workspace/OS/linux64/modules/pvDatabase/test/O.linux-x86_64'
/usr/bin/g++ -o testPVRecord  -L/Jenkins/jenkins/jobs/epics-7.0/workspace/OS/linux64/lib/linux-x86_64 -Wl,-rpath,/Jenkins/jenkins/jobs/epics-7.0/workspace/OS/linux64/lib/linux-x86_64           -rdynamic -m64         testPVRecord.o    -lpvDatabase -lpvAccessIOC -lpvAccessCA -lpvAccess -lpvData -ldbRecStd -ldbCore -lca -lCom   
make[4]: Leaving directory '/Jenkins/jenkins/jobs/epics-7.0/workspace/OS/linux64/modules/pvDatabase/test/O.linux-x86_64'
make[4]: Entering directory '/Jenkins/jenkins/jobs/epics-7.0/workspace/OS/linux64/modules/pvDatabase/test/O.linux-x86_64'
/usr/bin/g++ -o testExampleRecord  -L/Jenkins/jenkins/jobs/epics-7.0/workspace/OS/linux64/lib/linux-x86_64 -Wl,-rpath,/Jenkins/jenkins/jobs/epics-7.0/workspace/OS/linux64/lib/linux-x86_64           -rdynamic -m64         testExampleRecord.o    -lpvDatabase -lpvAccessIOC -lpvAccessCA -lpvAccess -lpvData -ldbRecStd -ldbCore -lca -lCom   
make[4]: Leaving directory '/Jenkins/jenkins/jobs/epics-7.0/workspace/OS/linux64/modules/pvDatabase/test/O.linux-x86_64'
make[4]: Entering directory '/Jenkins/jenkins/jobs/epics-7.0/workspace/OS/linux64/modules/pvDatabase/test/O.linux-x86_64'
/usr/bin/g++ -o testLocalProvider  -L/Jenkins/jenkins/jobs/epics-7.0/workspace/OS/linux64/lib/linux-x86_64 -Wl,-rpath,/Jenkins/jenkins/jobs/epics-7.0/workspace/OS/linux64/lib/linux-x86_64           -rdynamic -m64         testLocalProvider.o    -lpvDatabase -lpvAccessIOC -lpvAccessCA -lpvAccess -lpvData -ldbRecStd -ldbCore -lca -lCom   
make[4]: Leaving directory '/Jenkins/jenkins/jobs/epics-7.0/workspace/OS/linux64/modules/pvDatabase/test/O.linux-x86_64'
make[4]: Entering directory '/Jenkins/jenkins/jobs/epics-7.0/workspace/OS/linux64/modules/pvDatabase/test/O.linux-x86_64'
/usr/bin/g++ -o testPVAServer  -L/Jenkins/jenkins/jobs/epics-7.0/workspace/OS/linux64/lib/linux-x86_64 -Wl,-rpath,/Jenkins/jenkins/jobs/epics-7.0/workspace/OS/linux64/lib/linux-x86_64           -rdynamic -m64         testPVAServer.o    -lpvDatabase -lpvAccessIOC -lpvAccessCA -lpvAccess -lpvData -ldbRecStd -ldbCore -lca -lCom   
make[4]: Leaving directory '/Jenkins/jenkins/jobs/epics-7.0/workspace/OS/linux64/modules/pvDatabase/test/O.linux-x86_64'
make[4]: Entering directory '/Jenkins/jenkins/jobs/epics-7.0/workspace/OS/linux64/modules/pvDatabase/test/O.linux-x86_64'
perl -CSD /Jenkins/jenkins/jobs/epics-7.0/workspace/OS/linux64/bin/linux-x86_64/makeTestfile.pl linux-x86_64 linux-x86_64 testPlugin.t testPlugin
make[4]: Leaving directory '/Jenkins/jenkins/jobs/epics-7.0/workspace/OS/linux64/modules/pvDatabase/test/O.linux-x86_64'
make[4]: Entering directory '/Jenkins/jenkins/jobs/epics-7.0/workspace/OS/linux64/modules/pvDatabase/test/O.linux-x86_64'
perl -CSD /Jenkins/jenkins/jobs/epics-7.0/workspace/OS/linux64/bin/linux-x86_64/makeTestfile.pl linux-x86_64 linux-x86_64 testPVCopy.t testPVCopy
make[4]: Leaving directory '/Jenkins/jenkins/jobs/epics-7.0/workspace/OS/linux64/modules/pvDatabase/test/O.linux-x86_64'
make[4]: Entering directory '/Jenkins/jenkins/jobs/epics-7.0/workspace/OS/linux64/modules/pvDatabase/test/O.linux-x86_64'
perl -CSD /Jenkins/jenkins/jobs/epics-7.0/workspace/OS/linux64/bin/linux-x86_64/makeTestfile.pl linux-x86_64 linux-x86_64 testPVRecord.t testPVRecord
make[4]: Leaving directory '/Jenkins/jenkins/jobs/epics-7.0/workspace/OS/linux64/modules/pvDatabase/test/O.linux-x86_64'
make[4]: Entering directory '/Jenkins/jenkins/jobs/epics-7.0/workspace/OS/linux64/modules/pvDatabase/test/O.linux-x86_64'
perl -CSD /Jenkins/jenkins/jobs/epics-7.0/workspace/OS/linux64/bin/linux-x86_64/makeTestfile.pl linux-x86_64 linux-x86_64 testExampleRecord.t testExampleRecord
make[4]: Leaving directory '/Jenkins/jenkins/jobs/epics-7.0/workspace/OS/linux64/modules/pvDatabase/test/O.linux-x86_64'
make[4]: Entering directory '/Jenkins/jenkins/jobs/epics-7.0/workspace/OS/linux64/modules/pvDatabase/test/O.linux-x86_64'
perl -CSD /Jenkins/jenkins/jobs/epics-7.0/workspace/OS/linux64/bin/linux-x86_64/makeTestfile.pl linux-x86_64 linux-x86_64 testLocalProvider.t testLocalProvider
make[4]: Leaving directory '/Jenkins/jenkins/jobs/epics-7.0/workspace/OS/linux64/modules/pvDatabase/test/O.linux-x86_64'
make[4]: Entering directory '/Jenkins/jenkins/jobs/epics-7.0/workspace/OS/linux64/modules/pvDatabase/test/O.linux-x86_64'
perl -CSD /Jenkins/jenkins/jobs/epics-7.0/workspace/OS/linux64/bin/linux-x86_64/makeTestfile.pl linux-x86_64 linux-x86_64 testPVAServer.t testPVAServer
make[4]: Leaving directory '/Jenkins/jenkins/jobs/epics-7.0/workspace/OS/linux64/modules/pvDatabase/test/O.linux-x86_64'
make[4]: Entering directory '/Jenkins/jenkins/jobs/epics-7.0/workspace/OS/linux64/modules/pvaClient/src/O.linux-x86_64'
/usr/bin/g++  -D_GNU_SOURCE -D_DEFAULT_SOURCE           -D_X86_64_  -DUNIX  -Dlinux     -O3 -g   -Wall      -mtune=generic      -m64 -fPIC -I. -I../O.Common -I. -I. -I.. -I/Jenkins/jenkins/jobs/epics-7.0/workspace/OS/linux64/include/compiler/gcc -I/Jenkins/jenkins/jobs/epics-7.0/workspace/OS/linux64/include/os/Linux -I/Jenkins/jenkins/jobs/epics-7.0/workspace/OS/linux64/include -I/Jenkins/jenkins/jobs/epics-7.0/workspace/OS/linux64/include/compiler/gcc -I/Jenkins/jenkins/jobs/epics-7.0/workspace/OS/linux64/include/os/Linux -I/Jenkins/jenkins/jobs/epics-7.0/workspace/OS/linux64/include        -c ../pvaClientRPC.cpp
make[4]: Leaving directory '/Jenkins/jenkins/jobs/epics-7.0/workspace/OS/linux64/modules/pvaClient/src/O.linux-x86_64'
make[4]: Entering directory '/Jenkins/jenkins/jobs/epics-7.0/workspace/OS/linux64/modules/pvaClient/src/O.linux-x86_64'
/usr/bin/ar -rc    libpvaClient.a     pvaClient.o pvaClientPutData.o pvaClientGetData.o pvaClientMonitorData.o pvaClientChannel.o pvaClientProcess.o pvaClientGet.o pvaClientPut.o pvaClientMonitor.o pvaClientPutGet.o pvaClientMultiChannel.o pvaClientMultiGetDouble.o pvaClientMultiPutDouble.o pvaClientMultiMonitorDouble.o pvaClientNTMultiPut.o pvaClientNTMultiData.o pvaClientNTMultiGet.o pvaClientNTMultiMonitor.o pvaClientRPC.o
/usr/bin/ranlib libpvaClient.a
make[4]: Leaving directory '/Jenkins/jenkins/jobs/epics-7.0/workspace/OS/linux64/modules/pvaClient/src/O.linux-x86_64'
make[4]: Entering directory '/Jenkins/jenkins/jobs/epics-7.0/workspace/OS/linux64/modules/pva2pva/testApp/O.linux-x86_64'
/usr/bin/g++  -D_GNU_SOURCE -D_DEFAULT_SOURCE         -DUSE_TYPED_RSET -I../../pdbApp -I../../p2pApp -I../../common   -D_X86_64_  -DUNIX  -Dlinux     -O3 -g   -Wall      -mtune=generic      -m64  -I. -I../O.Common -I. -I. -I.. -I/Jenkins/jenkins/jobs/epics-7.0/workspace/OS/linux64/include/compiler/gcc -I/Jenkins/jenkins/jobs/epics-7.0/workspace/OS/linux64/include/os/Linux -I/Jenkins/jenkins/jobs/epics-7.0/workspace/OS/linux64/include -I/Jenkins/jenkins/jobs/epics-7.0/workspace/OS/linux64/include/compiler/gcc -I/Jenkins/jenkins/jobs/epics-7.0/workspace/OS/linux64/include/os/Linux -I/Jenkins/jenkins/jobs/epics-7.0/workspace/OS/linux64/include        -c ../check_consist.cpp
make[4]: Leaving directory '/Jenkins/jenkins/jobs/epics-7.0/workspace/OS/linux64/modules/pva2pva/testApp/O.linux-x86_64'
make[4]: Entering directory '/Jenkins/jenkins/jobs/epics-7.0/workspace/OS/linux64/modules/pvaClient/src/O.linux-x86_64'
/usr/bin/g++ -o libpvaClient.so.4.4.0 -shared -fPIC -Wl,-hlibpvaClient.so.4.4.0 -L/Jenkins/jenkins/jobs/epics-7.0/workspace/OS/linux64/lib/linux-x86_64 -Wl,-rpath,/Jenkins/jenkins/jobs/epics-7.0/workspace/OS/linux64/lib/linux-x86_64           -rdynamic -m64          pvaClient.o pvaClientPutData.o pvaClientGetData.o pvaClientMonitorData.o pvaClientChannel.o pvaClientProcess.o pvaClientGet.o pvaClientPut.o pvaClientMonitor.o pvaClientPutGet.o pvaClientMultiChannel.o pvaClientMultiGetDouble.o pvaClientMultiPutDouble.o pvaClientMultiMonitorDouble.o pvaClientNTMultiPut.o pvaClientNTMultiData.o pvaClientNTMultiGet.o pvaClientNTMultiMonitor.o pvaClientRPC.o   -lnt -lpvAccessIOC -lpvAccessCA -lpvAccess -lpvData -ldbRecStd -ldbCore -lca -lCom   -lpthread   -lreadline -lm -lrt -ldl -lgcc
make[4]: Leaving directory '/Jenkins/jenkins/jobs/epics-7.0/workspace/OS/linux64/modules/pvaClient/src/O.linux-x86_64'
make[4]: Entering directory '/Jenkins/jenkins/jobs/epics-7.0/workspace/OS/linux64/modules/pvaClient/src/O.linux-x86_64'
ln -s libpvaClient.so.4.4.0 /Jenkins/jenkins/jobs/epics-7.0/workspace/OS/linux64/lib/linux-x86_64/libpvaClient.so
make[4]: Leaving directory '/Jenkins/jenkins/jobs/epics-7.0/workspace/OS/linux64/modules/pvaClient/src/O.linux-x86_64'
make[4]: Entering directory '/Jenkins/jenkins/jobs/epics-7.0/workspace/OS/linux64/modules/pva2pva/testApp/O.linux-x86_64'
/usr/bin/g++  -D_GNU_SOURCE -D_DEFAULT_SOURCE         -DUSE_TYPED_RSET -I../../pdbApp -I../../p2pApp -I../../common   -D_X86_64_  -DUNIX  -Dlinux     -O3 -g   -Wall      -mtune=generic      -m64  -I. -I../O.Common -I. -I. -I.. -I/Jenkins/jenkins/jobs/epics-7.0/workspace/OS/linux64/include/compiler/gcc -I/Jenkins/jenkins/jobs/epics-7.0/workspace/OS/linux64/include/os/Linux -I/Jenkins/jenkins/jobs/epics-7.0/workspace/OS/linux64/include -I/Jenkins/jenkins/jobs/epics-7.0/workspace/OS/linux64/include/compiler/gcc -I/Jenkins/jenkins/jobs/epics-7.0/workspace/OS/linux64/include/os/Linux -I/Jenkins/jenkins/jobs/epics-7.0/workspace/OS/linux64/include        -c ../testtest.cpp
make[4]: Leaving directory '/Jenkins/jenkins/jobs/epics-7.0/workspace/OS/linux64/modules/pva2pva/testApp/O.linux-x86_64'
make[4]: Entering directory '/Jenkins/jenkins/jobs/epics-7.0/workspace/OS/linux64/modules/pva2pva/testApp/O.linux-x86_64'
/usr/bin/g++  -D_GNU_SOURCE -D_DEFAULT_SOURCE         -DUSE_TYPED_RSET -I../../pdbApp -I../../p2pApp -I../../common   -D_X86_64_  -DUNIX  -Dlinux     -O3 -g   -Wall      -mtune=generic      -m64  -I. -I../O.Common -I. -I. -I.. -I/Jenkins/jenkins/jobs/epics-7.0/workspace/OS/linux64/include/compiler/gcc -I/Jenkins/jenkins/jobs/epics-7.0/workspace/OS/linux64/include/os/Linux -I/Jenkins/jenkins/jobs/epics-7.0/workspace/OS/linux64/include -I/Jenkins/jenkins/jobs/epics-7.0/workspace/OS/linux64/include/compiler/gcc -I/Jenkins/jenkins/jobs/epics-7.0/workspace/OS/linux64/include/os/Linux -I/Jenkins/jenkins/jobs/epics-7.0/workspace/OS/linux64/include        -c p2pTestIoc_registerRecordDeviceDriver.cpp
make[4]: Leaving directory '/Jenkins/jenkins/jobs/epics-7.0/workspace/OS/linux64/modules/pva2pva/testApp/O.linux-x86_64'
make[4]: Entering directory '/Jenkins/jenkins/jobs/epics-7.0/workspace/OS/linux64/modules/pva2pva/testApp/O.linux-x86_64'
/usr/bin/g++  -D_GNU_SOURCE -D_DEFAULT_SOURCE         -DUSE_TYPED_RSET -I../../pdbApp -I../../p2pApp -I../../common   -D_X86_64_  -DUNIX  -Dlinux     -O3 -g   -Wall      -mtune=generic      -m64  -I. -I../O.Common -I. -I. -I.. -I/Jenkins/jenkins/jobs/epics-7.0/workspace/OS/linux64/include/compiler/gcc -I/Jenkins/jenkins/jobs/epics-7.0/workspace/OS/linux64/include/os/Linux -I/Jenkins/jenkins/jobs/epics-7.0/workspace/OS/linux64/include -I/Jenkins/jenkins/jobs/epics-7.0/workspace/OS/linux64/include/compiler/gcc -I/Jenkins/jenkins/jobs/epics-7.0/workspace/OS/linux64/include/os/Linux -I/Jenkins/jenkins/jobs/epics-7.0/workspace/OS/linux64/include        -c ../testweak.cpp
make[4]: Leaving directory '/Jenkins/jenkins/jobs/epics-7.0/workspace/OS/linux64/modules/pva2pva/testApp/O.linux-x86_64'
make[4]: Entering directory '/Jenkins/jenkins/jobs/epics-7.0/workspace/OS/linux64/modules/pva2pva/testApp/O.linux-x86_64'
/usr/bin/g++  -D_GNU_SOURCE -D_DEFAULT_SOURCE         -DUSE_TYPED_RSET -I../../pdbApp -I../../p2pApp -I../../common   -D_X86_64_  -DUNIX  -Dlinux     -O3 -g   -Wall      -mtune=generic      -m64  -I. -I../O.Common -I. -I. -I.. -I/Jenkins/jenkins/jobs/epics-7.0/workspace/OS/linux64/include/compiler/gcc -I/Jenkins/jenkins/jobs/epics-7.0/workspace/OS/linux64/include/os/Linux -I/Jenkins/jenkins/jobs/epics-7.0/workspace/OS/linux64/include -I/Jenkins/jenkins/jobs/epics-7.0/workspace/OS/linux64/include/compiler/gcc -I/Jenkins/jenkins/jobs/epics-7.0/workspace/OS/linux64/include/os/Linux -I/Jenkins/jenkins/jobs/epics-7.0/workspace/OS/linux64/include        -c ../utilitiesx.cpp
make[4]: Leaving directory '/Jenkins/jenkins/jobs/epics-7.0/workspace/OS/linux64/modules/pva2pva/testApp/O.linux-x86_64'
make[4]: Entering directory '/Jenkins/jenkins/jobs/epics-7.0/workspace/OS/linux64/modules/pva2pva/testApp/O.linux-x86_64'
/usr/bin/g++  -D_GNU_SOURCE -D_DEFAULT_SOURCE         -DUSE_TYPED_RSET -I../../pdbApp -I../../p2pApp -I../../common   -D_X86_64_  -DUNIX  -Dlinux     -O3 -g   -Wall      -mtune=generic      -m64  -I. -I../O.Common -I. -I. -I.. -I/Jenkins/jenkins/jobs/epics-7.0/workspace/OS/linux64/include/compiler/gcc -I/Jenkins/jenkins/jobs/epics-7.0/workspace/OS/linux64/include/os/Linux -I/Jenkins/jenkins/jobs/epics-7.0/workspace/OS/linux64/include -I/Jenkins/jenkins/jobs/epics-7.0/workspace/OS/linux64/include/compiler/gcc -I/Jenkins/jenkins/jobs/epics-7.0/workspace/OS/linux64/include/os/Linux -I/Jenkins/jenkins/jobs/epics-7.0/workspace/OS/linux64/include        -c pvaLinkTestIoc_registerRecordDeviceDriver.cpp
make[4]: Leaving directory '/Jenkins/jenkins/jobs/epics-7.0/workspace/OS/linux64/modules/pva2pva/testApp/O.linux-x86_64'
make[4]: Entering directory '/Jenkins/jenkins/jobs/epics-7.0/workspace/OS/linux64/modules/pva2pva/testApp/O.linux-x86_64'
/usr/bin/g++  -D_GNU_SOURCE -D_DEFAULT_SOURCE         -DUSE_TYPED_RSET -I../../pdbApp -I../../p2pApp -I../../common   -D_X86_64_  -DUNIX  -Dlinux     -O3 -g   -Wall      -mtune=generic      -m64  -I. -I../O.Common -I. -I. -I.. -I/Jenkins/jenkins/jobs/epics-7.0/workspace/OS/linux64/include/compiler/gcc -I/Jenkins/jenkins/jobs/epics-7.0/workspace/OS/linux64/include/os/Linux -I/Jenkins/jenkins/jobs/epics-7.0/workspace/OS/linux64/include -I/Jenkins/jenkins/jobs/epics-7.0/workspace/OS/linux64/include/compiler/gcc -I/Jenkins/jenkins/jobs/epics-7.0/workspace/OS/linux64/include/os/Linux -I/Jenkins/jenkins/jobs/epics-7.0/workspace/OS/linux64/include        -c ../testpvalink.cpp
make[4]: Leaving directory '/Jenkins/jenkins/jobs/epics-7.0/workspace/OS/linux64/modules/pva2pva/testApp/O.linux-x86_64'
make[4]: Entering directory '/Jenkins/jenkins/jobs/epics-7.0/workspace/OS/linux64/modules/pva2pva/testApp/O.linux-x86_64'
/usr/bin/g++  -D_GNU_SOURCE -D_DEFAULT_SOURCE         -DUSE_TYPED_RSET -I../../pdbApp -I../../p2pApp -I../../common   -D_X86_64_  -DUNIX  -Dlinux     -O3 -g   -Wall      -mtune=generic      -m64  -I. -I../O.Common -I. -I. -I.. -I/Jenkins/jenkins/jobs/epics-7.0/workspace/OS/linux64/include/compiler/gcc -I/Jenkins/jenkins/jobs/epics-7.0/workspace/OS/linux64/include/os/Linux -I/Jenkins/jenkins/jobs/epics-7.0/workspace/OS/linux64/include -I/Jenkins/jenkins/jobs/epics-7.0/workspace/OS/linux64/include/compiler/gcc -I/Jenkins/jenkins/jobs/epics-7.0/workspace/OS/linux64/include/os/Linux -I/Jenkins/jenkins/jobs/epics-7.0/workspace/OS/linux64/include        -c ../testgroupconfig.cpp
make[4]: Leaving directory '/Jenkins/jenkins/jobs/epics-7.0/workspace/OS/linux64/modules/pva2pva/testApp/O.linux-x86_64'
make[4]: Entering directory '/Jenkins/jenkins/jobs/epics-7.0/workspace/OS/linux64/modules/pva2pva/testApp/O.linux-x86_64'
/usr/bin/g++ -o check_consist  -L/Jenkins/jenkins/jobs/epics-7.0/workspace/OS/linux64/lib/linux-x86_64 -Wl,-rpath,/Jenkins/jenkins/jobs/epics-7.0/workspace/OS/linux64/lib/linux-x86_64           -rdynamic -m64         check_consist.o utilitiesx.o   -lpvAccess -lpvData -ldbRecStd -ldbCore -lca -lCom   
make[4]: Leaving directory '/Jenkins/jenkins/jobs/epics-7.0/workspace/OS/linux64/modules/pva2pva/testApp/O.linux-x86_64'
make[4]: Entering directory '/Jenkins/jenkins/jobs/epics-7.0/workspace/OS/linux64/modules/pva2pva/testApp/O.linux-x86_64'
/usr/bin/g++  -D_GNU_SOURCE -D_DEFAULT_SOURCE         -DUSE_TYPED_RSET -I../../pdbApp -I../../p2pApp -I../../common   -D_X86_64_  -DUNIX  -Dlinux     -O3 -g   -Wall      -mtune=generic      -m64  -I. -I../O.Common -I. -I. -I.. -I/Jenkins/jenkins/jobs/epics-7.0/workspace/OS/linux64/include/compiler/gcc -I/Jenkins/jenkins/jobs/epics-7.0/workspace/OS/linux64/include/os/Linux -I/Jenkins/jenkins/jobs/epics-7.0/workspace/OS/linux64/include -I/Jenkins/jenkins/jobs/epics-7.0/workspace/OS/linux64/include/compiler/gcc -I/Jenkins/jenkins/jobs/epics-7.0/workspace/OS/linux64/include/os/Linux -I/Jenkins/jenkins/jobs/epics-7.0/workspace/OS/linux64/include        -c ../testpdb.cpp
make[4]: Leaving directory '/Jenkins/jenkins/jobs/epics-7.0/workspace/OS/linux64/modules/pva2pva/testApp/O.linux-x86_64'
make[4]: Entering directory '/Jenkins/jenkins/jobs/epics-7.0/workspace/OS/linux64/modules/pva2pva/testApp/O.linux-x86_64'
/usr/bin/g++  -D_GNU_SOURCE -D_DEFAULT_SOURCE         -DUSE_TYPED_RSET -I../../pdbApp -I../../p2pApp -I../../common   -D_X86_64_  -DUNIX  -Dlinux     -O3 -g   -Wall      -mtune=generic      -m64  -I. -I../O.Common -I. -I. -I.. -I/Jenkins/jenkins/jobs/epics-7.0/workspace/OS/linux64/include/compiler/gcc -I/Jenkins/jenkins/jobs/epics-7.0/workspace/OS/linux64/include/os/Linux -I/Jenkins/jenkins/jobs/epics-7.0/workspace/OS/linux64/include -I/Jenkins/jenkins/jobs/epics-7.0/workspace/OS/linux64/include/compiler/gcc -I/Jenkins/jenkins/jobs/epics-7.0/workspace/OS/linux64/include/os/Linux -I/Jenkins/jenkins/jobs/epics-7.0/workspace/OS/linux64/include        -c ../testpvif.cpp
make[4]: Leaving directory '/Jenkins/jenkins/jobs/epics-7.0/workspace/OS/linux64/modules/pva2pva/testApp/O.linux-x86_64'
make[4]: Entering directory '/Jenkins/jenkins/jobs/epics-7.0/workspace/OS/linux64/modules/pva2pva/testApp/O.linux-x86_64'
/usr/bin/g++ -o testweak  -L/Jenkins/jenkins/jobs/epics-7.0/workspace/OS/linux64/lib/linux-x86_64 -Wl,-rpath,/Jenkins/jenkins/jobs/epics-7.0/workspace/OS/linux64/lib/linux-x86_64           -rdynamic -m64         testweak.o utilitiesx.o   -lCom -lpvAccess -lpvData -ldbRecStd -ldbCore -lca -lCom   
make[4]: Leaving directory '/Jenkins/jenkins/jobs/epics-7.0/workspace/OS/linux64/modules/pva2pva/testApp/O.linux-x86_64'
make[4]: Entering directory '/Jenkins/jenkins/jobs/epics-7.0/workspace/OS/linux64/modules/pva2pva/testApp/O.linux-x86_64'
/usr/bin/g++ -o testtest  -L/Jenkins/jenkins/jobs/epics-7.0/workspace/OS/linux64/lib/linux-x86_64 -Wl,-rpath,/Jenkins/jenkins/jobs/epics-7.0/workspace/OS/linux64/lib/linux-x86_64           -rdynamic -m64         testtest.o utilitiesx.o   -lpvAccess -lpvData -ldbRecStd -ldbCore -lca -lCom   
make[4]: Leaving directory '/Jenkins/jenkins/jobs/epics-7.0/workspace/OS/linux64/modules/pva2pva/testApp/O.linux-x86_64'
make[4]: Entering directory '/Jenkins/jenkins/jobs/epics-7.0/workspace/OS/linux64/modules/pva2pva/testApp/O.linux-x86_64'
/usr/bin/g++ -o testpvif  -L/Jenkins/jenkins/jobs/epics-7.0/workspace/OS/linux64/lib/linux-x86_64 -Wl,-rpath,/Jenkins/jenkins/jobs/epics-7.0/workspace/OS/linux64/lib/linux-x86_64           -rdynamic -m64         testpvif.o p2pTestIoc_registerRecordDeviceDriver.o utilitiesx.o   -lqsrv -lpvAccess -lpvData -ldbRecStd -ldbCore -lca -lCom   
make[4]: Leaving directory '/Jenkins/jenkins/jobs/epics-7.0/workspace/OS/linux64/modules/pva2pva/testApp/O.linux-x86_64'
make[4]: Entering directory '/Jenkins/jenkins/jobs/epics-7.0/workspace/OS/linux64/modules/pva2pva/testApp/O.linux-x86_64'
/usr/bin/g++ -o testpdb  -L/Jenkins/jenkins/jobs/epics-7.0/workspace/OS/linux64/lib/linux-x86_64 -Wl,-rpath,/Jenkins/jenkins/jobs/epics-7.0/workspace/OS/linux64/lib/linux-x86_64           -rdynamic -m64         testpdb.o p2pTestIoc_registerRecordDeviceDriver.o utilitiesx.o   -lqsrv -lpvAccess -lpvData -ldbRecStd -ldbCore -lca -lCom   
make[4]: Leaving directory '/Jenkins/jenkins/jobs/epics-7.0/workspace/OS/linux64/modules/pva2pva/testApp/O.linux-x86_64'
make[4]: Entering directory '/Jenkins/jenkins/jobs/epics-7.0/workspace/OS/linux64/modules/pva2pva/testApp/O.linux-x86_64'
perl -CSD /Jenkins/jenkins/jobs/epics-7.0/workspace/OS/linux64/bin/linux-x86_64/makeTestfile.pl linux-x86_64 linux-x86_64 testweak.t testweak
make[4]: Leaving directory '/Jenkins/jenkins/jobs/epics-7.0/workspace/OS/linux64/modules/pva2pva/testApp/O.linux-x86_64'
make[4]: Entering directory '/Jenkins/jenkins/jobs/epics-7.0/workspace/OS/linux64/modules/pva2pva/testApp/O.linux-x86_64'
perl -CSD /Jenkins/jenkins/jobs/epics-7.0/workspace/OS/linux64/bin/linux-x86_64/makeTestfile.pl linux-x86_64 linux-x86_64 testtest.t testtest
make[4]: Leaving directory '/Jenkins/jenkins/jobs/epics-7.0/workspace/OS/linux64/modules/pva2pva/testApp/O.linux-x86_64'
make[4]: Entering directory '/Jenkins/jenkins/jobs/epics-7.0/workspace/OS/linux64/modules/pva2pva/testApp/O.linux-x86_64'
perl -CSD /Jenkins/jenkins/jobs/epics-7.0/workspace/OS/linux64/bin/linux-x86_64/makeTestfile.pl linux-x86_64 linux-x86_64 testpvif.t testpvif
make[4]: Leaving directory '/Jenkins/jenkins/jobs/epics-7.0/workspace/OS/linux64/modules/pva2pva/testApp/O.linux-x86_64'
make[4]: Entering directory '/Jenkins/jenkins/jobs/epics-7.0/workspace/OS/linux64/modules/pva2pva/testApp/O.linux-x86_64'
perl -CSD /Jenkins/jenkins/jobs/epics-7.0/workspace/OS/linux64/bin/linux-x86_64/makeTestfile.pl linux-x86_64 linux-x86_64 testpdb.t testpdb
make[4]: Leaving directory '/Jenkins/jenkins/jobs/epics-7.0/workspace/OS/linux64/modules/pva2pva/testApp/O.linux-x86_64'
make[4]: Entering directory '/Jenkins/jenkins/jobs/epics-7.0/workspace/OS/linux64/modules/pva2pva/testApp/O.linux-x86_64'
/usr/bin/g++ -o testpvalink  -L/Jenkins/jenkins/jobs/epics-7.0/workspace/OS/linux64/lib/linux-x86_64 -Wl,-rpath,/Jenkins/jenkins/jobs/epics-7.0/workspace/OS/linux64/lib/linux-x86_64           -rdynamic -m64         testpvalink.o pvaLinkTestIoc_registerRecordDeviceDriver.o utilitiesx.o   -lqsrv -lpvAccess -lpvData -ldbRecStd -ldbCore -lca -lCom   
make[4]: Leaving directory '/Jenkins/jenkins/jobs/epics-7.0/workspace/OS/linux64/modules/pva2pva/testApp/O.linux-x86_64'
make[4]: Entering directory '/Jenkins/jenkins/jobs/epics-7.0/workspace/OS/linux64/modules/pva2pva/testApp/O.linux-x86_64'
perl -CSD /Jenkins/jenkins/jobs/epics-7.0/workspace/OS/linux64/bin/linux-x86_64/makeTestfile.pl linux-x86_64 linux-x86_64 testpvalink.t testpvalink
make[4]: Leaving directory '/Jenkins/jenkins/jobs/epics-7.0/workspace/OS/linux64/modules/pva2pva/testApp/O.linux-x86_64'
make[4]: Entering directory '/Jenkins/jenkins/jobs/epics-7.0/workspace/OS/linux64/modules/pva2pva/testApp/O.linux-x86_64'
/usr/bin/g++ -o testgroupconfig  -L/Jenkins/jenkins/jobs/epics-7.0/workspace/OS/linux64/lib/linux-x86_64 -Wl,-rpath,/Jenkins/jenkins/jobs/epics-7.0/workspace/OS/linux64/lib/linux-x86_64           -rdynamic -m64         testgroupconfig.o utilitiesx.o   -lqsrv -lpvAccess -lpvData -ldbRecStd -ldbCore -lca -lCom -lpvAccess -lpvData -ldbRecStd -ldbCore -lca -lCom   
make[4]: Leaving directory '/Jenkins/jenkins/jobs/epics-7.0/workspace/OS/linux64/modules/pva2pva/testApp/O.linux-x86_64'
make[4]: Entering directory '/Jenkins/jenkins/jobs/epics-7.0/workspace/OS/linux64/modules/pva2pva/testApp/O.linux-x86_64'
perl -CSD /Jenkins/jenkins/jobs/epics-7.0/workspace/OS/linux64/bin/linux-x86_64/makeTestfile.pl linux-x86_64 linux-x86_64 testgroupconfig.t testgroupconfig
make[4]: Leaving directory '/Jenkins/jenkins/jobs/epics-7.0/workspace/OS/linux64/modules/pva2pva/testApp/O.linux-x86_64'
make[4]: Entering directory '/Jenkins/jenkins/jobs/epics-7.0/workspace/OS/linux64/modules/pva2pva/testApp/O.linux-x86_64'
/usr/bin/g++  -D_GNU_SOURCE -D_DEFAULT_SOURCE         -DUSE_TYPED_RSET -I../../pdbApp -I../../p2pApp -I../../common   -D_X86_64_  -DUNIX  -Dlinux     -O3 -g   -Wall      -mtune=generic      -m64  -I. -I../O.Common -I. -I. -I.. -I/Jenkins/jenkins/jobs/epics-7.0/workspace/OS/linux64/include/compiler/gcc -I/Jenkins/jenkins/jobs/epics-7.0/workspace/OS/linux64/include/os/Linux -I/Jenkins/jenkins/jobs/epics-7.0/workspace/OS/linux64/include -I/Jenkins/jenkins/jobs/epics-7.0/workspace/OS/linux64/include/compiler/gcc -I/Jenkins/jenkins/jobs/epics-7.0/workspace/OS/linux64/include/os/Linux -I/Jenkins/jenkins/jobs/epics-7.0/workspace/OS/linux64/include        -c ../testdbf_copy.cpp
make[4]: Leaving directory '/Jenkins/jenkins/jobs/epics-7.0/workspace/OS/linux64/modules/pva2pva/testApp/O.linux-x86_64'
make[4]: Entering directory '/Jenkins/jenkins/jobs/epics-7.0/workspace/OS/linux64/modules/pva2pva/testApp/O.linux-x86_64'
/usr/bin/g++ -o testdbf_copy  -L/Jenkins/jenkins/jobs/epics-7.0/workspace/OS/linux64/lib/linux-x86_64 -Wl,-rpath,/Jenkins/jenkins/jobs/epics-7.0/workspace/OS/linux64/lib/linux-x86_64           -rdynamic -m64         testdbf_copy.o utilitiesx.o   -lqsrv -lpvAccess -lpvData -ldbRecStd -ldbCore -lca -lCom -lpvAccess -lpvData -ldbRecStd -ldbCore -lca -lCom   
make[4]: Leaving directory '/Jenkins/jenkins/jobs/epics-7.0/workspace/OS/linux64/modules/pva2pva/testApp/O.linux-x86_64'
make[4]: Entering directory '/Jenkins/jenkins/jobs/epics-7.0/workspace/OS/linux64/modules/pva2pva/testApp/O.linux-x86_64'
perl -CSD /Jenkins/jenkins/jobs/epics-7.0/workspace/OS/linux64/bin/linux-x86_64/makeTestfile.pl linux-x86_64 linux-x86_64 testdbf_copy.t testdbf_copy
make[4]: Leaving directory '/Jenkins/jenkins/jobs/epics-7.0/workspace/OS/linux64/modules/pva2pva/testApp/O.linux-x86_64'
/Jenkins/jenkins/bin/make -C ./iocBoot install.linux-x86_64 
/Jenkins/jenkins/bin/make -C ./iocimagedemo install.linux-x86_64 
/Jenkins/jenkins/bin/make -C ./iocpvalink install.linux-x86_64 
/Jenkins/jenkins/bin/make -C ./iocwfdemo install.linux-x86_64 
make[4]: Nothing to be done for 'install.linux-x86_64'.
make[4]: Nothing to be done for 'install.linux-x86_64'.
make[4]: Nothing to be done for 'install.linux-x86_64'.
+ /Jenkins/jenkins/bin/make -j4 -O
/Jenkins/jenkins/bin/make -C ./configure install 
/Jenkins/jenkins/bin/make -C O.linux-x86_64 -f ../Makefile TOP=../.. \
    T_A=linux-x86_64 install
make[2]: Nothing to be done for 'install'.
/Jenkins/jenkins/bin/make -C O.vxWorks-ppc32 -f ../Makefile TOP=../.. \
    T_A=vxWorks-ppc32 install
/Jenkins/jenkins/bin/make -C O.vxWorks-ppc32sf -f ../Makefile TOP=../.. \
    T_A=vxWorks-ppc32sf install
/Jenkins/jenkins/bin/make -C O.RTEMS-uC5282 -f ../Makefile TOP=../.. \
    T_A=RTEMS-uC5282 install
make[2]: Entering directory '/Jenkins/jenkins/jobs/epics-7.0/workspace/OS/linux64/configure/O.RTEMS-uC5282'
../../configure/os/CONFIG.Common.RTEMS:36: /usr/local/vw/rtems/rtems-4.10.2/m68k-rtems4.10.2/uC5282/Makefile.inc: Stale file handle
make[2]: Leaving directory '/Jenkins/jenkins/jobs/epics-7.0/workspace/OS/linux64/configure/O.RTEMS-uC5282'
make[2]: stat: /usr/local/vw/rtems/rtems-4.10.2/m68k-rtems4.10.2/uC5282/Makefile.inc: Stale file handle
make[2]: *** No rule to make target '/usr/local/vw/rtems/rtems-4.10.2/m68k-rtems4.10.2/uC5282/Makefile.inc'.  Stop.
../configure/RULES_ARCHS:58: recipe for target 'install.RTEMS-uC5282' failed
make[1]: *** [install.RTEMS-uC5282] Error 2
make[1]: *** Waiting for unfinished jobs....
make[2]: Nothing to be done for 'install'.
make[2]: Nothing to be done for 'install'.
configure/RULES_DIRS:84: recipe for target 'configure.install' failed
make: *** [configure.install] Error 2
Build step 'Execute shell' marked build as failure
[WARNINGS] Skipping publisher since build result is FAILURE
TAP Reports Processing: START
Looking for TAP results report in workspace using pattern: **/O.*/*.tap
Did not find any matching files.

References:
Build failed in Jenkins: epics-7.0 » linux64 #98 APS Jenkins via Core-talk

Navigate by Date:
Prev: Build failed in Jenkins: epics-7.0 » linux32 #99 APS Jenkins via Core-talk
Next: Jenkins build is unstable: epics-7.0 » mac #99 APS Jenkins via Core-talk
Index: 2002  2003  2004  2005  2006  2007  2008  2009  2010  2011  2012  2013  2014  2015  2016  2017  2018  <20192020 
Navigate by Thread:
Prev: Build failed in Jenkins: epics-7.0 » linux64 #98 APS Jenkins via Core-talk
Next: Build failed in Jenkins: epics-base-7.0-win64-test #3 APS Jenkins via Core-talk
Index: 2002  2003  2004  2005  2006  2007  2008  2009  2010  2011  2012  2013  2014  2015  2016  2017  2018  <20192020 
ANJ, 11 Mar 2019 Valid HTML 4.01! · Home · News · About · Base · Modules · Extensions · Distributions · Download ·
· Search · EPICS V4 · IRMIS · Talk · Bugs · Documents · Links · Licensing ·