Argonne National Laboratory

Experimental Physics and
Industrial Control System

2002  2003  2004  2005  2006  2007  2008  2009  2010  2011  2012  2013  2014  2015  2016  2017  2018  <20192020  Index 2002  2003  2004  2005  2006  2007  2008  2009  2010  2011  2012  2013  2014  2015  2016  2017  2018  <20192020 
<== Date ==> <== Thread ==>

Subject: Build failed in Jenkins: epics-base-7.0-win64-test #3
From: APS Jenkins via Core-talk <core-talk@aps.anl.gov>
To: core-talk@aps.anl.gov
Date: Fri, 8 Mar 2019 17:16:50 -0600 (CST)
See <https://jenkins.aps.anl.gov/job/epics-base-7.0-win64-test/3/display/redirect>

------------------------------------------
[...truncated 21.66 KB...]
make[3]: Entering directory '<https://jenkins.aps.anl.gov/job/epics-base-7.0-win64-test/ws/modules/libcom/RTEMS'>
make -C O.windows-x64 -f ../Makefile TOP=../.. \
    T_A=windows-x64 test-results
make[4]: Entering directory '<https://jenkins.aps.anl.gov/job/epics-base-7.0-win64-test/ws/modules/libcom/RTEMS/O.windows-x64'>
make[4]: Nothing to be done for 'test-results'.
make[4]: Leaving directory '<https://jenkins.aps.anl.gov/job/epics-base-7.0-win64-test/ws/modules/libcom/RTEMS/O.windows-x64'>
make[3]: Leaving directory '<https://jenkins.aps.anl.gov/job/epics-base-7.0-win64-test/ws/modules/libcom/RTEMS'>
make -C ./vxWorks test-results 
make[3]: Entering directory '<https://jenkins.aps.anl.gov/job/epics-base-7.0-win64-test/ws/modules/libcom/vxWorks'>
make -C O.windows-x64 -f ../Makefile TOP=../.. \
    T_A=windows-x64 test-results
make[4]: Entering directory '<https://jenkins.aps.anl.gov/job/epics-base-7.0-win64-test/ws/modules/libcom/vxWorks/O.windows-x64'>
make[4]: Nothing to be done for 'test-results'.
make[4]: Leaving directory '<https://jenkins.aps.anl.gov/job/epics-base-7.0-win64-test/ws/modules/libcom/vxWorks/O.windows-x64'>
make[3]: Leaving directory '<https://jenkins.aps.anl.gov/job/epics-base-7.0-win64-test/ws/modules/libcom/vxWorks'>
make -C ./test test-results 
make[3]: Entering directory '<https://jenkins.aps.anl.gov/job/epics-base-7.0-win64-test/ws/modules/libcom/test'>
make -C O.windows-x64 -f ../Makefile TOP=../.. \
    T_A=windows-x64 test-results
make[4]: Entering directory '<https://jenkins.aps.anl.gov/job/epics-base-7.0-win64-test/ws/modules/libcom/test/O.windows-x64'>
prove --failures --ext .tap --exec "perl -CSD -MExtUtils::Command -e cat" --color epicsUnitTestTest.tap epicsTypesTest.tap epicsInlineTest.tap epicsCalcTest.tap epicsAlgorithmTest.tap epicsMathTest.tap epicsMMIOTest.tap epicsEllTest.tap epicsEnvTest.tap epicsEnvUnsetTest.tap epicsErrlogTest.tap epicsStdioTest.tap epicsStdlibTest.tap epicsSockResolveTest.tap epicsStringTest.tap epicsTimeTest.tap epicsTimeZoneTest.tap epicsThreadTest.tap epicsThreadOnceTest.tap epicsThreadPriorityTest.tap epicsThreadPrivateTest.tap epicsThreadHooksTest.tap epicsThreadPoolTest.tap epicsExitTest.tap epicsTimerTest.tap ringPointerTest.tap ringBytesTest.tap epicsEventTest.tap epicsMutexTest.tap epicsSpinTest.tap epicsAtomicTest.tap macDefExpandTest.tap cvtFastTest.tap macLibTest.tap aslibtest.tap macLib.tap taskwdTest.tap blockingSockTest.tap epicsMessageQueueTest.tap epicsStackTraceTest.tap ipAddrToAsciiTest.tap osiSockTest.tap
epicsUnitTestTest.tap ........ ok
epicsTypesTest.tap ........... ok
epicsInlineTest.tap .......... ok
epicsCalcTest.tap ............ ok
epicsAlgorithmTest.tap ....... ok
epicsMathTest.tap ............ ok
epicsMMIOTest.tap ............ ok
epicsEllTest.tap ............. ok
epicsEnvTest.tap ............. ok
epicsEnvUnsetTest.tap ........ ok
epicsErrlogTest.tap .......... ok
epicsStdioTest.tap ........... ok
epicsStdlibTest.tap .......... ok
epicsSockResolveTest.tap ..... ok
epicsStringTest.tap .......... ok
epicsTimeTest.tap ............ ok
epicsTimeZoneTest.tap ........ ok
epicsThreadTest.tap .......... ok
epicsThreadOnceTest.tap ...... ok
epicsThreadPriorityTest.tap .. ok
epicsThreadPrivateTest.tap ... ok
epicsThreadHooksTest.tap ..... ok
epicsThreadPoolTest.tap ...... ok
epicsExitTest.tap ............ ok
epicsTimerTest.tap ........... ok
ringPointerTest.tap .......... ok
ringBytesTest.tap ............ ok
epicsEventTest.tap ........... ok
epicsMutexTest.tap ........... ok
epicsSpinTest.tap ............ ok
epicsAtomicTest.tap .......... ok
macDefExpandTest.tap ......... ok
cvtFastTest.tap .............. ok
macLibTest.tap ............... ok
aslibtest.tap ................ ok
macLib.tap ................... ok
taskwdTest.tap ............... ok
blockingSockTest.tap ......... ok
epicsMessageQueueTest.tap .... ok
epicsStackTraceTest.tap ...... ok
ipAddrToAsciiTest.tap ........ ok
osiSockTest.tap .............. ok
All tests successful.

Test Summary Report
-------------------
epicsMathTest.tap          (Wstat: 0 Tests: 35 Failed: 0)
  TODO passed:   8-9, 11-12, 22-23
Files=42, Tests=4091,  5 wallclock secs ( 0.77 usr +  0.62 sys =  1.39 CPU)
Result: PASS
make[4]: Leaving directory '<https://jenkins.aps.anl.gov/job/epics-base-7.0-win64-test/ws/modules/libcom/test/O.windows-x64'>
make[3]: Leaving directory '<https://jenkins.aps.anl.gov/job/epics-base-7.0-win64-test/ws/modules/libcom/test'>
make[2]: Leaving directory '<https://jenkins.aps.anl.gov/job/epics-base-7.0-win64-test/ws/modules/libcom'>
make -C ./ca test-results 
make[2]: Entering directory '<https://jenkins.aps.anl.gov/job/epics-base-7.0-win64-test/ws/modules/ca'>
make -C ./configure test-results 
make[3]: Entering directory '<https://jenkins.aps.anl.gov/job/epics-base-7.0-win64-test/ws/modules/ca/configure'>
make -C O.windows-x64 -f ../Makefile TOP=../.. \
    T_A=windows-x64 test-results
make[4]: Entering directory '<https://jenkins.aps.anl.gov/job/epics-base-7.0-win64-test/ws/modules/ca/configure/O.windows-x64'>
make[4]: Nothing to be done for 'test-results'.
make[4]: Leaving directory '<https://jenkins.aps.anl.gov/job/epics-base-7.0-win64-test/ws/modules/ca/configure/O.windows-x64'>
make[3]: Leaving directory '<https://jenkins.aps.anl.gov/job/epics-base-7.0-win64-test/ws/modules/ca/configure'>
make -C ./src test-results 
make[3]: Entering directory '<https://jenkins.aps.anl.gov/job/epics-base-7.0-win64-test/ws/modules/ca/src'>
make -C ./client test-results 
make[4]: Entering directory '<https://jenkins.aps.anl.gov/job/epics-base-7.0-win64-test/ws/modules/ca/src/client'>
make -C O.windows-x64 -f ../Makefile TOP=../../.. \
    T_A=windows-x64 test-results
make[5]: Entering directory '<https://jenkins.aps.anl.gov/job/epics-base-7.0-win64-test/ws/modules/ca/src/client/O.windows-x64'>
make[5]: Nothing to be done for 'test-results'.
make[5]: Leaving directory '<https://jenkins.aps.anl.gov/job/epics-base-7.0-win64-test/ws/modules/ca/src/client/O.windows-x64'>
make[4]: Leaving directory '<https://jenkins.aps.anl.gov/job/epics-base-7.0-win64-test/ws/modules/ca/src/client'>
make -C ./tools test-results 
make[4]: Entering directory '<https://jenkins.aps.anl.gov/job/epics-base-7.0-win64-test/ws/modules/ca/src/tools'>
make -C O.windows-x64 -f ../Makefile TOP=../../.. \
    T_A=windows-x64 test-results
make[5]: Entering directory '<https://jenkins.aps.anl.gov/job/epics-base-7.0-win64-test/ws/modules/ca/src/tools/O.windows-x64'>
make[5]: Nothing to be done for 'test-results'.
make[5]: Leaving directory '<https://jenkins.aps.anl.gov/job/epics-base-7.0-win64-test/ws/modules/ca/src/tools/O.windows-x64'>
make[4]: Leaving directory '<https://jenkins.aps.anl.gov/job/epics-base-7.0-win64-test/ws/modules/ca/src/tools'>
make -C ./perl test-results 
make[4]: Entering directory '<https://jenkins.aps.anl.gov/job/epics-base-7.0-win64-test/ws/modules/ca/src/perl'>
make -C O.windows-x64 -f ../Makefile TOP=../../.. \
    T_A=windows-x64 test-results
make[5]: Entering directory '<https://jenkins.aps.anl.gov/job/epics-base-7.0-win64-test/ws/modules/ca/src/perl/O.windows-x64'>
make[5]: Nothing to be done for 'test-results'.
make[5]: Leaving directory '<https://jenkins.aps.anl.gov/job/epics-base-7.0-win64-test/ws/modules/ca/src/perl/O.windows-x64'>
make[4]: Leaving directory '<https://jenkins.aps.anl.gov/job/epics-base-7.0-win64-test/ws/modules/ca/src/perl'>
make -C ./template test-results 
make[4]: Entering directory '<https://jenkins.aps.anl.gov/job/epics-base-7.0-win64-test/ws/modules/ca/src/template'>
make -C O.windows-x64 -f ../Makefile TOP=../../.. \
    T_A=windows-x64 test-results
make[5]: Entering directory '<https://jenkins.aps.anl.gov/job/epics-base-7.0-win64-test/ws/modules/ca/src/template/O.windows-x64'>
make[5]: Nothing to be done for 'test-results'.
make[5]: Leaving directory '<https://jenkins.aps.anl.gov/job/epics-base-7.0-win64-test/ws/modules/ca/src/template/O.windows-x64'>
make[4]: Leaving directory '<https://jenkins.aps.anl.gov/job/epics-base-7.0-win64-test/ws/modules/ca/src/template'>
make[3]: Leaving directory '<https://jenkins.aps.anl.gov/job/epics-base-7.0-win64-test/ws/modules/ca/src'>
make[2]: Leaving directory '<https://jenkins.aps.anl.gov/job/epics-base-7.0-win64-test/ws/modules/ca'>
make -C ./database test-results 
make[2]: Entering directory '<https://jenkins.aps.anl.gov/job/epics-base-7.0-win64-test/ws/modules/database'>
make -C ./configure test-results 
make[3]: Entering directory '<https://jenkins.aps.anl.gov/job/epics-base-7.0-win64-test/ws/modules/database/configure'>
make -C O.windows-x64 -f ../Makefile TOP=../.. \
    T_A=windows-x64 test-results
make[4]: Entering directory '<https://jenkins.aps.anl.gov/job/epics-base-7.0-win64-test/ws/modules/database/configure/O.windows-x64'>
make[4]: Nothing to be done for 'test-results'.
make[4]: Leaving directory '<https://jenkins.aps.anl.gov/job/epics-base-7.0-win64-test/ws/modules/database/configure/O.windows-x64'>
make[3]: Leaving directory '<https://jenkins.aps.anl.gov/job/epics-base-7.0-win64-test/ws/modules/database/configure'>
make -C ./src test-results 
make[3]: Entering directory '<https://jenkins.aps.anl.gov/job/epics-base-7.0-win64-test/ws/modules/database/src'>
make -C ./tools test-results 
make[4]: Entering directory '<https://jenkins.aps.anl.gov/job/epics-base-7.0-win64-test/ws/modules/database/src/tools'>
make -C O.windows-x64 -f ../Makefile TOP=../../.. \
    T_A=windows-x64 test-results
make[5]: Entering directory '<https://jenkins.aps.anl.gov/job/epics-base-7.0-win64-test/ws/modules/database/src/tools/O.windows-x64'>
make[5]: Nothing to be done for 'test-results'.
make[5]: Leaving directory '<https://jenkins.aps.anl.gov/job/epics-base-7.0-win64-test/ws/modules/database/src/tools/O.windows-x64'>
make[4]: Leaving directory '<https://jenkins.aps.anl.gov/job/epics-base-7.0-win64-test/ws/modules/database/src/tools'>
make -C ./ioc test-results 
make[4]: Entering directory '<https://jenkins.aps.anl.gov/job/epics-base-7.0-win64-test/ws/modules/database/src/ioc'>
make -C O.windows-x64 -f ../Makefile TOP=../../.. \
    T_A=windows-x64 test-results
make[5]: Entering directory '<https://jenkins.aps.anl.gov/job/epics-base-7.0-win64-test/ws/modules/database/src/ioc/O.windows-x64'>
make[5]: Nothing to be done for 'test-results'.
make[5]: Leaving directory '<https://jenkins.aps.anl.gov/job/epics-base-7.0-win64-test/ws/modules/database/src/ioc/O.windows-x64'>
make[4]: Leaving directory '<https://jenkins.aps.anl.gov/job/epics-base-7.0-win64-test/ws/modules/database/src/ioc'>
make -C ./std test-results 
make[4]: Entering directory '<https://jenkins.aps.anl.gov/job/epics-base-7.0-win64-test/ws/modules/database/src/std'>
make -C O.windows-x64 -f ../Makefile TOP=../../.. \
    T_A=windows-x64 test-results
make[5]: Entering directory '<https://jenkins.aps.anl.gov/job/epics-base-7.0-win64-test/ws/modules/database/src/std/O.windows-x64'>
make[5]: Nothing to be done for 'test-results'.
make[5]: Leaving directory '<https://jenkins.aps.anl.gov/job/epics-base-7.0-win64-test/ws/modules/database/src/std/O.windows-x64'>
make[4]: Leaving directory '<https://jenkins.aps.anl.gov/job/epics-base-7.0-win64-test/ws/modules/database/src/std'>
make -C ./template test-results 
make[4]: Entering directory '<https://jenkins.aps.anl.gov/job/epics-base-7.0-win64-test/ws/modules/database/src/template'>
make -C O.windows-x64 -f ../Makefile TOP=../../.. \
    T_A=windows-x64 test-results
make[5]: Entering directory '<https://jenkins.aps.anl.gov/job/epics-base-7.0-win64-test/ws/modules/database/src/template/O.windows-x64'>
make[5]: Nothing to be done for 'test-results'.
make[5]: Leaving directory '<https://jenkins.aps.anl.gov/job/epics-base-7.0-win64-test/ws/modules/database/src/template/O.windows-x64'>
make[4]: Leaving directory '<https://jenkins.aps.anl.gov/job/epics-base-7.0-win64-test/ws/modules/database/src/template'>
make[3]: Leaving directory '<https://jenkins.aps.anl.gov/job/epics-base-7.0-win64-test/ws/modules/database/src'>
make -C ./test test-results 
make[3]: Entering directory '<https://jenkins.aps.anl.gov/job/epics-base-7.0-win64-test/ws/modules/database/test'>
make -C ioc/db test-results 
make[4]: Entering directory '<https://jenkins.aps.anl.gov/job/epics-base-7.0-win64-test/ws/modules/database/test/ioc/db'>
make -C O.windows-x64 -f ../Makefile TOP=../../../.. \
    T_A=windows-x64 test-results
make[5]: Entering directory '<https://jenkins.aps.anl.gov/job/epics-base-7.0-win64-test/ws/modules/database/test/ioc/db/O.windows-x64'>
prove --failures --ext .tap --exec "perl -CSD -MExtUtils::Command -e cat" --color dbScanTest.tap dbShutdownTest.tap dbPutLinkTest.tap dbLockTest.tap dbStressTest.tap testdbConvert.tap callbackTest.tap callbackParallelTest.tap dbStateTest.tap dbServerTest.tap dbCaStatsTest.tap dbCaLinkTest.tap scanIoTest.tap dbChannelTest.tap dbChArrTest.tap chfPluginTest.tap arrShorthandTest.tap recGblCheckDeadbandTest.tap testPutGetTest.tap dbStaticTest.tap
dbScanTest.tap ............... ok
dbShutdownTest.tap ........... ok
dbPutLinkTest.tap ............ ok
dbLockTest.tap ............... ok
dbStressTest.tap ............. ok
testdbConvert.tap ............ ok
callbackTest.tap ............. ok
callbackParallelTest.tap ..... ok
dbStateTest.tap .............. ok
dbServerTest.tap ............. ok
dbCaStatsTest.tap ............ ok
dbCaLinkTest.tap ............. ok
scanIoTest.tap ............... ok
dbChannelTest.tap ............ ok
dbChArrTest.tap .............. ok
chfPluginTest.tap ............ ok
arrShorthandTest.tap ......... ok
recGblCheckDeadbandTest.tap .. ok
testPutGetTest.tap ........... ok
dbStaticTest.tap ............. ok
All tests successful.
Files=20, Tests=2870,  3 wallclock secs ( 0.56 usr +  0.36 sys =  0.92 CPU)
Result: PASS
make[5]: Leaving directory '<https://jenkins.aps.anl.gov/job/epics-base-7.0-win64-test/ws/modules/database/test/ioc/db/O.windows-x64'>
make[4]: Leaving directory '<https://jenkins.aps.anl.gov/job/epics-base-7.0-win64-test/ws/modules/database/test/ioc/db'>
make -C ioc/dbtemplate test-results 
make[4]: Entering directory '<https://jenkins.aps.anl.gov/job/epics-base-7.0-win64-test/ws/modules/database/test/ioc/dbtemplate'>
make -C O.windows-x64 -f ../Makefile TOP=../../../.. \
    T_A=windows-x64 test-results
make[5]: Entering directory '<https://jenkins.aps.anl.gov/job/epics-base-7.0-win64-test/ws/modules/database/test/ioc/dbtemplate/O.windows-x64'>
prove --failures --ext .tap --exec "perl -CSD -MExtUtils::Command -e cat" --color msi.tap
msi.tap .. ok
All tests successful.
Files=1, Tests=9,  0 wallclock secs ( 0.06 usr +  0.03 sys =  0.09 CPU)
Result: PASS
make[5]: Leaving directory '<https://jenkins.aps.anl.gov/job/epics-base-7.0-win64-test/ws/modules/database/test/ioc/dbtemplate/O.windows-x64'>
make[4]: Leaving directory '<https://jenkins.aps.anl.gov/job/epics-base-7.0-win64-test/ws/modules/database/test/ioc/dbtemplate'>
make -C std/rec test-results 
make[4]: Entering directory '<https://jenkins.aps.anl.gov/job/epics-base-7.0-win64-test/ws/modules/database/test/std/rec'>
make -C O.windows-x64 -f ../Makefile TOP=../../../.. \
    T_A=windows-x64 test-results
make[5]: Entering directory '<https://jenkins.aps.anl.gov/job/epics-base-7.0-win64-test/ws/modules/database/test/std/rec/O.windows-x64'>
prove --failures --ext .tap --exec "perl -CSD -MExtUtils::Command -e cat" --color arrayOpTest.tap recMiscTest.tap linkRetargetLinkTest.tap linkInitTest.tap compressTest.tap asyncSoftTest.tap softTest.tap asTest.tap analogMonitorTest.tap scanEventTest.tap regressTest.tap simmTest.tap mbbioDirectTest.tap asyncproctest.tap netget.tap
arrayOpTest.tap ........... ok
recMiscTest.tap ........... ok
linkRetargetLinkTest.tap .. ok
linkInitTest.tap .......... ok
compressTest.tap .......... ok
asyncSoftTest.tap ......... ok
softTest.tap .............. ok
asTest.tap ................ ok
analogMonitorTest.tap ..... ok
scanEventTest.tap ......... ok
regressTest.tap ........... ok
simmTest.tap .............. 
not ok 868 - dbGetField("stringin.PACT", 4) -> 1 == 0
not ok 870 - time stamp taken from second pass processing
Failed 2/1176 subtests 
mbbioDirectTest.tap ....... ok
asyncproctest.tap ......... ok
Bailout called.  Further testing stopped:  No BaseVersion record found
FAILED--Further testing stopped: No BaseVersion record found
make[5]: *** [<https://jenkins.aps.anl.gov/job/epics-base-7.0-win64-test/ws/configure/RULES_BUILD>:367: test-results] Error 1
make[5]: Leaving directory '<https://jenkins.aps.anl.gov/job/epics-base-7.0-win64-test/ws/modules/database/test/std/rec/O.windows-x64'>
make[4]: *** [<https://jenkins.aps.anl.gov/job/epics-base-7.0-win64-test/ws/configure/RULES_ARCHS>:58: test-results.windows-x64] Error 2
make[4]: Leaving directory '<https://jenkins.aps.anl.gov/job/epics-base-7.0-win64-test/ws/modules/database/test/std/rec'>
make[3]: *** [<https://jenkins.aps.anl.gov/job/epics-base-7.0-win64-test/ws/configure/RULES_DIRS>:84: std/rec.test-results] Error 2
make[3]: Leaving directory '<https://jenkins.aps.anl.gov/job/epics-base-7.0-win64-test/ws/modules/database/test'>
make[2]: *** [<https://jenkins.aps.anl.gov/job/epics-base-7.0-win64-test/ws/configure/RULES_DIRS>:84: test.test-results] Error 2
make[2]: Leaving directory '<https://jenkins.aps.anl.gov/job/epics-base-7.0-win64-test/ws/modules/database'>
make[1]: *** [../configure/RULES_DIRS:84: database.test-results] Error 2
make[1]: Leaving directory '<https://jenkins.aps.anl.gov/job/epics-base-7.0-win64-test/ws/modules'>
make: *** [configure/RULES_DIRS:84: modules.test-results] Error 2

C:\jenkins\win64-2\workspace\epics-base-7.0-win64>exit 2 
Build step 'Execute Windows batch command' marked build as failure

Replies:
Build failed in Jenkins: epics-base-7.0-win64-test #4 APS Jenkins via Core-talk

Navigate by Date:
Prev: Jenkins build is back to stable : epics-7.0 » linux32 #97 APS Jenkins via Core-talk
Next: Build failed in Jenkins: epics-base-7.0-win64s-test #4 APS Jenkins via Core-talk
Index: 2002  2003  2004  2005  2006  2007  2008  2009  2010  2011  2012  2013  2014  2015  2016  2017  2018  <20192020 
Navigate by Thread:
Prev: Build failed in Jenkins: epics-7.0 » linux64 #99 APS Jenkins via Core-talk
Next: Build failed in Jenkins: epics-base-7.0-win64-test #4 APS Jenkins via Core-talk
Index: 2002  2003  2004  2005  2006  2007  2008  2009  2010  2011  2012  2013  2014  2015  2016  2017  2018  <20192020 
ANJ, 11 Mar 2019 Valid HTML 4.01! · Home · News · About · Base · Modules · Extensions · Distributions · Download ·
· Search · EPICS V4 · IRMIS · Talk · Bugs · Documents · Links · Licensing ·