Argonne National Laboratory

Experimental Physics and
Industrial Control System

1994  1995  1996  1997  1998  1999  2000  2001  2002  2003  2004  2005  2006  2007  2008  2009  2010  2011  2012  <20132014  2015  2016  2017  2018  2019  Index 1994  1995  1996  1997  1998  1999  2000  2001  2002  2003  2004  2005  2006  2007  2008  2009  2010  2011  2012  <20132014  2015  2016  2017  2018  2019 
<== Date ==> <== Thread ==>

Subject: Re: Error associated to building asyn4-21
From: James Ross <james.falconer.ross@gmail.com>
To: "L. C. De Silva" <desilva@rcf.rhic.bnl.gov>
Cc: "tech-talk@aps.anl.gov" <tech-talk@aps.anl.gov>
Date: Wed, 11 Dec 2013 12:15:08 -0800
As a first step, make sure whatever configuration file there is has the correct paths in it. It's been a bit since I last installed asyn, but that is always my first step when dealing with epics and it's various parts.
James

Sent from my iPhone

> On Dec 11, 2013, at 12:04 PM, "L. C. De Silva" <desilva@rcf.rhic.bnl.gov> wrote:
> 
> Dear all,
> 
> I get the following error message during the process of building asyn4-21 on my linux 32-bit machine. 
> 
> ==================================================================================================================
> make[3]: Entering directory `/home/sysuser/epics.3.14.12.1/soft/modules/asyn4-21/testApp/src/O.linux-x86'
> echo "../O.Common/test.dbd : ../Makefile" >> test.dbd.d
> Expanding dbd
> /home/sysuser/epics/base-3.14.12.3/bin/linux-x86/dbExpand  -I. -I.. -I../O.Common -I../../../dbd -I/home/sysuser/epics/soft/modules/seq-2.1.15/dbd -I/home/sysuser/epics/base-3.14.12.3/dbd -o test.dbd ../testInclude.dbd
> Can't open include file "asyn.dbd"
> Error at or before ""asyn.dbd"" in file "../testInclude.dbd" line 2
> Can't open include file "drvAsynSerialPort.dbd"
> Error at or before ""drvAsynSerialPort.dbd"" in file "../testInclude.dbd" line 4
> Can't open include file "drvAsynIPPort.dbd"
> Error at or before ""drvAsynIPPort.dbd"" in file "../testInclude.dbd" line 5
> dbExpand: Input errors, no output generated
> make[3]: *** [../O.Common/test.dbd] Error 1
> make[3]: Leaving directory `/home/sysuser/epics.3.14.12.1/soft/modules/asyn4-21/testApp/src/O.linux-x86'
> make[2]: *** [install.linux-x86] Error 2
> make[2]: Leaving directory `/home/sysuser/epics.3.14.12.1/soft/modules/asyn4-21/testApp/src'
> make[1]: *** [src.install] Error 2
> make[1]: Leaving directory `/home/sysuser/epics.3.14.12.1/soft/modules/asyn4-21/testApp'
> make: *** [testApp.install] Error 2
> ===================================================================================================================
> 
> Any suggestions to fix this issue?
> 
> Thanks, Chanaka.
> 
> 


References:
Error associated to building asyn4-21 L. C. De Silva

Navigate by Date:
Prev: Error associated to building asyn4-21 L. C. De Silva
Next: Re: Error associated to building asyn4-21 Eric Norum
Index: 1994  1995  1996  1997  1998  1999  2000  2001  2002  2003  2004  2005  2006  2007  2008  2009  2010  2011  2012  <20132014  2015  2016  2017  2018  2019 
Navigate by Thread:
Prev: Error associated to building asyn4-21 L. C. De Silva
Next: Re: Error associated to building asyn4-21 Eric Norum
Index: 1994  1995  1996  1997  1998  1999  2000  2001  2002  2003  2004  2005  2006  2007  2008  2009  2010  2011  2012  <20132014  2015  2016  2017  2018  2019 
ANJ, 20 Apr 2015 Valid HTML 4.01! · Home · News · About · Base · Modules · Extensions · Distributions · Download ·
· Search · EPICS V4 · IRMIS · Talk · Bugs · Documents · Links · Licensing ·