Argonne National Laboratory

Experimental Physics and
Industrial Control System

1994  1995  1996  1997  1998  1999  2000  2001  2002  2003  2004  2005  2006  2007  2008  2009  2010  2011  2012  2013  2014  2015  2016  2017  <20182019  Index 1994  1995  1996  1997  1998  1999  2000  2001  2002  2003  2004  2005  2006  2007  2008  2009  2010  2011  2012  2013  2014  2015  2016  2017  <20182019 
<== Date ==> <== Thread ==>

Subject: asyn4.33 compilation error on windows-64
From: "Vishnu Patel" <vishnu.patel@rediffmail.com>
To: "techtalk" <tech-talk@aps.anl.gov>
Date: 19 Apr 2018 04:51:26 -0000
Hi,
  With EPICS base-7.0.1.1 and seq-2.2.5, i am getting compilation error. 


make -C ./src install
make[2]: Entering directory 'c:/epics/support/asyn4-33/testIPServerApp/src'
perl -CSD c:/epics/base-7.0.1.1/bin/windows-x64/makeMakefile.pl O.windows-x64 ../../..
perl -CSD -MExtUtils::Command -e mkpath O.Common
make -C O.windows-x64 -f ../Makefile TOP=../../.. \
    T_A=windows-x64 install
make[3]: Entering directory 'c:/epics/support/asyn4-33/testIPServerApp/src/O.windows-x64'
perl -CSD c:/epics/base-7.0.1.1/bin/windows-x64/mkmf.pl  -m asynPortTest.d -I. -I../O.Common -I. -I. -I.. -I../../../include/compiler/msvc -I../../../include/os/WIN32 -I../../../include       -I../../../../../base-7.0.1.1/include/compiler/msvc -I../../../../../base-7.0.1.1/include/os/WIN32 -I../../../../../base-7.0.1.1/include        asynPortTest.obj ../asynPortTest.cpp
perl -CSD c:/epics/base-7.0.1.1/bin/windows-x64/mkmf.pl  -m ipEchoServer2.d -I. -I../O.Common -I. -I. -I.. -I../../../include/compiler/msvc -I../../../include/os/WIN32 -I../../../include       -I../../../../../base-7.0.1.1/include/compiler/msvc -I../../../../../base-7.0.1.1/include/os/WIN32 -I../../../../../base-7.0.1.1/include        ipEchoServer2.obj ../ipEchoServer2.c
perl -CSD c:/epics/base-7.0.1.1/bin/windows-x64/mkmf.pl  -m ipEchoServer.d -I. -I../O.Common -I. -I. -I.. -I../../../include/compiler/msvc -I../../../include/os/WIN32 -I../../../include       -I../../../../../base-7.0.1.1/include/compiler/msvc -I../../../../../base-7.0.1.1/include/os/WIN32 -I../../../../../base-7.0.1.1/include        ipEchoServer.obj ../ipEchoServer.c
perl -CSD c:/epics/base-7.0.1.1/bin/windows-x64/mkmf.pl  -m testIPServerMain.d -I. -I../O.Common -I. -I. -I.. -I../../../include/compiler/msvc -I../../../include/os/WIN32 -I../../../include       -I../../../../../base-7.0.1.1/include/compiler/msvc -I../../../../../base-7.0.1.1/include/os/WIN32 -I../../../../../base-7.0.1.1/include        testIPServerMain.obj ../testIPServerMain.cpp
"Expanding dbd file ../testIPServerInclude.dbd"
perl -CSD ../../../../../base-7.0.1.1/bin/windows-x64/dbdExpand.pl   -I. -I.. -I../O.Common -I../../../dbd -I../../../../../base-7.0.1.1/dbd -o testIPServer.dbd ../testIPServerInclude.dbd
perl -CSD ../../../../../base-7.0.1.1/bin/windows-x64/registerRecordDeviceDriver.pl   -I. -I.. -I../O.Common -I../../../dbd -I../../../../../base-7.0.1.1/dbd    -o testIPServer_registerRecordDeviceDriver.cpp ../O.Common/testIPServer.dbd testIPServer_registerRecordDeviceDriver C:/epics/support/asyn4-33
perl -CSD c:/epics/base-7.0.1.1/bin/windows-x64/mkmf.pl  -m testIPServer_registerRecordDeviceDriver.d -I. -I../O.Common -I. -I. -I.. -I../../../include/compiler/msvc -I../../../include/os/WIN32 -I../../../include       -I../../../../../base-7.0.1.1/include/compiler/msvc -I../../../../../base-7.0.1.1/include/os/WIN32 -I../../../../../base-7.0.1.1/include        testIPServer_registerRecordDeviceDriver.obj testIPServer_registerRecordDeviceDriver.cpp
"Installing created dbd file ../../../dbd/testIPServer.dbd"
cl               -nologo -D__STDC__=0 -D_CRT_SECURE_NO_DEPRECATE -D_CRT_NONSTDC_NO_DEPRECATE   -Ox -GL -Oy-   -W3        -MD -DEPICS_BUILD_DLL -DEPICS_CALL_DLL   -I. -I../O.Common -I. -I. -I.. -I../../../include/compiler/msvc -I../../../include/os/WIN32 -I../../../include       -I../../../../../base-7.0.1.1/include/compiler/msvc -I../../../../../base-7.0.1.1/include/os/WIN32 -I../../../../../base-7.0.1.1/include        -c ../ipEchoServer.c
ipEchoServer.c
cl               -nologo -D__STDC__=0 -D_CRT_SECURE_NO_DEPRECATE -D_CRT_NONSTDC_NO_DEPRECATE   -Ox -GL -Oy-   -W3        -MD -DEPICS_BUILD_DLL -DEPICS_CALL_DLL   -I. -I../O.Common -I. -I. -I.. -I../../../include/compiler/msvc -I../../../include/os/WIN32 -I../../../include       -I../../../../../base-7.0.1.1/include/compiler/msvc -I../../../../../base-7.0.1.1/include/os/WIN32 -I../../../../../base-7.0.1.1/include        -c ../ipEchoServer2.c
ipEchoServer2.c
make[3]: *** No rule to make target 'ipSNCServer.obj', needed by 'testIPServerSupport.dll'.  Stop.
make[3]: Leaving directory 'c:/epics/support/asyn4-33/testIPServerApp/src/O.windows-x64'
make[2]: *** [../../../../base-7.0.1.1/configure/RULES_ARCHS:58: install.windows-x64] Error 2

make[2]: Leaving directory 'c:/epics/support/asyn4-33/testIPServerApp/src'
make[1]: *** [../../../base-7.0.1.1/configure/RULES_DIRS:84: src.install] Error 2
make[1]: Leaving directory 'c:/epics/support/asyn4-33/testIPServerApp'
make: *** [../../base-7.0.1.1/configure/RULES_DIRS:84: testIPServerApp.install] Error 2
make: Leaving directory 'c:/epics/support/asyn4-33'


Thanks
Vishnu

Replies:
Re: asyn4.33 compilation error on windows-64 Mark Rivers

Navigate by Date:
Prev: RE: Possible deadlock issue with asyn layer? Mark Rivers
Next: Question about data browser of CSS. lzf neu
Index: 1994  1995  1996  1997  1998  1999  2000  2001  2002  2003  2004  2005  2006  2007  2008  2009  2010  2011  2012  2013  2014  2015  2016  2017  <20182019 
Navigate by Thread:
Prev: RE: CSS xy graph question Mark Rivers
Next: Re: asyn4.33 compilation error on windows-64 Mark Rivers
Index: 1994  1995  1996  1997  1998  1999  2000  2001  2002  2003  2004  2005  2006  2007  2008  2009  2010  2011  2012  2013  2014  2015  2016  2017  <20182019 
ANJ, 19 Apr 2018 Valid HTML 4.01! · Home · News · About · Base · Modules · Extensions · Distributions · Download ·
· Search · EPICS V4 · IRMIS · Talk · Bugs · Documents · Links · Licensing ·