Argonne National Laboratory

Experimental Physics and
Industrial Control System

2002  2003  2004  2005  2006  2007  2008  2009  2010  2011  2012  2013  2014  2015  2016  2017  2018  <20192020  Index 2002  2003  2004  2005  2006  2007  2008  2009  2010  2011  2012  2013  2014  2015  2016  2017  2018  <20192020 
<== Date ==> <== Thread ==>

Subject: Build failed in Jenkins: epics-7.0-windows » STATIC,win64-2 #99
From: APS Jenkins via Core-talk <core-talk@aps.anl.gov>
To: core-talk@aps.anl.gov
Date: Mon, 11 Mar 2019 22:01:23 -0500 (CDT)
See <https://jenkins.aps.anl.gov/job/epics-7.0-windows/LIBRARIES=STATIC,OS=win64-2/99/display/redirect>

------------------------------------------
Started by upstream project "epics-7.0-windows" build number 99
originally caused by:
 Started by an SCM change
 Started by an SCM change
[EnvInject] - Loading node environment variables.
Building remotely on win64-2 (windows-x64) in workspace <https://jenkins.aps.anl.gov/job/epics-7.0-windows/LIBRARIES=STATIC,OS=win64-2/ws/>
No credentials specified
 > C:/Program Files/Git/cmd/git.exe rev-parse --is-inside-work-tree # timeout=10
Fetching changes from the remote Git repository
 > C:/Program Files/Git/cmd/git.exe config remote.origin.url https://git.launchpad.net/epics-base/ # timeout=10
Fetching upstream changes from https://git.launchpad.net/epics-base/
 > C:/Program Files/Git/cmd/git.exe --version # timeout=10
Setting http proxy: webproxy1.anl.gov:9091
 > C:/Program Files/Git/cmd/git.exe fetch --no-tags --force --progress https://git.launchpad.net/epics-base/ +refs/heads/7.0:refs/remotes/origin/7.0 --depth=1
Checking out Revision d1149a0ba90096b3aa2890029ed9a430216d96ec (refs/remotes/origin/7.0)
 > C:/Program Files/Git/cmd/git.exe config core.sparsecheckout # timeout=10
 > C:/Program Files/Git/cmd/git.exe checkout -f d1149a0ba90096b3aa2890029ed9a430216d96ec
FATAL: Could not checkout d1149a0ba90096b3aa2890029ed9a430216d96ec
hudson.plugins.git.GitException: Command "C:/Program Files/Git/cmd/git.exe checkout -f d1149a0ba90096b3aa2890029ed9a430216d96ec" returned status code 128:
stdout: 
stderr: fatal: reference is not a tree: d1149a0ba90096b3aa2890029ed9a430216d96ec

	at org.jenkinsci.plugins.gitclient.CliGitAPIImpl.launchCommandIn(CliGitAPIImpl.java:2042)
	at org.jenkinsci.plugins.gitclient.CliGitAPIImpl.access$900(CliGitAPIImpl.java:72)
	at org.jenkinsci.plugins.gitclient.CliGitAPIImpl$9.execute(CliGitAPIImpl.java:2341)
Also:   hudson.remoting.Channel$CallSiteStackTrace: Remote call to win64-2
		at hudson.remoting.Channel.attachCallSiteStackTrace(Channel.java:1741)
		at hudson.remoting.UserRequest$ExceptionResponse.retrieve(UserRequest.java:357)
		at hudson.remoting.Channel.call(Channel.java:955)
		at org.jenkinsci.plugins.gitclient.RemoteGitImpl$CommandInvocationHandler.execute(RemoteGitImpl.java:146)
		at sun.reflect.GeneratedMethodAccessor1426.invoke(Unknown Source)
		at sun.reflect.DelegatingMethodAccessorImpl.invoke(DelegatingMethodAccessorImpl.java:43)
		at java.lang.reflect.Method.invoke(Method.java:498)
		at org.jenkinsci.plugins.gitclient.RemoteGitImpl$CommandInvocationHandler.invoke(RemoteGitImpl.java:132)
		at com.sun.proxy.$Proxy120.execute(Unknown Source)
		at hudson.plugins.git.GitSCM.checkout(GitSCM.java:1242)
		at hudson.scm.SCM.checkout(SCM.java:504)
		at hudson.model.AbstractProject.checkout(AbstractProject.java:1208)
		at hudson.model.AbstractBuild$AbstractBuildExecution.defaultCheckout(AbstractBuild.java:574)
		at jenkins.scm.SCMCheckoutStrategy.checkout(SCMCheckoutStrategy.java:86)
		at hudson.model.AbstractBuild$AbstractBuildExecution.run(AbstractBuild.java:499)
		at hudson.model.Run.execute(Run.java:1810)
		at hudson.matrix.MatrixRun.run(MatrixRun.java:153)
		at hudson.model.ResourceController.execute(ResourceController.java:97)
		at hudson.model.Executor.run(Executor.java:429)
Caused: hudson.plugins.git.GitException: Could not checkout d1149a0ba90096b3aa2890029ed9a430216d96ec
	at org.jenkinsci.plugins.gitclient.CliGitAPIImpl$9.execute(CliGitAPIImpl.java:2365)
	at org.jenkinsci.plugins.gitclient.RemoteGitImpl$CommandInvocationHandler$1.call(RemoteGitImpl.java:153)
	at org.jenkinsci.plugins.gitclient.RemoteGitImpl$CommandInvocationHandler$1.call(RemoteGitImpl.java:146)
	at hudson.remoting.UserRequest.perform(UserRequest.java:212)
	at hudson.remoting.UserRequest.perform(UserRequest.java:54)
	at hudson.remoting.Request$2.run(Request.java:369)
	at hudson.remoting.InterceptingExecutorService$1.call(InterceptingExecutorService.java:72)
	at java.util.concurrent.FutureTask.run(Unknown Source)
	at java.util.concurrent.ThreadPoolExecutor.runWorker(Unknown Source)
	at java.util.concurrent.ThreadPoolExecutor$Worker.run(Unknown Source)
	at java.lang.Thread.run(Unknown Source)
[WARNINGS] Skipping publisher since build result is FAILURE

References:
Build failed in Jenkins: epics-7.0-windows » STATIC,win64-2 #98 APS Jenkins via Core-talk

Navigate by Date:
Prev: Build failed in Jenkins: epics-base-7.0-win64s-test #6 APS Jenkins via Core-talk
Next: Build failed in Jenkins: epics-7.0-windows » DLL,win32-2 #100 APS Jenkins via Core-talk
Index: 2002  2003  2004  2005  2006  2007  2008  2009  2010  2011  2012  2013  2014  2015  2016  2017  2018  <20192020 
Navigate by Thread:
Prev: Build failed in Jenkins: epics-7.0-windows » STATIC,win64-2 #98 APS Jenkins via Core-talk
Next: Build failed in Jenkins: epics-7.0 » linux32 #99 APS Jenkins via Core-talk
Index: 2002  2003  2004  2005  2006  2007  2008  2009  2010  2011  2012  2013  2014  2015  2016  2017  2018  <20192020 
ANJ, 11 Mar 2019 Valid HTML 4.01! · Home · News · About · Base · Modules · Extensions · Distributions · Download ·
· Search · EPICS V4 · IRMIS · Talk · Bugs · Documents · Links · Licensing ·