Argonne National Laboratory

Experimental Physics and
Industrial Control System

1994  1995  1996  1997  1998  1999  2000  2001  2002  2003  2004  2005  2006  <20072008  2009  2010  2011  2012  2013  2014  2015  2016  2017  2018  2019  2020  Index 1994  1995  1996  1997  1998  1999  2000  2001  2002  2003  2004  2005  2006  <20072008  2009  2010  2011  2012  2013  2014  2015  2016  2017  2018  2019  2020 
<== Date ==> <== Thread ==>

Subject: Building asyn4-7 with epics-3.14.8 under win32-x86-cygwin
From: "White, Glen Russell" <whitegr@slac.stanford.edu>
To: <tech-talk@aps.anl.gov>
Date: Mon, 16 Apr 2007 11:28:35 -0700
Hi,

I am having trouble build asyn for the win32-x86-cygwin architecture.

I have built epics base (V 3.14.8) successfully, but I get the below error when trying to build asyn (v. 4-7) which I don't know how to interpret. Can anyone point me at a possible problem here?

Incidentally, I got the same combination to build ok under linux.

Many thanks,

Glen White.


make -C O.win32-x86-cygwin -f ../Makefile TOP=../.. T_A=win32-x86-cygwin install
make[2]: Entering directory `/cygdrive/c/epics-3.14.8/support/asyn4-7/asyn/O.win32-x86-cygwin'
make[2]: Leaving directory `/cygdrive/c/epics-3.14.8/support/asyn4-7/asyn/O.win32-x86-cygwin'
make[2]: Entering directory `/cygdrive/c/epics-3.14.8/support/asyn4-7/asyn/O.win32-x86-cygwin'
/cygdrive/c/epics-3.14.8/base/bin/win32-x86-cygwin/dbToRecordtypeH.exe  -I . -I .. -I ../../dbd -I /cygdrive/c/epics-3.14.8/base/dbd  ../../asyn/asynRecord/asynRecord.dbd ../O.Common/asynRecord.h
Error   Last token ""dbCommon.dbd""
input line:     include "dbCommon.dbd" 
   in: file ../../asyn/asynRecord/asynRecord.dbd line 107

db_parse returned -1
Terminal error For input file ../../asyn/asynRecord/asynRecord.dbd
make[2]: *** [../O.Common/asynRecord.h] Error 255
make[2]: Leaving directory `/cygdrive/c/epics-3.14.8/support/asyn4-7/asyn/O.win32-x86-cygwin'
make[1]: *** [install.win32-x86-cygwin] Error 2
make[1]: Leaving directory `/cygdrive/c/epics-3.14.8/support/asyn4-7/asyn'
make: *** [asyn.install] Error 2


Replies:
Re: Building asyn4-7 with epics-3.14.8 under win32-x86-cygwin Andrew Johnson

Navigate by Date:
Prev: Re: epics compiling problem Kate Feng
Next: Re: Building asyn4-7 with epics-3.14.8 under win32-x86-cygwin Andrew Johnson
Index: 1994  1995  1996  1997  1998  1999  2000  2001  2002  2003  2004  2005  2006  <20072008  2009  2010  2011  2012  2013  2014  2015  2016  2017  2018  2019  2020 
Navigate by Thread:
Prev: Re: Motor Record - OMS58 Driver Ralph Lange
Next: Re: Building asyn4-7 with epics-3.14.8 under win32-x86-cygwin Andrew Johnson
Index: 1994  1995  1996  1997  1998  1999  2000  2001  2002  2003  2004  2005  2006  <20072008  2009  2010  2011  2012  2013  2014  2015  2016  2017  2018  2019  2020 
ANJ, 10 Nov 2011 Valid HTML 4.01! · Home · News · About · Base · Modules · Extensions · Distributions · Download ·
· Search · EPICS V4 · IRMIS · Talk · Bugs · Documents · Links · Licensing ·